quicklisp 2015-06-08quicklisp 2015-07-10
abcl-1.2.1-fasl42-linux-x86cl-charms
(LOAD cl-charms FAIL) ffi-grovel, CFFI-GROVEL:GROVEL-ERROR : External process exited with code 1. Command was: "cc" "-m32" "-I/home/testgrid/cl-test-grid/work-dir/agent/quicklisp/dists/quicklisp/software/cffi_0.15.0/" "-o" "/home/testgrid/cl-test-grid/work-dir/agent/test-runs/20150720184329-abcl-1.2.1-fasl42-linux-x86/fasl/ql/dists/quicklisp/software/cl-charms-20150709-git/src/low-level/curses-grovel" "/home/testgrid/cl-test-grid/work-dir/agent/test-runs/20150720184329-abcl-1.2.1-fasl42-linux-x86/fasl/ql/dists/quicklisp/software/cl-charms-20150709-git/src/low-level/curses-grovel.c" Output was: /home/testgrid/cl-test-grid/work-dir/agent/test-runs/20150720184329-abcl-1.2.1-fasl42-linux-x86/fasl/ql/dists/quicklisp/software/cl-charms-20150709-git/src/low-level/curses-grovel.c:6:21: fatal error: ncurses.h: No such file or directory compilation terminated.
(LOAD cl-charms-paint FAIL) ffi-grovel, CFFI-GROVEL:GROVEL-ERROR : External process exited with code 1. Command was: "cc" "-m32" "-I/home/testgrid/cl-test-grid/work-dir/agent/quicklisp/dists/quicklisp/software/cffi_0.15.0/" "-o" "/home/testgrid/cl-test-grid/work-dir/agent/test-runs/20150720184329-abcl-1.2.1-fasl42-linux-x86/fasl/ql/dists/quicklisp/software/cl-charms-20150709-git/src/low-level/curses-grovel" "/home/testgrid/cl-test-grid/work-dir/agent/test-runs/20150720184329-abcl-1.2.1-fasl42-linux-x86/fasl/ql/dists/quicklisp/software/cl-charms-20150709-git/src/low-level/curses-grovel.c" Output was: /home/testgrid/cl-test-grid/work-dir/agent/test-runs/20150720184329-abcl-1.2.1-fasl42-linux-x86/fasl/ql/dists/quicklisp/software/cl-charms-20150709-git/src/low-level/curses-grovel.c:6:21: fatal error: ncurses.h: No such file or directory compilation terminated.
(LOAD cl-charms-timer FAIL) ffi-grovel, CFFI-GROVEL:GROVEL-ERROR : External process exited with code 1. Command was: "cc" "-m32" "-I/home/testgrid/cl-test-grid/work-dir/agent/quicklisp/dists/quicklisp/software/cffi_0.15.0/" "-o" "/home/testgrid/cl-test-grid/work-dir/agent/test-runs/20150720184329-abcl-1.2.1-fasl42-linux-x86/fasl/ql/dists/quicklisp/software/cl-charms-20150709-git/src/low-level/curses-grovel" "/home/testgrid/cl-test-grid/work-dir/agent/test-runs/20150720184329-abcl-1.2.1-fasl42-linux-x86/fasl/ql/dists/quicklisp/software/cl-charms-20150709-git/src/low-level/curses-grovel.c" Output was: /home/testgrid/cl-test-grid/work-dir/agent/test-runs/20150720184329-abcl-1.2.1-fasl42-linux-x86/fasl/ql/dists/quicklisp/software/cl-charms-20150709-git/src/low-level/curses-grovel.c:6:21: fatal error: ncurses.h: No such file or directory compilation terminated.
cl-rrt
croatoan
(LOAD croatoan FAIL) COMMON-LISP:ERROR : SB-GRAY is not the name of a package.
lucerne
(LOAD lucerne-utweet FAIL) COMMON-LISP:ERROR : Compiled function can't be loaded: org.armedbear.lisp.sqlite_ffi_TMP_1 from org.armedbear.lisp.Pathname@1e4c464
pp-toml
(LOAD pp-toml FAIL) COMMON-LISP:SIMPLE-ERROR : The method-lambda-list (A B &REST KEYS &KEY FLOATING-COMPARE (MAX-RELATIVE-DIFF 1.19E-7)) does not accept all of the keyword arguments defined for the generic function.
(LOAD pp-toml-tests FAIL) COMMON-LISP:SIMPLE-ERROR : The method-lambda-list (A B &REST KEYS &KEY FLOATING-COMPARE (MAX-RELATIVE-DIFF 1.19E-7)) does not accept all of the keyword arguments defined for the generic function.
staple
(LOAD staple FAIL) COMMON-LISP:READER-ERROR : The symbol "ENOUGH-PATHNAME" was not found in package UIOP.
(LOAD staple-server FAIL) COMMON-LISP:READER-ERROR : The symbol "ENOUGH-PATHNAME" was not found in package UIOP.
abcl-1.3.0-fasl42-linux-x86bordeaux-threads
cl-charms
(LOAD cl-charms FAIL) ffi-grovel, CFFI-GROVEL:GROVEL-ERROR : External process exited with code 1. Command was: "cc" "-m32" "-I/home/testgrid/cl-test-grid/work-dir/agent/quicklisp/dists/quicklisp/software/cffi_0.15.0/" "-o" "/home/testgrid/cl-test-grid/work-dir/agent/test-runs/20150720044117-abcl-1.3.0-fasl42-linux-x86/fasl/ql/dists/quicklisp/software/cl-charms-20150709-git/src/low-level/curses-grovel" "/home/testgrid/cl-test-grid/work-dir/agent/test-runs/20150720044117-abcl-1.3.0-fasl42-linux-x86/fasl/ql/dists/quicklisp/software/cl-charms-20150709-git/src/low-level/curses-grovel.c" Output was: /home/testgrid/cl-test-grid/work-dir/agent/test-runs/20150720044117-abcl-1.3.0-fasl42-linux-x86/fasl/ql/dists/quicklisp/software/cl-charms-20150709-git/src/low-level/curses-grovel.c:6:21: fatal error: ncurses.h: No such file or directory compilation terminated.
(LOAD cl-charms-paint FAIL) ffi-grovel, CFFI-GROVEL:GROVEL-ERROR : External process exited with code 1. Command was: "cc" "-m32" "-I/home/testgrid/cl-test-grid/work-dir/agent/quicklisp/dists/quicklisp/software/cffi_0.15.0/" "-o" "/home/testgrid/cl-test-grid/work-dir/agent/test-runs/20150720044117-abcl-1.3.0-fasl42-linux-x86/fasl/ql/dists/quicklisp/software/cl-charms-20150709-git/src/low-level/curses-grovel" "/home/testgrid/cl-test-grid/work-dir/agent/test-runs/20150720044117-abcl-1.3.0-fasl42-linux-x86/fasl/ql/dists/quicklisp/software/cl-charms-20150709-git/src/low-level/curses-grovel.c" Output was: /home/testgrid/cl-test-grid/work-dir/agent/test-runs/20150720044117-abcl-1.3.0-fasl42-linux-x86/fasl/ql/dists/quicklisp/software/cl-charms-20150709-git/src/low-level/curses-grovel.c:6:21: fatal error: ncurses.h: No such file or directory compilation terminated.
(LOAD cl-charms-timer FAIL) ffi-grovel, CFFI-GROVEL:GROVEL-ERROR : External process exited with code 1. Command was: "cc" "-m32" "-I/home/testgrid/cl-test-grid/work-dir/agent/quicklisp/dists/quicklisp/software/cffi_0.15.0/" "-o" "/home/testgrid/cl-test-grid/work-dir/agent/test-runs/20150720044117-abcl-1.3.0-fasl42-linux-x86/fasl/ql/dists/quicklisp/software/cl-charms-20150709-git/src/low-level/curses-grovel" "/home/testgrid/cl-test-grid/work-dir/agent/test-runs/20150720044117-abcl-1.3.0-fasl42-linux-x86/fasl/ql/dists/quicklisp/software/cl-charms-20150709-git/src/low-level/curses-grovel.c" Output was: /home/testgrid/cl-test-grid/work-dir/agent/test-runs/20150720044117-abcl-1.3.0-fasl42-linux-x86/fasl/ql/dists/quicklisp/software/cl-charms-20150709-git/src/low-level/curses-grovel.c:6:21: fatal error: ncurses.h: No such file or directory compilation terminated.
croatoan
(LOAD croatoan FAIL) COMMON-LISP:ERROR : SB-GRAY is not the name of a package.
pp-toml
(LOAD pp-toml FAIL) COMMON-LISP:SIMPLE-ERROR : The method-lambda-list (A B &REST KEYS &KEY FLOATING-COMPARE (MAX-RELATIVE-DIFF 1.19E-7)) does not accept all of the keyword arguments defined for the generic function.
(LOAD pp-toml-tests FAIL) COMMON-LISP:SIMPLE-ERROR : The method-lambda-list (A B &REST KEYS &KEY FLOATING-COMPARE (MAX-RELATIVE-DIFF 1.19E-7)) does not accept all of the keyword arguments defined for the generic function.
abcl-1.3.1-fasl42-linux-x86cl-charms
(LOAD cl-charms FAIL) ffi-grovel, CFFI-GROVEL:GROVEL-ERROR : External process exited with code 1. Command was: "cc" "-m32" "-I/home/testgrid/cl-test-grid/work-dir/agent/quicklisp/dists/quicklisp/software/cffi_0.15.0/" "-o" "/home/testgrid/cl-test-grid/work-dir/agent/test-runs/20150719114758-abcl-1.3.1-fasl42-linux-x86/fasl/ql/dists/quicklisp/software/cl-charms-20150709-git/src/low-level/curses-grovel" "/home/testgrid/cl-test-grid/work-dir/agent/test-runs/20150719114758-abcl-1.3.1-fasl42-linux-x86/fasl/ql/dists/quicklisp/software/cl-charms-20150709-git/src/low-level/curses-grovel.c" Output was: /home/testgrid/cl-test-grid/work-dir/agent/test-runs/20150719114758-abcl-1.3.1-fasl42-linux-x86/fasl/ql/dists/quicklisp/software/cl-charms-20150709-git/src/low-level/curses-grovel.c:6:21: fatal error: ncurses.h: No such file or directory compilation terminated.
(LOAD cl-charms-paint FAIL) ffi-grovel, CFFI-GROVEL:GROVEL-ERROR : External process exited with code 1. Command was: "cc" "-m32" "-I/home/testgrid/cl-test-grid/work-dir/agent/quicklisp/dists/quicklisp/software/cffi_0.15.0/" "-o" "/home/testgrid/cl-test-grid/work-dir/agent/test-runs/20150719114758-abcl-1.3.1-fasl42-linux-x86/fasl/ql/dists/quicklisp/software/cl-charms-20150709-git/src/low-level/curses-grovel" "/home/testgrid/cl-test-grid/work-dir/agent/test-runs/20150719114758-abcl-1.3.1-fasl42-linux-x86/fasl/ql/dists/quicklisp/software/cl-charms-20150709-git/src/low-level/curses-grovel.c" Output was: /home/testgrid/cl-test-grid/work-dir/agent/test-runs/20150719114758-abcl-1.3.1-fasl42-linux-x86/fasl/ql/dists/quicklisp/software/cl-charms-20150709-git/src/low-level/curses-grovel.c:6:21: fatal error: ncurses.h: No such file or directory compilation terminated.
(LOAD cl-charms-timer FAIL) ffi-grovel, CFFI-GROVEL:GROVEL-ERROR : External process exited with code 1. Command was: "cc" "-m32" "-I/home/testgrid/cl-test-grid/work-dir/agent/quicklisp/dists/quicklisp/software/cffi_0.15.0/" "-o" "/home/testgrid/cl-test-grid/work-dir/agent/test-runs/20150719114758-abcl-1.3.1-fasl42-linux-x86/fasl/ql/dists/quicklisp/software/cl-charms-20150709-git/src/low-level/curses-grovel" "/home/testgrid/cl-test-grid/work-dir/agent/test-runs/20150719114758-abcl-1.3.1-fasl42-linux-x86/fasl/ql/dists/quicklisp/software/cl-charms-20150709-git/src/low-level/curses-grovel.c" Output was: /home/testgrid/cl-test-grid/work-dir/agent/test-runs/20150719114758-abcl-1.3.1-fasl42-linux-x86/fasl/ql/dists/quicklisp/software/cl-charms-20150709-git/src/low-level/curses-grovel.c:6:21: fatal error: ncurses.h: No such file or directory compilation terminated.
cl-rrt
croatoan
(LOAD croatoan FAIL) COMMON-LISP:ERROR : SB-GRAY is not the name of a package.
lucerne
(LOAD lucerne-utweet FAIL) COMMON-LISP:ERROR : Compiled function can't be loaded: org.armedbear.lisp.sqlite_ffi_TMP_1 from org.armedbear.lisp.Pathname@12419c2
pp-toml
(LOAD pp-toml FAIL) COMMON-LISP:SIMPLE-ERROR : The method-lambda-list (A B &REST KEYS &KEY FLOATING-COMPARE (MAX-RELATIVE-DIFF 1.19E-7)) does not accept all of the keyword arguments defined for the generic function.
(LOAD pp-toml-tests FAIL) COMMON-LISP:SIMPLE-ERROR : The method-lambda-list (A B &REST KEYS &KEY FLOATING-COMPARE (MAX-RELATIVE-DIFF 1.19E-7)) does not accept all of the keyword arguments defined for the generic function.
abcl-1.3.2-fasl42-linux-x86cl-bloom
(LOAD cl-bloom FAIL) COMMON-LISP:STORAGE-CONDITION : Stack overflow.
cl-charms
(LOAD cl-charms FAIL) ffi-grovel, CFFI-GROVEL:GROVEL-ERROR : External process exited with code 1. Command was: "cc" "-m32" "-I/home/testgrid/cl-test-grid/work-dir/agent/quicklisp/dists/quicklisp/software/cffi_0.15.0/" "-o" "/home/testgrid/cl-test-grid/work-dir/agent/test-runs/20150717123801-abcl-1.3.2-fasl42-linux-x86/fasl/ql/dists/quicklisp/software/cl-charms-20150709-git/src/low-level/curses-grovel" "/home/testgrid/cl-test-grid/work-dir/agent/test-runs/20150717123801-abcl-1.3.2-fasl42-linux-x86/fasl/ql/dists/quicklisp/software/cl-charms-20150709-git/src/low-level/curses-grovel.c" Output was: /home/testgrid/cl-test-grid/work-dir/agent/test-runs/20150717123801-abcl-1.3.2-fasl42-linux-x86/fasl/ql/dists/quicklisp/software/cl-charms-20150709-git/src/low-level/curses-grovel.c:6:21: fatal error: ncurses.h: No such file or directory compilation terminated.
(LOAD cl-charms-paint FAIL) ffi-grovel, CFFI-GROVEL:GROVEL-ERROR : External process exited with code 1. Command was: "cc" "-m32" "-I/home/testgrid/cl-test-grid/work-dir/agent/quicklisp/dists/quicklisp/software/cffi_0.15.0/" "-o" "/home/testgrid/cl-test-grid/work-dir/agent/test-runs/20150717123801-abcl-1.3.2-fasl42-linux-x86/fasl/ql/dists/quicklisp/software/cl-charms-20150709-git/src/low-level/curses-grovel" "/home/testgrid/cl-test-grid/work-dir/agent/test-runs/20150717123801-abcl-1.3.2-fasl42-linux-x86/fasl/ql/dists/quicklisp/software/cl-charms-20150709-git/src/low-level/curses-grovel.c" Output was: /home/testgrid/cl-test-grid/work-dir/agent/test-runs/20150717123801-abcl-1.3.2-fasl42-linux-x86/fasl/ql/dists/quicklisp/software/cl-charms-20150709-git/src/low-level/curses-grovel.c:6:21: fatal error: ncurses.h: No such file or directory compilation terminated.
(LOAD cl-charms-timer FAIL) ffi-grovel, CFFI-GROVEL:GROVEL-ERROR : External process exited with code 1. Command was: "cc" "-m32" "-I/home/testgrid/cl-test-grid/work-dir/agent/quicklisp/dists/quicklisp/software/cffi_0.15.0/" "-o" "/home/testgrid/cl-test-grid/work-dir/agent/test-runs/20150717123801-abcl-1.3.2-fasl42-linux-x86/fasl/ql/dists/quicklisp/software/cl-charms-20150709-git/src/low-level/curses-grovel" "/home/testgrid/cl-test-grid/work-dir/agent/test-runs/20150717123801-abcl-1.3.2-fasl42-linux-x86/fasl/ql/dists/quicklisp/software/cl-charms-20150709-git/src/low-level/curses-grovel.c" Output was: /home/testgrid/cl-test-grid/work-dir/agent/test-runs/20150717123801-abcl-1.3.2-fasl42-linux-x86/fasl/ql/dists/quicklisp/software/cl-charms-20150709-git/src/low-level/curses-grovel.c:6:21: fatal error: ncurses.h: No such file or directory compilation terminated.
croatoan
(LOAD croatoan FAIL) COMMON-LISP:ERROR : SB-GRAY is not the name of a package.
lucerne
(LOAD lucerne-utweet FAIL) COMMON-LISP:ERROR : Compiled function can't be loaded: org.armedbear.lisp.sqlite_ffi_TMP_1 from org.armedbear.lisp.Pathname@7fecff
pp-toml
(LOAD pp-toml FAIL) COMMON-LISP:SIMPLE-ERROR : The method-lambda-list (A B &REST KEYS &KEY FLOATING-COMPARE (MAX-RELATIVE-DIFF 1.19E-7)) does not accept all of the keyword arguments defined for the generic function.
(LOAD pp-toml-tests FAIL) COMMON-LISP:SIMPLE-ERROR : The method-lambda-list (A B &REST KEYS &KEY FLOATING-COMPARE (MAX-RELATIVE-DIFF 1.19E-7)) does not accept all of the keyword arguments defined for the generic function.
ccl-1.10-r16196-f96-linux-x86cl-charms
(LOAD cl-charms FAIL) ffi-grovel, CFFI-GROVEL:GROVEL-ERROR : External process exited with code 1. Command was: "cc" "-m32" "-I/home/testgrid/cl-test-grid/work-dir/agent/quicklisp/dists/quicklisp/software/cffi_0.15.0/" "-o" "/home/testgrid/cl-test-grid/work-dir/agent/test-runs/20150716195514-ccl-1.10-r16196-f96-linux-x86/fasl/ql/dists/quicklisp/software/cl-charms-20150709-git/src/low-level/curses-grovel" "/home/testgrid/cl-test-grid/work-dir/agent/test-runs/20150716195514-ccl-1.10-r16196-f96-linux-x86/fasl/ql/dists/quicklisp/software/cl-charms-20150709-git/src/low-level/curses-grovel.c" Output was: /home/testgrid/cl-test-grid/work-dir/agent/test-runs/20150716195514-ccl-1.10-r16196-f96-linux-x86/fasl/ql/dists/quicklisp/software/cl-charms-20150709-git/src/low-level/curses-grovel.c:6:21: fatal error: ncurses.h: No such file or directory compilation terminated.
(LOAD cl-charms-paint FAIL) ffi-grovel, CFFI-GROVEL:GROVEL-ERROR : External process exited with code 1. Command was: "cc" "-m32" "-I/home/testgrid/cl-test-grid/work-dir/agent/quicklisp/dists/quicklisp/software/cffi_0.15.0/" "-o" "/home/testgrid/cl-test-grid/work-dir/agent/test-runs/20150716195514-ccl-1.10-r16196-f96-linux-x86/fasl/ql/dists/quicklisp/software/cl-charms-20150709-git/src/low-level/curses-grovel" "/home/testgrid/cl-test-grid/work-dir/agent/test-runs/20150716195514-ccl-1.10-r16196-f96-linux-x86/fasl/ql/dists/quicklisp/software/cl-charms-20150709-git/src/low-level/curses-grovel.c" Output was: /home/testgrid/cl-test-grid/work-dir/agent/test-runs/20150716195514-ccl-1.10-r16196-f96-linux-x86/fasl/ql/dists/quicklisp/software/cl-charms-20150709-git/src/low-level/curses-grovel.c:6:21: fatal error: ncurses.h: No such file or directory compilation terminated.
(LOAD cl-charms-timer FAIL) ffi-grovel, CFFI-GROVEL:GROVEL-ERROR : External process exited with code 1. Command was: "cc" "-m32" "-I/home/testgrid/cl-test-grid/work-dir/agent/quicklisp/dists/quicklisp/software/cffi_0.15.0/" "-o" "/home/testgrid/cl-test-grid/work-dir/agent/test-runs/20150716195514-ccl-1.10-r16196-f96-linux-x86/fasl/ql/dists/quicklisp/software/cl-charms-20150709-git/src/low-level/curses-grovel" "/home/testgrid/cl-test-grid/work-dir/agent/test-runs/20150716195514-ccl-1.10-r16196-f96-linux-x86/fasl/ql/dists/quicklisp/software/cl-charms-20150709-git/src/low-level/curses-grovel.c" Output was: /home/testgrid/cl-test-grid/work-dir/agent/test-runs/20150716195514-ccl-1.10-r16196-f96-linux-x86/fasl/ql/dists/quicklisp/software/cl-charms-20150709-git/src/low-level/curses-grovel.c:6:21: fatal error: ncurses.h: No such file or directory compilation terminated.
croatoan
(LOAD croatoan FAIL) CCL::NO-SUCH-PACKAGE : There is no package named "SB-GRAY" .
ccl-1.8-r15286m-f95-linux-x86cl-charms
(LOAD cl-charms FAIL) ffi-grovel, CFFI-GROVEL:GROVEL-ERROR : External process exited with code 1. Command was: "cc" "-m32" "-I/home/testgrid/cl-test-grid/work-dir/agent/quicklisp/dists/quicklisp/software/cffi_0.15.0/" "-o" "/home/testgrid/cl-test-grid/work-dir/agent/test-runs/20150718171619-ccl-1.8-r15286m-f95-linux-x86/fasl/ql/dists/quicklisp/software/cl-charms-20150709-git/src/low-level/curses-grovel" "/home/testgrid/cl-test-grid/work-dir/agent/test-runs/20150718171619-ccl-1.8-r15286m-f95-linux-x86/fasl/ql/dists/quicklisp/software/cl-charms-20150709-git/src/low-level/curses-grovel.c" Output was: /home/testgrid/cl-test-grid/work-dir/agent/test-runs/20150718171619-ccl-1.8-r15286m-f95-linux-x86/fasl/ql/dists/quicklisp/software/cl-charms-20150709-git/src/low-level/curses-grovel.c:6:21: fatal error: ncurses.h: No such file or directory compilation terminated.
(LOAD cl-charms-paint FAIL) ffi-grovel, CFFI-GROVEL:GROVEL-ERROR : External process exited with code 1. Command was: "cc" "-m32" "-I/home/testgrid/cl-test-grid/work-dir/agent/quicklisp/dists/quicklisp/software/cffi_0.15.0/" "-o" "/home/testgrid/cl-test-grid/work-dir/agent/test-runs/20150718171619-ccl-1.8-r15286m-f95-linux-x86/fasl/ql/dists/quicklisp/software/cl-charms-20150709-git/src/low-level/curses-grovel" "/home/testgrid/cl-test-grid/work-dir/agent/test-runs/20150718171619-ccl-1.8-r15286m-f95-linux-x86/fasl/ql/dists/quicklisp/software/cl-charms-20150709-git/src/low-level/curses-grovel.c" Output was: /home/testgrid/cl-test-grid/work-dir/agent/test-runs/20150718171619-ccl-1.8-r15286m-f95-linux-x86/fasl/ql/dists/quicklisp/software/cl-charms-20150709-git/src/low-level/curses-grovel.c:6:21: fatal error: ncurses.h: No such file or directory compilation terminated.
(LOAD cl-charms-timer FAIL) ffi-grovel, CFFI-GROVEL:GROVEL-ERROR : External process exited with code 1. Command was: "cc" "-m32" "-I/home/testgrid/cl-test-grid/work-dir/agent/quicklisp/dists/quicklisp/software/cffi_0.15.0/" "-o" "/home/testgrid/cl-test-grid/work-dir/agent/test-runs/20150718171619-ccl-1.8-r15286m-f95-linux-x86/fasl/ql/dists/quicklisp/software/cl-charms-20150709-git/src/low-level/curses-grovel" "/home/testgrid/cl-test-grid/work-dir/agent/test-runs/20150718171619-ccl-1.8-r15286m-f95-linux-x86/fasl/ql/dists/quicklisp/software/cl-charms-20150709-git/src/low-level/curses-grovel.c" Output was: /home/testgrid/cl-test-grid/work-dir/agent/test-runs/20150718171619-ccl-1.8-r15286m-f95-linux-x86/fasl/ql/dists/quicklisp/software/cl-charms-20150709-git/src/low-level/curses-grovel.c:6:21: fatal error: ncurses.h: No such file or directory compilation terminated.
com.informatimago
(LOAD com.informatimago.clisp.test FAIL) ASDF:LOAD-SYSTEM-DEFINITION-ERROR : Error while trying to load definition for system com.informatimago.clisp.test from pathname /home/testgrid/cl-test-grid/work-dir/agent/quicklisp/dists/quicklisp/software/com.informatimago-20150407-git/clisp/com\.informatimago\.clisp\.test.asd: While compiling (PERFORM (T T)) : In the form ((DECLARE TEST-OP) ((IGNORE OPERATION SYSTEM) (EQL #<SYSTEM "com.informatimago.clisp.test">))), (DECLARE TEST-OP) is not a symbol or lambda expression.
(LOAD com.informatimago.clmisc.test FAIL) ASDF:LOAD-SYSTEM-DEFINITION-ERROR : Error while trying to load definition for system com.informatimago.clmisc.test from pathname /home/testgrid/cl-test-grid/work-dir/agent/quicklisp/dists/quicklisp/software/com.informatimago-20150407-git/clmisc/com\.informatimago\.clmisc\.test.asd: There is no package named "ASDF/LISP-ACTION" .
(LOAD com.informatimago.common-lisp.apple-file.test FAIL) ASDF:LOAD-SYSTEM-DEFINITION-ERROR : Error while trying to load definition for system com.informatimago.common-lisp.apple-file.test from pathname /home/testgrid/cl-test-grid/work-dir/agent/quicklisp/dists/quicklisp/software/com.informatimago-20150407-git/common-lisp/apple-file/com\.informatimago\.common-lisp\.apple-file\.test.asd: There is no package named "ASDF/LISP-ACTION" .
(LOAD com.informatimago.common-lisp.arithmetic.test FAIL) ASDF:LOAD-SYSTEM-DEFINITION-ERROR : Error while trying to load definition for system com.informatimago.common-lisp.arithmetic.test from pathname /home/testgrid/cl-test-grid/work-dir/agent/quicklisp/dists/quicklisp/software/com.informatimago-20150407-git/common-lisp/arithmetic/com\.informatimago\.common-lisp\.arithmetic\.test.asd: There is no package named "ASDF/LISP-ACTION" .
(LOAD com.informatimago.common-lisp.bank.test FAIL) ASDF:LOAD-SYSTEM-DEFINITION-ERROR : Error while trying to load definition for system com.informatimago.common-lisp.bank.test from pathname /home/testgrid/cl-test-grid/work-dir/agent/quicklisp/dists/quicklisp/software/com.informatimago-20150407-git/common-lisp/bank/com\.informatimago\.common-lisp\.bank\.test.asd: There is no package named "ASDF/LISP-ACTION" .
(LOAD com.informatimago.common-lisp.cesarum.test FAIL) ASDF:LOAD-SYSTEM-DEFINITION-ERROR : Error while trying to load definition for system com.informatimago.common-lisp.cesarum.test from pathname /home/testgrid/cl-test-grid/work-dir/agent/quicklisp/dists/quicklisp/software/com.informatimago-20150407-git/common-lisp/cesarum/com\.informatimago\.common-lisp\.cesarum\.test.asd: There is no package named "UIOP" .
(LOAD com.informatimago.common-lisp.csv.test FAIL) ASDF:LOAD-SYSTEM-DEFINITION-ERROR : Error while trying to load definition for system com.informatimago.common-lisp.csv.test from pathname /home/testgrid/cl-test-grid/work-dir/agent/quicklisp/dists/quicklisp/software/com.informatimago-20150407-git/common-lisp/csv/com\.informatimago\.common-lisp\.csv\.test.asd: There is no package named "ASDF/LISP-ACTION" .
(LOAD com.informatimago.common-lisp.data-encoding.test FAIL) ASDF:LOAD-SYSTEM-DEFINITION-ERROR : Error while trying to load definition for system com.informatimago.common-lisp.data-encoding.test from pathname /home/testgrid/cl-test-grid/work-dir/agent/quicklisp/dists/quicklisp/software/com.informatimago-20150407-git/common-lisp/data-encoding/com\.informatimago\.common-lisp\.data-encoding\.test.asd: There is no package named "ASDF/LISP-ACTION" .
(LOAD com.informatimago.common-lisp.diagram.test FAIL) ASDF:LOAD-SYSTEM-DEFINITION-ERROR : Error while trying to load definition for system com.informatimago.common-lisp.diagram.test from pathname /home/testgrid/cl-test-grid/work-dir/agent/quicklisp/dists/quicklisp/software/com.informatimago-20150407-git/common-lisp/diagram/com\.informatimago\.common-lisp\.diagram\.test.asd: There is no package named "ASDF/LISP-ACTION" .
(LOAD com.informatimago.common-lisp.ed.test FAIL) ASDF:LOAD-SYSTEM-DEFINITION-ERROR : Error while trying to load definition for system com.informatimago.common-lisp.ed.test from pathname /home/testgrid/cl-test-grid/work-dir/agent/quicklisp/dists/quicklisp/software/com.informatimago-20150407-git/common-lisp/ed/com\.informatimago\.common-lisp\.ed\.test.asd: There is no package named "ASDF/LISP-ACTION" .
(LOAD com.informatimago.common-lisp.graphviz.test FAIL) ASDF:LOAD-SYSTEM-DEFINITION-ERROR : Error while trying to load definition for system com.informatimago.common-lisp.graphviz.test from pathname /home/testgrid/cl-test-grid/work-dir/agent/quicklisp/dists/quicklisp/software/com.informatimago-20150407-git/common-lisp/graphviz/com\.informatimago\.common-lisp\.graphviz\.test.asd: There is no package named "ASDF/LISP-ACTION" .
(LOAD com.informatimago.common-lisp.heap.test FAIL) ASDF:LOAD-SYSTEM-DEFINITION-ERROR : Error while trying to load definition for system com.informatimago.common-lisp.heap.test from pathname /home/testgrid/cl-test-grid/work-dir/agent/quicklisp/dists/quicklisp/software/com.informatimago-20150407-git/common-lisp/heap/com\.informatimago\.common-lisp\.heap\.test.asd: There is no package named "ASDF/LISP-ACTION" .
(LOAD com.informatimago.common-lisp.html-base.test FAIL) ASDF:LOAD-SYSTEM-DEFINITION-ERROR : Error while trying to load definition for system com.informatimago.common-lisp.html-base.test from pathname /home/testgrid/cl-test-grid/work-dir/agent/quicklisp/dists/quicklisp/software/com.informatimago-20150407-git/common-lisp/html-base/com\.informatimago\.common-lisp\.html-base\.test.asd: There is no package named "ASDF/LISP-ACTION" .
(LOAD com.informatimago.common-lisp.html-generator.test FAIL) ASDF:LOAD-SYSTEM-DEFINITION-ERROR : Error while trying to load definition for system com.informatimago.common-lisp.html-generator.test from pathname /home/testgrid/cl-test-grid/work-dir/agent/quicklisp/dists/quicklisp/software/com.informatimago-20150407-git/common-lisp/html-generator/com\.informatimago\.common-lisp\.html-generator\.test.asd: There is no package named "ASDF/LISP-ACTION" .
(LOAD com.informatimago.common-lisp.html-parser.test FAIL) ASDF:LOAD-SYSTEM-DEFINITION-ERROR : Error while trying to load definition for system com.informatimago.common-lisp.html-parser.test from pathname /home/testgrid/cl-test-grid/work-dir/agent/quicklisp/dists/quicklisp/software/com.informatimago-20150407-git/common-lisp/html-parser/com\.informatimago\.common-lisp\.html-parser\.test.asd: There is no package named "ASDF/LISP-ACTION" .
(LOAD com.informatimago.common-lisp.http.test FAIL) ASDF:LOAD-SYSTEM-DEFINITION-ERROR : Error while trying to load definition for system com.informatimago.common-lisp.http.test from pathname /home/testgrid/cl-test-grid/work-dir/agent/quicklisp/dists/quicklisp/software/com.informatimago-20150407-git/common-lisp/http/com\.informatimago\.common-lisp\.http\.test.asd: There is no package named "ASDF/LISP-ACTION" .
(LOAD com.informatimago.common-lisp.interactive.test FAIL) ASDF:LOAD-SYSTEM-DEFINITION-ERROR : Error while trying to load definition for system com.informatimago.common-lisp.interactive.test from pathname /home/testgrid/cl-test-grid/work-dir/agent/quicklisp/dists/quicklisp/software/com.informatimago-20150407-git/common-lisp/interactive/com\.informatimago\.common-lisp\.interactive\.test.asd: There is no package named "ASDF/LISP-ACTION" .
(LOAD com.informatimago.common-lisp.invoice.test FAIL) ASDF:LOAD-SYSTEM-DEFINITION-ERROR : Error while trying to load definition for system com.informatimago.common-lisp.invoice.test from pathname /home/testgrid/cl-test-grid/work-dir/agent/quicklisp/dists/quicklisp/software/com.informatimago-20150407-git/common-lisp/invoice/com\.informatimago\.common-lisp\.invoice\.test.asd: There is no package named "ASDF/LISP-ACTION" .
(LOAD com.informatimago.common-lisp.lisp-sexp.test FAIL) ASDF:LOAD-SYSTEM-DEFINITION-ERROR : Error while trying to load definition for system com.informatimago.common-lisp.lisp-sexp.test from pathname /home/testgrid/cl-test-grid/work-dir/agent/quicklisp/dists/quicklisp/software/com.informatimago-20150407-git/common-lisp/lisp-sexp/com\.informatimago\.common-lisp\.lisp-sexp\.test.asd: There is no package named "ASDF/LISP-ACTION" .
(LOAD com.informatimago.common-lisp.lisp-text.test FAIL) ASDF:LOAD-SYSTEM-DEFINITION-ERROR : Error while trying to load definition for system com.informatimago.common-lisp.lisp-text.test from pathname /home/testgrid/cl-test-grid/work-dir/agent/quicklisp/dists/quicklisp/software/com.informatimago-20150407-git/common-lisp/lisp-text/com\.informatimago\.common-lisp\.lisp-text\.test.asd: There is no package named "ASDF/LISP-ACTION" .
(LOAD com.informatimago.common-lisp.lisp.ibcl.test FAIL) ASDF:LOAD-SYSTEM-DEFINITION-ERROR : Error while trying to load definition for system com.informatimago.common-lisp.lisp.ibcl.test from pathname /home/testgrid/cl-test-grid/work-dir/agent/quicklisp/dists/quicklisp/software/com.informatimago-20150407-git/common-lisp/lisp/com\.informatimago\.common-lisp\.lisp\.ibcl\.test.asd: There is no package named "ASDF/LISP-ACTION" .
(LOAD com.informatimago.common-lisp.lisp.stepper.test FAIL) ASDF:LOAD-SYSTEM-DEFINITION-ERROR : Error while trying to load definition for system com.informatimago.common-lisp.lisp.stepper.test from pathname /home/testgrid/cl-test-grid/work-dir/agent/quicklisp/dists/quicklisp/software/com.informatimago-20150407-git/common-lisp/lisp/com\.informatimago\.common-lisp\.lisp\.stepper\.test.asd: There is no package named "ASDF/LISP-ACTION" .
(LOAD com.informatimago.common-lisp.lisp.test FAIL) ASDF:LOAD-SYSTEM-DEFINITION-ERROR : Error while trying to load definition for system com.informatimago.common-lisp.lisp.test from pathname /home/testgrid/cl-test-grid/work-dir/agent/quicklisp/dists/quicklisp/software/com.informatimago-20150407-git/common-lisp/lisp/com\.informatimago\.common-lisp\.lisp\.test.asd: There is no package named "ASDF/LISP-ACTION" .
(LOAD com.informatimago.common-lisp.parser.test FAIL) ASDF:LOAD-SYSTEM-DEFINITION-ERROR : Error while trying to load definition for system com.informatimago.common-lisp.parser.test from pathname /home/testgrid/cl-test-grid/work-dir/agent/quicklisp/dists/quicklisp/software/com.informatimago-20150407-git/common-lisp/parser/com\.informatimago\.common-lisp\.parser\.test.asd: There is no package named "ASDF/LISP-ACTION" .
(LOAD com.informatimago.common-lisp.picture.test FAIL) ASDF:LOAD-SYSTEM-DEFINITION-ERROR : Error while trying to load definition for system com.informatimago.common-lisp.picture.test from pathname /home/testgrid/cl-test-grid/work-dir/agent/quicklisp/dists/quicklisp/software/com.informatimago-20150407-git/common-lisp/picture/com\.informatimago\.common-lisp\.picture\.test.asd: There is no package named "ASDF/LISP-ACTION" .
(LOAD com.informatimago.common-lisp.regexp.test FAIL) ASDF:LOAD-SYSTEM-DEFINITION-ERROR : Error while trying to load definition for system com.informatimago.common-lisp.regexp.test from pathname /home/testgrid/cl-test-grid/work-dir/agent/quicklisp/dists/quicklisp/software/com.informatimago-20150407-git/common-lisp/regexp/com\.informatimago\.common-lisp\.regexp\.test.asd: There is no package named "ASDF/LISP-ACTION" .
(LOAD com.informatimago.common-lisp.rfc2822.test FAIL) ASDF:LOAD-SYSTEM-DEFINITION-ERROR : Error while trying to load definition for system com.informatimago.common-lisp.rfc2822.test from pathname /home/testgrid/cl-test-grid/work-dir/agent/quicklisp/dists/quicklisp/software/com.informatimago-20150407-git/common-lisp/rfc2822/com\.informatimago\.common-lisp\.rfc2822\.test.asd: There is no package named "ASDF/LISP-ACTION" .
(LOAD com.informatimago.common-lisp.rfc3548.test FAIL) ASDF:LOAD-SYSTEM-DEFINITION-ERROR : Error while trying to load definition for system com.informatimago.common-lisp.rfc3548.test from pathname /home/testgrid/cl-test-grid/work-dir/agent/quicklisp/dists/quicklisp/software/com.informatimago-20150407-git/common-lisp/rfc3548/com\.informatimago\.common-lisp\.rfc3548\.test.asd: There is no package named "ASDF/LISP-ACTION" .
(LOAD com.informatimago.common-lisp.telnet.test FAIL) ASDF:LOAD-SYSTEM-DEFINITION-ERROR : Error while trying to load definition for system com.informatimago.common-lisp.telnet.test from pathname /home/testgrid/cl-test-grid/work-dir/agent/quicklisp/dists/quicklisp/software/com.informatimago-20150407-git/common-lisp/telnet/com\.informatimago\.common-lisp\.telnet\.test.asd: There is no package named "ASDF/LISP-ACTION" .
(LOAD com.informatimago.common-lisp.unix.test FAIL) ASDF:LOAD-SYSTEM-DEFINITION-ERROR : Error while trying to load definition for system com.informatimago.common-lisp.unix.test from pathname /home/testgrid/cl-test-grid/work-dir/agent/quicklisp/dists/quicklisp/software/com.informatimago-20150407-git/common-lisp/unix/com\.informatimago\.common-lisp\.unix\.test.asd: There is no package named "ASDF/LISP-ACTION" .
(LOAD com.informatimago.future.test FAIL) ASDF:LOAD-SYSTEM-DEFINITION-ERROR : Error while trying to load definition for system com.informatimago.future.test from pathname /home/testgrid/cl-test-grid/work-dir/agent/quicklisp/dists/quicklisp/software/com.informatimago-20150407-git/future/com\.informatimago\.future\.test.asd: There is no package named "ASDF/LISP-ACTION" .
(LOAD com.informatimago.languages.cxx.test FAIL) ASDF:LOAD-SYSTEM-DEFINITION-ERROR : Error while trying to load definition for system com.informatimago.languages.cxx.test from pathname /home/testgrid/cl-test-grid/work-dir/agent/quicklisp/dists/quicklisp/software/com.informatimago-20150407-git/languages/cxx/com\.informatimago\.languages\.cxx\.test.asd: There is no package named "ASDF/LISP-ACTION" .
(LOAD com.informatimago.languages.lua.test FAIL) ASDF:LOAD-SYSTEM-DEFINITION-ERROR : Error while trying to load definition for system com.informatimago.languages.lua.test from pathname /home/testgrid/cl-test-grid/work-dir/agent/quicklisp/dists/quicklisp/software/com.informatimago-20150407-git/languages/lua/com\.informatimago\.languages\.lua\.test.asd: There is no package named "ASDF/LISP-ACTION" .
(LOAD com.informatimago.linc.test FAIL) ASDF:LOAD-SYSTEM-DEFINITION-ERROR : Error while trying to load definition for system com.informatimago.linc.test from pathname /home/testgrid/cl-test-grid/work-dir/agent/quicklisp/dists/quicklisp/software/com.informatimago-20150407-git/languages/linc/com\.informatimago\.linc\.test.asd: There is no package named "ASDF/LISP-ACTION" .
(LOAD com.informatimago.lispdoc.test FAIL) ASDF:LOAD-SYSTEM-DEFINITION-ERROR : Error while trying to load definition for system com.informatimago.lispdoc.test from pathname /home/testgrid/cl-test-grid/work-dir/agent/quicklisp/dists/quicklisp/software/com.informatimago-20150407-git/lispdoc/com\.informatimago\.lispdoc\.test.asd: There is no package named "ASDF/LISP-ACTION" .
(LOAD com.informatimago.rdp.basic.test FAIL) ASDF:LOAD-SYSTEM-DEFINITION-ERROR : Error while trying to load definition for system com.informatimago.rdp.basic.test from pathname /home/testgrid/cl-test-grid/work-dir/agent/quicklisp/dists/quicklisp/software/com.informatimago-20150407-git/rdp/com\.informatimago\.rdp\.basic\.test.asd: There is no package named "ASDF/LISP-ACTION" .
(LOAD com.informatimago.rdp.example.test FAIL) ASDF:LOAD-SYSTEM-DEFINITION-ERROR : Error while trying to load definition for system com.informatimago.rdp.example.test from pathname /home/testgrid/cl-test-grid/work-dir/agent/quicklisp/dists/quicklisp/software/com.informatimago-20150407-git/rdp/com\.informatimago\.rdp\.example\.test.asd: There is no package named "ASDF/LISP-ACTION" .
(LOAD com.informatimago.rdp.test FAIL) ASDF:LOAD-SYSTEM-DEFINITION-ERROR : Error while trying to load definition for system com.informatimago.rdp.test from pathname /home/testgrid/cl-test-grid/work-dir/agent/quicklisp/dists/quicklisp/software/com.informatimago-20150407-git/rdp/com\.informatimago\.rdp\.test.asd: There is no package named "ASDF/LISP-ACTION" .
(LOAD com.informatimago.small-cl-pgms.brainfuck.test FAIL) ASDF:LOAD-SYSTEM-DEFINITION-ERROR : Error while trying to load definition for system com.informatimago.small-cl-pgms.brainfuck.test from pathname /home/testgrid/cl-test-grid/work-dir/agent/quicklisp/dists/quicklisp/software/com.informatimago-20150407-git/small-cl-pgms/brainfuck/com\.informatimago\.small-cl-pgms\.brainfuck\.test.asd: There is no package named "ASDF/LISP-ACTION" .
(LOAD com.informatimago.small-cl-pgms.life.test FAIL) ASDF:LOAD-SYSTEM-DEFINITION-ERROR : Error while trying to load definition for system com.informatimago.small-cl-pgms.life.test from pathname /home/testgrid/cl-test-grid/work-dir/agent/quicklisp/dists/quicklisp/software/com.informatimago-20150407-git/small-cl-pgms/com\.informatimago\.small-cl-pgms\.life\.test.asd: There is no package named "ASDF/LISP-ACTION" .
(LOAD com.informatimago.small-cl-pgms.quine.test FAIL) ASDF:LOAD-SYSTEM-DEFINITION-ERROR : Error while trying to load definition for system com.informatimago.small-cl-pgms.quine.test from pathname /home/testgrid/cl-test-grid/work-dir/agent/quicklisp/dists/quicklisp/software/com.informatimago-20150407-git/small-cl-pgms/com\.informatimago\.small-cl-pgms\.quine\.test.asd: There is no package named "ASDF/LISP-ACTION" .
(LOAD com.informatimago.small-cl-pgms.what-implementation.test FAIL) ASDF:LOAD-SYSTEM-DEFINITION-ERROR : Error while trying to load definition for system com.informatimago.small-cl-pgms.what-implementation.test from pathname /home/testgrid/cl-test-grid/work-dir/agent/quicklisp/dists/quicklisp/software/com.informatimago-20150407-git/small-cl-pgms/com\.informatimago\.small-cl-pgms\.what-implementation\.test.asd: There is no package named "ASDF/LISP-ACTION" .
(LOAD com.informatimago.susv3.test FAIL) ASDF:LOAD-SYSTEM-DEFINITION-ERROR : Error while trying to load definition for system com.informatimago.susv3.test from pathname /home/testgrid/cl-test-grid/work-dir/agent/quicklisp/dists/quicklisp/software/com.informatimago-20150407-git/susv3/com\.informatimago\.susv3\.test.asd: There is no package named "ASDF/LISP-ACTION" .
(LOAD com.informatimago.tools.manifest.test FAIL) ASDF:LOAD-SYSTEM-DEFINITION-ERROR : Error while trying to load definition for system com.informatimago.tools.manifest.test from pathname /home/testgrid/cl-test-grid/work-dir/agent/quicklisp/dists/quicklisp/software/com.informatimago-20150407-git/tools/com\.informatimago\.tools\.manifest\.test.asd: There is no package named "ASDF/LISP-ACTION" .
(LOAD com.informatimago.tools.pathname.test FAIL) ASDF:LOAD-SYSTEM-DEFINITION-ERROR : Error while trying to load definition for system com.informatimago.tools.pathname.test from pathname /home/testgrid/cl-test-grid/work-dir/agent/quicklisp/dists/quicklisp/software/com.informatimago-20150407-git/tools/com\.informatimago\.tools\.pathname\.test.asd: There is no package named "UIOP/PACKAGE" .
(LOAD com.informatimago.tools.symbol.test FAIL) ASDF:LOAD-SYSTEM-DEFINITION-ERROR : Error while trying to load definition for system com.informatimago.tools.symbol.test from pathname /home/testgrid/cl-test-grid/work-dir/agent/quicklisp/dists/quicklisp/software/com.informatimago-20150407-git/tools/com\.informatimago\.tools\.symbol\.test.asd: There is no package named "ASDF/LISP-ACTION" .
(LOAD com.informatimago.tools.undefmethod.test FAIL) ASDF:LOAD-SYSTEM-DEFINITION-ERROR : Error while trying to load definition for system com.informatimago.tools.undefmethod.test from pathname /home/testgrid/cl-test-grid/work-dir/agent/quicklisp/dists/quicklisp/software/com.informatimago-20150407-git/tools/com\.informatimago\.tools\.undefmethod\.test.asd: There is no package named "ASDF/LISP-ACTION" .
(LOAD com.informatimago.xcode.test FAIL) ASDF:LOAD-SYSTEM-DEFINITION-ERROR : Error while trying to load definition for system com.informatimago.xcode.test from pathname /home/testgrid/cl-test-grid/work-dir/agent/quicklisp/dists/quicklisp/software/com.informatimago-20150407-git/xcode/com\.informatimago\.xcode\.test.asd: There is no package named "ASDF/LISP-ACTION" .
croatoan
(LOAD croatoan FAIL) CCL::NO-SUCH-PACKAGE : There is no package named "SB-GRAY" .
ccl-1.9-r15756-f96-linux-x86cl-charms
(LOAD cl-charms FAIL) ffi-grovel, CFFI-GROVEL:GROVEL-ERROR : External process exited with code 1. Command was: "cc" "-m32" "-I/home/testgrid/cl-test-grid/work-dir/agent/quicklisp/dists/quicklisp/software/cffi_0.15.0/" "-o" "/home/testgrid/cl-test-grid/work-dir/agent/test-runs/20150718051418-ccl-1.9-r15756-f96-linux-x86/fasl/ql/dists/quicklisp/software/cl-charms-20150709-git/src/low-level/curses-grovel" "/home/testgrid/cl-test-grid/work-dir/agent/test-runs/20150718051418-ccl-1.9-r15756-f96-linux-x86/fasl/ql/dists/quicklisp/software/cl-charms-20150709-git/src/low-level/curses-grovel.c" Output was: /home/testgrid/cl-test-grid/work-dir/agent/test-runs/20150718051418-ccl-1.9-r15756-f96-linux-x86/fasl/ql/dists/quicklisp/software/cl-charms-20150709-git/src/low-level/curses-grovel.c:6:21: fatal error: ncurses.h: No such file or directory compilation terminated.
(LOAD cl-charms-paint FAIL) ffi-grovel, CFFI-GROVEL:GROVEL-ERROR : External process exited with code 1. Command was: "cc" "-m32" "-I/home/testgrid/cl-test-grid/work-dir/agent/quicklisp/dists/quicklisp/software/cffi_0.15.0/" "-o" "/home/testgrid/cl-test-grid/work-dir/agent/test-runs/20150718051418-ccl-1.9-r15756-f96-linux-x86/fasl/ql/dists/quicklisp/software/cl-charms-20150709-git/src/low-level/curses-grovel" "/home/testgrid/cl-test-grid/work-dir/agent/test-runs/20150718051418-ccl-1.9-r15756-f96-linux-x86/fasl/ql/dists/quicklisp/software/cl-charms-20150709-git/src/low-level/curses-grovel.c" Output was: /home/testgrid/cl-test-grid/work-dir/agent/test-runs/20150718051418-ccl-1.9-r15756-f96-linux-x86/fasl/ql/dists/quicklisp/software/cl-charms-20150709-git/src/low-level/curses-grovel.c:6:21: fatal error: ncurses.h: No such file or directory compilation terminated.
(LOAD cl-charms-timer FAIL) ffi-grovel, CFFI-GROVEL:GROVEL-ERROR : External process exited with code 1. Command was: "cc" "-m32" "-I/home/testgrid/cl-test-grid/work-dir/agent/quicklisp/dists/quicklisp/software/cffi_0.15.0/" "-o" "/home/testgrid/cl-test-grid/work-dir/agent/test-runs/20150718051418-ccl-1.9-r15756-f96-linux-x86/fasl/ql/dists/quicklisp/software/cl-charms-20150709-git/src/low-level/curses-grovel" "/home/testgrid/cl-test-grid/work-dir/agent/test-runs/20150718051418-ccl-1.9-r15756-f96-linux-x86/fasl/ql/dists/quicklisp/software/cl-charms-20150709-git/src/low-level/curses-grovel.c" Output was: /home/testgrid/cl-test-grid/work-dir/agent/test-runs/20150718051418-ccl-1.9-r15756-f96-linux-x86/fasl/ql/dists/quicklisp/software/cl-charms-20150709-git/src/low-level/curses-grovel.c:6:21: fatal error: ncurses.h: No such file or directory compilation terminated.
croatoan
(LOAD croatoan FAIL) CCL::NO-SUCH-PACKAGE : There is no package named "SB-GRAY" .
clisp-2.49-unix-x86cl-charms
(LOAD cl-charms FAIL) ffi-grovel, CFFI-GROVEL:GROVEL-ERROR : External process exited with code 1. Command was: "cc" "-m32" "-I/home/testgrid/cl-test-grid/work-dir/agent/quicklisp/dists/quicklisp/software/cffi_0.15.0/" "-o" "/home/testgrid/cl-test-grid/work-dir/agent/test-runs/20150717031936-clisp-2.49-unix-x86/fasl/ql/dists/quicklisp/software/cl-charms-20150709-git/src/low-level/curses-grovel" "/home/testgrid/cl-test-grid/work-dir/agent/test-runs/20150717031936-clisp-2.49-unix-x86/fasl/ql/dists/quicklisp/software/cl-charms-20150709-git/src/low-level/curses-grovel.c" Output was: <see above>
(LOAD cl-charms-paint FAIL) ffi-grovel, CFFI-GROVEL:GROVEL-ERROR : External process exited with code 1. Command was: "cc" "-m32" "-I/home/testgrid/cl-test-grid/work-dir/agent/quicklisp/dists/quicklisp/software/cffi_0.15.0/" "-o" "/home/testgrid/cl-test-grid/work-dir/agent/test-runs/20150717031936-clisp-2.49-unix-x86/fasl/ql/dists/quicklisp/software/cl-charms-20150709-git/src/low-level/curses-grovel" "/home/testgrid/cl-test-grid/work-dir/agent/test-runs/20150717031936-clisp-2.49-unix-x86/fasl/ql/dists/quicklisp/software/cl-charms-20150709-git/src/low-level/curses-grovel.c" Output was: <see above>
(LOAD cl-charms-timer FAIL) ffi-grovel, CFFI-GROVEL:GROVEL-ERROR : External process exited with code 1. Command was: "cc" "-m32" "-I/home/testgrid/cl-test-grid/work-dir/agent/quicklisp/dists/quicklisp/software/cffi_0.15.0/" "-o" "/home/testgrid/cl-test-grid/work-dir/agent/test-runs/20150717031936-clisp-2.49-unix-x86/fasl/ql/dists/quicklisp/software/cl-charms-20150709-git/src/low-level/curses-grovel" "/home/testgrid/cl-test-grid/work-dir/agent/test-runs/20150717031936-clisp-2.49-unix-x86/fasl/ql/dists/quicklisp/software/cl-charms-20150709-git/src/low-level/curses-grovel.c" Output was: <see above>
cl-epmd
cl-glfw
cl-gtk2
croatoan
(LOAD croatoan FAIL) SYSTEM::SIMPLE-PACKAGE-ERROR : SYSTEM::%FIND-PACKAGE: There is no package with name "SB-GRAY"
formlets
screamer
(LOAD screamer FAIL) COMMON-LISP:SIMPLE-ERROR : Cannot (currently) handle the special form MACROLET
cmu-snapshot-2013-04__20d_unicode_-linux-x86cl-charms
(LOAD cl-charms FAIL) ffi-grovel, CFFI-GROVEL:GROVEL-ERROR : Error in function CFFI-GROVEL:GROVEL-ERROR: External process exited with code 1. Command was: "cc" "-m32" "-I/home/testgrid/cl-test-grid/work-dir/agent/quicklisp/dists/quicklisp/software/cffi_0.15.0/" "-o" "/home/testgrid/cl-test-grid/work-dir/agent/test-runs/20150719005410-cmu-snapshot-2013-04__20d_unicode_-linux-x86/fasl/ql/dists/quicklisp/software/cl-charms-20150709-git/src/low-level/curses-grovel" "/home/testgrid/cl-test-grid/work-dir/agent/test-runs/20150719005410-cmu-snapshot-2013-04__20d_unicode_-linux-x86/fasl/ql/dists/quicklisp/software/cl-charms-20150709-git/src/low-level/curses-grovel.c" Output was: /home/testgrid/cl-test-grid/work-dir/agent/test-runs/20150719005410-cmu-snapshot-2013-04__20d_unicode_-linux-x86/fasl/ql/dists/quicklisp/software/cl-charms-20150709-git/src/low-level/curses-grovel.c:6:21: fatal error: ncurses.h: No such file or directory compilation terminated.
(LOAD cl-charms-paint FAIL) ffi-grovel, CFFI-GROVEL:GROVEL-ERROR : Error in function CFFI-GROVEL:GROVEL-ERROR: External process exited with code 1. Command was: "cc" "-m32" "-I/home/testgrid/cl-test-grid/work-dir/agent/quicklisp/dists/quicklisp/software/cffi_0.15.0/" "-o" "/home/testgrid/cl-test-grid/work-dir/agent/test-runs/20150719005410-cmu-snapshot-2013-04__20d_unicode_-linux-x86/fasl/ql/dists/quicklisp/software/cl-charms-20150709-git/src/low-level/curses-grovel" "/home/testgrid/cl-test-grid/work-dir/agent/test-runs/20150719005410-cmu-snapshot-2013-04__20d_unicode_-linux-x86/fasl/ql/dists/quicklisp/software/cl-charms-20150709-git/src/low-level/curses-grovel.c" Output was: /home/testgrid/cl-test-grid/work-dir/agent/test-runs/20150719005410-cmu-snapshot-2013-04__20d_unicode_-linux-x86/fasl/ql/dists/quicklisp/software/cl-charms-20150709-git/src/low-level/curses-grovel.c:6:21: fatal error: ncurses.h: No such file or directory compilation terminated.
(LOAD cl-charms-timer FAIL) ffi-grovel, CFFI-GROVEL:GROVEL-ERROR : Error in function CFFI-GROVEL:GROVEL-ERROR: External process exited with code 1. Command was: "cc" "-m32" "-I/home/testgrid/cl-test-grid/work-dir/agent/quicklisp/dists/quicklisp/software/cffi_0.15.0/" "-o" "/home/testgrid/cl-test-grid/work-dir/agent/test-runs/20150719005410-cmu-snapshot-2013-04__20d_unicode_-linux-x86/fasl/ql/dists/quicklisp/software/cl-charms-20150709-git/src/low-level/curses-grovel" "/home/testgrid/cl-test-grid/work-dir/agent/test-runs/20150719005410-cmu-snapshot-2013-04__20d_unicode_-linux-x86/fasl/ql/dists/quicklisp/software/cl-charms-20150709-git/src/low-level/curses-grovel.c" Output was: /home/testgrid/cl-test-grid/work-dir/agent/test-runs/20150719005410-cmu-snapshot-2013-04__20d_unicode_-linux-x86/fasl/ql/dists/quicklisp/software/cl-charms-20150709-git/src/low-level/curses-grovel.c:6:21: fatal error: ncurses.h: No such file or directory compilation terminated.
http-body
(LOAD http-body FAIL) C::COMPILER-ERROR : (during macroexpansion) Error in function LISP::ASSERT-ERROR: The assertion (OR (NULL OPTS) (EQ (POP TYPE-LIST) '&OPTIONAL)) failed.
(LOAD http-body-test FAIL) C::COMPILER-ERROR : (during macroexpansion) Error in function LISP::ASSERT-ERROR: The assertion (OR (NULL OPTS) (EQ (POP TYPE-LIST) '&OPTIONAL)) failed.
jonathan
(LOAD jonathan FAIL) C::COMPILER-ERROR : (during macroexpansion) Error in function LISP::ASSERT-ERROR: The assertion (OR (NULL OPTS) (EQ (POP TYPE-LIST) '&OPTIONAL)) failed.
(LOAD jonathan-test FAIL) C::COMPILER-ERROR : (during macroexpansion) Error in function LISP::ASSERT-ERROR: The assertion (OR (NULL OPTS) (EQ (POP TYPE-LIST) '&OPTIONAL)) failed.
lack
(LOAD lack-request FAIL) C::COMPILER-ERROR : (during macroexpansion) Error in function LISP::ASSERT-ERROR: The assertion (OR (NULL OPTS) (EQ (POP TYPE-LIST) '&OPTIONAL)) failed.
cmu-snapshot-2014-01__20e_unicode_-linux-x86cl-charms
(LOAD cl-charms FAIL) ffi-grovel, CFFI-GROVEL:GROVEL-ERROR : Error in function CFFI-GROVEL:GROVEL-ERROR: External process exited with code 1. Command was: "cc" "-m32" "-I/home/testgrid/cl-test-grid/work-dir/agent/quicklisp/dists/quicklisp/software/cffi_0.15.0/" "-o" "/home/testgrid/cl-test-grid/work-dir/agent/test-runs/20150718220139-cmu-snapshot-2014-01__20e_unicode_-linux-x86/fasl/ql/dists/quicklisp/software/cl-charms-20150709-git/src/low-level/curses-grovel" "/home/testgrid/cl-test-grid/work-dir/agent/test-runs/20150718220139-cmu-snapshot-2014-01__20e_unicode_-linux-x86/fasl/ql/dists/quicklisp/software/cl-charms-20150709-git/src/low-level/curses-grovel.c" Output was: /home/testgrid/cl-test-grid/work-dir/agent/test-runs/20150718220139-cmu-snapshot-2014-01__20e_unicode_-linux-x86/fasl/ql/dists/quicklisp/software/cl-charms-20150709-git/src/low-level/curses-grovel.c:6:21: fatal error: ncurses.h: No such file or directory compilation terminated.
(LOAD cl-charms-paint FAIL) ffi-grovel, CFFI-GROVEL:GROVEL-ERROR : Error in function CFFI-GROVEL:GROVEL-ERROR: External process exited with code 1. Command was: "cc" "-m32" "-I/home/testgrid/cl-test-grid/work-dir/agent/quicklisp/dists/quicklisp/software/cffi_0.15.0/" "-o" "/home/testgrid/cl-test-grid/work-dir/agent/test-runs/20150718220139-cmu-snapshot-2014-01__20e_unicode_-linux-x86/fasl/ql/dists/quicklisp/software/cl-charms-20150709-git/src/low-level/curses-grovel" "/home/testgrid/cl-test-grid/work-dir/agent/test-runs/20150718220139-cmu-snapshot-2014-01__20e_unicode_-linux-x86/fasl/ql/dists/quicklisp/software/cl-charms-20150709-git/src/low-level/curses-grovel.c" Output was: /home/testgrid/cl-test-grid/work-dir/agent/test-runs/20150718220139-cmu-snapshot-2014-01__20e_unicode_-linux-x86/fasl/ql/dists/quicklisp/software/cl-charms-20150709-git/src/low-level/curses-grovel.c:6:21: fatal error: ncurses.h: No such file or directory compilation terminated.
(LOAD cl-charms-timer FAIL) ffi-grovel, CFFI-GROVEL:GROVEL-ERROR : Error in function CFFI-GROVEL:GROVEL-ERROR: External process exited with code 1. Command was: "cc" "-m32" "-I/home/testgrid/cl-test-grid/work-dir/agent/quicklisp/dists/quicklisp/software/cffi_0.15.0/" "-o" "/home/testgrid/cl-test-grid/work-dir/agent/test-runs/20150718220139-cmu-snapshot-2014-01__20e_unicode_-linux-x86/fasl/ql/dists/quicklisp/software/cl-charms-20150709-git/src/low-level/curses-grovel" "/home/testgrid/cl-test-grid/work-dir/agent/test-runs/20150718220139-cmu-snapshot-2014-01__20e_unicode_-linux-x86/fasl/ql/dists/quicklisp/software/cl-charms-20150709-git/src/low-level/curses-grovel.c" Output was: /home/testgrid/cl-test-grid/work-dir/agent/test-runs/20150718220139-cmu-snapshot-2014-01__20e_unicode_-linux-x86/fasl/ql/dists/quicklisp/software/cl-charms-20150709-git/src/low-level/curses-grovel.c:6:21: fatal error: ncurses.h: No such file or directory compilation terminated.
qt-libs
(LOAD qt-lib-generator FAIL) C::COMPILER-READ-ERROR : Read error at 412: "(defclass download-op (build-system-op asdf:non-propagating-operation/\)" Reader error at 414 on #<Stream for file "/home/testgrid/cl-test-grid/work-dir/agent/quicklisp/dists/quicklisp/software/qt-libs-20150608-git/system.lisp">: Symbol "NON-PROPAGATING-OPERATION" not found in the ASDF/INTERFACE package.
quicksearch
(LOAD quicksearch FAIL) COMMON-LISP:TYPE-ERROR : #
rock
(LOAD rock FAIL) COMMON-LISP:TYPE-ERROR : #
(LOAD rock-test FAIL) COMMON-LISP:TYPE-ERROR : #
(LOAD rock-web FAIL) COMMON-LISP:TYPE-ERROR : #
s-http-client
(LOAD s-http-client FAIL) COMMON-LISP:TYPE-ERROR : Type-error in KERNEL::OBJECT-NOT-TYPE-ERROR-HANDLER: 536870912 is not of type (UNSIGNED-BYTE 29)
softdrink
(LOAD softdrink FAIL) COMMON-LISP:TYPE-ERROR : #
toot
(LOAD toot FAIL) COMMON-LISP:TYPE-ERROR : #
trivial-download
(LOAD trivial-download FAIL) COMMON-LISP:TYPE-ERROR : #
trivial-extract
(LOAD trivial-extract-test FAIL) COMMON-LISP:TYPE-ERROR : #
twfy
(LOAD twfy FAIL) COMMON-LISP:TYPE-ERROR : #
cmu-snapshot-2014-05-dirty__20e_unicode_-linux-x86cl-charms
(LOAD cl-charms FAIL) ffi-grovel, CFFI-GROVEL:GROVEL-ERROR : Error in function CFFI-GROVEL:GROVEL-ERROR: External process exited with code 1. Command was: "cc" "-m32" "-I/home/testgrid/cl-test-grid/work-dir/agent/quicklisp/dists/quicklisp/software/cffi_0.15.0/" "-o" "/home/testgrid/cl-test-grid/work-dir/agent/test-runs/20150718191111-cmu-snapshot-2014-05-dirty__20e_unicode_-linux-x86/fasl/ql/dists/quicklisp/software/cl-charms-20150709-git/src/low-level/curses-grovel" "/home/testgrid/cl-test-grid/work-dir/agent/test-runs/20150718191111-cmu-snapshot-2014-05-dirty__20e_unicode_-linux-x86/fasl/ql/dists/quicklisp/software/cl-charms-20150709-git/src/low-level/curses-grovel.c" Output was: /home/testgrid/cl-test-grid/work-dir/agent/test-runs/20150718191111-cmu-snapshot-2014-05-dirty__20e_unicode_-linux-x86/fasl/ql/dists/quicklisp/software/cl-charms-20150709-git/src/low-level/curses-grovel.c:6:21: fatal error: ncurses.h: No such file or directory compilation terminated.
(LOAD cl-charms-paint FAIL) ffi-grovel, CFFI-GROVEL:GROVEL-ERROR : Error in function CFFI-GROVEL:GROVEL-ERROR: External process exited with code 1. Command was: "cc" "-m32" "-I/home/testgrid/cl-test-grid/work-dir/agent/quicklisp/dists/quicklisp/software/cffi_0.15.0/" "-o" "/home/testgrid/cl-test-grid/work-dir/agent/test-runs/20150718191111-cmu-snapshot-2014-05-dirty__20e_unicode_-linux-x86/fasl/ql/dists/quicklisp/software/cl-charms-20150709-git/src/low-level/curses-grovel" "/home/testgrid/cl-test-grid/work-dir/agent/test-runs/20150718191111-cmu-snapshot-2014-05-dirty__20e_unicode_-linux-x86/fasl/ql/dists/quicklisp/software/cl-charms-20150709-git/src/low-level/curses-grovel.c" Output was: /home/testgrid/cl-test-grid/work-dir/agent/test-runs/20150718191111-cmu-snapshot-2014-05-dirty__20e_unicode_-linux-x86/fasl/ql/dists/quicklisp/software/cl-charms-20150709-git/src/low-level/curses-grovel.c:6:21: fatal error: ncurses.h: No such file or directory compilation terminated.
(LOAD cl-charms-timer FAIL) ffi-grovel, CFFI-GROVEL:GROVEL-ERROR : Error in function CFFI-GROVEL:GROVEL-ERROR: External process exited with code 1. Command was: "cc" "-m32" "-I/home/testgrid/cl-test-grid/work-dir/agent/quicklisp/dists/quicklisp/software/cffi_0.15.0/" "-o" "/home/testgrid/cl-test-grid/work-dir/agent/test-runs/20150718191111-cmu-snapshot-2014-05-dirty__20e_unicode_-linux-x86/fasl/ql/dists/quicklisp/software/cl-charms-20150709-git/src/low-level/curses-grovel" "/home/testgrid/cl-test-grid/work-dir/agent/test-runs/20150718191111-cmu-snapshot-2014-05-dirty__20e_unicode_-linux-x86/fasl/ql/dists/quicklisp/software/cl-charms-20150709-git/src/low-level/curses-grovel.c" Output was: /home/testgrid/cl-test-grid/work-dir/agent/test-runs/20150718191111-cmu-snapshot-2014-05-dirty__20e_unicode_-linux-x86/fasl/ql/dists/quicklisp/software/cl-charms-20150709-git/src/low-level/curses-grovel.c:6:21: fatal error: ncurses.h: No such file or directory compilation terminated.
qt-libs
(LOAD qt-lib-generator FAIL) C::COMPILER-READ-ERROR : Read error at 412: "(defclass download-op (build-system-op asdf:non-propagating-operation/\)" Reader error at 414 on #<Stream for file "/home/testgrid/cl-test-grid/work-dir/agent/quicklisp/dists/quicklisp/software/qt-libs-20150608-git/system.lisp">: Symbol "NON-PROPAGATING-OPERATION" not found in the ASDF/INTERFACE package.
quicksearch
(LOAD quicksearch FAIL) COMMON-LISP:TYPE-ERROR : #
rock
(LOAD rock FAIL) COMMON-LISP:TYPE-ERROR : #
(LOAD rock-test FAIL) COMMON-LISP:TYPE-ERROR : #
(LOAD rock-web FAIL) COMMON-LISP:TYPE-ERROR : #
s-http-client
(LOAD s-http-client FAIL) COMMON-LISP:TYPE-ERROR : Type-error in KERNEL::OBJECT-NOT-TYPE-ERROR-HANDLER: 536870912 is not of type (UNSIGNED-BYTE 29)
softdrink
(LOAD softdrink FAIL) COMMON-LISP:TYPE-ERROR : #
toot
(LOAD toot FAIL) COMMON-LISP:TYPE-ERROR : #
trivial-download
(LOAD trivial-download FAIL) COMMON-LISP:TYPE-ERROR : #
trivial-extract
(LOAD trivial-extract-test FAIL) COMMON-LISP:TYPE-ERROR : #
twfy
(LOAD twfy FAIL) COMMON-LISP:TYPE-ERROR : #
cmu-snapshot-2014-12___20f_unicode_-linux-x86beirc
(LOAD beirc FAIL) ASDF/FIND-SYSTEM:LOAD-SYSTEM-DEFINITION-ERROR : Error while trying to load definition for system mcclim from pathname /home/testgrid/cl-test-grid/work-dir/agent/quicklisp/dists/quicklisp/software/mcclim-20150709-git/mcclim.asd: Illegal function call.
cl-charms
(LOAD cl-charms FAIL) ffi-grovel, CFFI-GROVEL:GROVEL-ERROR : Error in function CFFI-GROVEL:GROVEL-ERROR: External process exited with code 1. Command was: "cc" "-m32" "-I/home/testgrid/cl-test-grid/work-dir/agent/quicklisp/dists/quicklisp/software/cffi_0.15.0/" "-o" "/home/testgrid/cl-test-grid/work-dir/agent/test-runs/20150717002750-cmu-snapshot-2014-12___20f_unicode_-linux-x86/fasl/ql/dists/quicklisp/software/cl-charms-20150709-git/src/low-level/curses-grovel" "/home/testgrid/cl-test-grid/work-dir/agent/test-runs/20150717002750-cmu-snapshot-2014-12___20f_unicode_-linux-x86/fasl/ql/dists/quicklisp/software/cl-charms-20150709-git/src/low-level/curses-grovel.c" Output was: /home/testgrid/cl-test-grid/work-dir/agent/test-runs/20150717002750-cmu-snapshot-2014-12___20f_unicode_-linux-x86/fasl/ql/dists/quicklisp/software/cl-charms-20150709-git/src/low-level/curses-grovel.c:6:21: fatal error: ncurses.h: No such file or directory compilation terminated.
(LOAD cl-charms-paint FAIL) ffi-grovel, CFFI-GROVEL:GROVEL-ERROR : Error in function CFFI-GROVEL:GROVEL-ERROR: External process exited with code 1. Command was: "cc" "-m32" "-I/home/testgrid/cl-test-grid/work-dir/agent/quicklisp/dists/quicklisp/software/cffi_0.15.0/" "-o" "/home/testgrid/cl-test-grid/work-dir/agent/test-runs/20150717002750-cmu-snapshot-2014-12___20f_unicode_-linux-x86/fasl/ql/dists/quicklisp/software/cl-charms-20150709-git/src/low-level/curses-grovel" "/home/testgrid/cl-test-grid/work-dir/agent/test-runs/20150717002750-cmu-snapshot-2014-12___20f_unicode_-linux-x86/fasl/ql/dists/quicklisp/software/cl-charms-20150709-git/src/low-level/curses-grovel.c" Output was: /home/testgrid/cl-test-grid/work-dir/agent/test-runs/20150717002750-cmu-snapshot-2014-12___20f_unicode_-linux-x86/fasl/ql/dists/quicklisp/software/cl-charms-20150709-git/src/low-level/curses-grovel.c:6:21: fatal error: ncurses.h: No such file or directory compilation terminated.
(LOAD cl-charms-timer FAIL) ffi-grovel, CFFI-GROVEL:GROVEL-ERROR : Error in function CFFI-GROVEL:GROVEL-ERROR: External process exited with code 1. Command was: "cc" "-m32" "-I/home/testgrid/cl-test-grid/work-dir/agent/quicklisp/dists/quicklisp/software/cffi_0.15.0/" "-o" "/home/testgrid/cl-test-grid/work-dir/agent/test-runs/20150717002750-cmu-snapshot-2014-12___20f_unicode_-linux-x86/fasl/ql/dists/quicklisp/software/cl-charms-20150709-git/src/low-level/curses-grovel" "/home/testgrid/cl-test-grid/work-dir/agent/test-runs/20150717002750-cmu-snapshot-2014-12___20f_unicode_-linux-x86/fasl/ql/dists/quicklisp/software/cl-charms-20150709-git/src/low-level/curses-grovel.c" Output was: /home/testgrid/cl-test-grid/work-dir/agent/test-runs/20150717002750-cmu-snapshot-2014-12___20f_unicode_-linux-x86/fasl/ql/dists/quicklisp/software/cl-charms-20150709-git/src/low-level/curses-grovel.c:6:21: fatal error: ncurses.h: No such file or directory compilation terminated.
cl-libusb
(LOAD cl-libusb FAIL) C::COMPILER-ERROR : (during macroexpansion) Error in function FIND-PARAMETER: Parameter G2:G1 not defined.
elephant
(LOAD ele-bdb FAIL) COMMON-LISP:SIMPLE-ERROR : Error in function ALIEN::%PARSE-ALIEN-TYPE: Unknown alien type: UNSIGNED-CHAR
http-body
(LOAD http-body FAIL) C::COMPILER-ERROR : (during macroexpansion) Error in function LISP::ASSERT-ERROR: The assertion (OR (NULL OPTS) (EQ (POP TYPE-LIST) '&OPTIONAL)) failed.
(LOAD http-body-test FAIL) C::COMPILER-ERROR : (during macroexpansion) Error in function LISP::ASSERT-ERROR: The assertion (OR (NULL OPTS) (EQ (POP TYPE-LIST) '&OPTIONAL)) failed.
jonathan
(LOAD jonathan FAIL) C::COMPILER-ERROR : (during macroexpansion) Error in function LISP::ASSERT-ERROR: The assertion (OR (NULL OPTS) (EQ (POP TYPE-LIST) '&OPTIONAL)) failed.
(LOAD jonathan-test FAIL) C::COMPILER-ERROR : (during macroexpansion) Error in function LISP::ASSERT-ERROR: The assertion (OR (NULL OPTS) (EQ (POP TYPE-LIST) '&OPTIONAL)) failed.
lack
(LOAD lack-request FAIL) C::COMPILER-ERROR : (during macroexpansion) Error in function LISP::ASSERT-ERROR: The assertion (OR (NULL OPTS) (EQ (POP TYPE-LIST) '&OPTIONAL)) failed.
ecl-13.5.1-unknown-linux-i686-bytecodecl-charms
(LOAD cl-charms FAIL) ASDF/FIND-SYSTEM:LOAD-SYSTEM-DEFINITION-ERROR : Error while trying to load definition for system cl-charms from pathname /home/testgrid/cl-test-grid/work-dir/agent/quicklisp/dists/quicklisp/software/cl-charms-20150709-git/cl-charms.asd: The variable C::*CC-FLAGS* is unbound.
(LOAD cl-charms-paint FAIL) ASDF/FIND-SYSTEM:LOAD-SYSTEM-DEFINITION-ERROR : Error while trying to load definition for system cl-charms from pathname /home/testgrid/cl-test-grid/work-dir/agent/quicklisp/dists/quicklisp/software/cl-charms-20150709-git/cl-charms.asd: The variable C::*CC-FLAGS* is unbound.
(LOAD cl-charms-timer FAIL) ASDF/FIND-SYSTEM:LOAD-SYSTEM-DEFINITION-ERROR : Error while trying to load definition for system cl-charms from pathname /home/testgrid/cl-test-grid/work-dir/agent/quicklisp/dists/quicklisp/software/cl-charms-20150709-git/cl-charms.asd: The variable C::*CC-FLAGS* is unbound.
cl-rrt
croatoan
(LOAD croatoan FAIL) SI::SIMPLE-PACKAGE-ERROR : There exists no package with name "SB-GRAY"
rock
shelly
(LOAD shelly FAIL) ASDF/FIND-SYSTEM:LOAD-SYSTEM-DEFINITION-ERROR : Error while trying to load definition for system trivial-signal from pathname /home/testgrid/cl-test-grid/work-dir/agent/quicklisp/dists/quicklisp/software/trivial-signal-20150709-git/trivial-signal.asd: The variable C::*CC-FLAGS* is unbound.
(LOAD shelly-test FAIL) ASDF/FIND-SYSTEM:LOAD-SYSTEM-DEFINITION-ERROR : Error while trying to load definition for system trivial-signal from pathname /home/testgrid/cl-test-grid/work-dir/agent/quicklisp/dists/quicklisp/software/trivial-signal-20150709-git/trivial-signal.asd: The variable C::*CC-FLAGS* is unbound.
staple
(LOAD staple FAIL) COMMON-LISP:SIMPLE-ERROR : Cannot find the external symbol ENOUGH-PATHNAME in #<"UIOP/DRIVER" package>.
(LOAD staple-server FAIL) COMMON-LISP:SIMPLE-ERROR : Cannot find the external symbol ENOUGH-PATHNAME in #<"UIOP/DRIVER" package>.
trivial-signal
(LOAD trivial-signal FAIL) ASDF/FIND-SYSTEM:LOAD-SYSTEM-DEFINITION-ERROR : Error while trying to load definition for system trivial-signal from pathname /home/testgrid/cl-test-grid/work-dir/agent/quicklisp/dists/quicklisp/software/trivial-signal-20150709-git/trivial-signal.asd: The variable C::*CC-FLAGS* is unbound.
ecl-13.5.1-unknown-linux-i686-lisp-to-ccl-charms
(LOAD cl-charms FAIL) ffi-grovel, CFFI-GROVEL:GROVEL-ERROR : External process exited with code 1. Command was: "cc" "-m32" " -D_GNU_SOURCE -D_FILE_OFFSET_BITS=64 -g -O2 -fPIC -D_GNU_SOURCE -D_FILE_OFFSET_BITS=64 -g -O2 -fPIC -D_THREAD_SAFE -Dlinux" "-I/home/testgrid/cl-test-grid/work-dir/agent/quicklisp/dists/quicklisp/software/cffi_0.15.0/" "-o" "/home/testgrid/cl-test-grid/work-dir/agent/test-runs/20150717092715-ecl-13.5.1-unknown-linux-i686-lisp-to-c/fasl/ql/dists/quicklisp/software/cl-charms-20150709-git/src/low-level/curses-grovel" "/home/testgrid/cl-test-grid/work-dir/agent/test-runs/20150717092715-ecl-13.5.1-unknown-linux-i686-lisp-to-c/fasl/ql/dists/quicklisp/software/cl-charms-20150709-git/src/low-level/curses-grovel.c" Output was: <see above>
(LOAD cl-charms-paint FAIL) ffi-grovel, CFFI-GROVEL:GROVEL-ERROR : External process exited with code 1. Command was: "cc" "-m32" " -D_GNU_SOURCE -D_FILE_OFFSET_BITS=64 -g -O2 -fPIC -D_GNU_SOURCE -D_FILE_OFFSET_BITS=64 -g -O2 -fPIC -D_THREAD_SAFE -Dlinux" "-I/home/testgrid/cl-test-grid/work-dir/agent/quicklisp/dists/quicklisp/software/cffi_0.15.0/" "-o" "/home/testgrid/cl-test-grid/work-dir/agent/test-runs/20150717092715-ecl-13.5.1-unknown-linux-i686-lisp-to-c/fasl/ql/dists/quicklisp/software/cl-charms-20150709-git/src/low-level/curses-grovel" "/home/testgrid/cl-test-grid/work-dir/agent/test-runs/20150717092715-ecl-13.5.1-unknown-linux-i686-lisp-to-c/fasl/ql/dists/quicklisp/software/cl-charms-20150709-git/src/low-level/curses-grovel.c" Output was: <see above>
(LOAD cl-charms-timer FAIL) ffi-grovel, CFFI-GROVEL:GROVEL-ERROR : External process exited with code 1. Command was: "cc" "-m32" " -D_GNU_SOURCE -D_FILE_OFFSET_BITS=64 -g -O2 -fPIC -D_GNU_SOURCE -D_FILE_OFFSET_BITS=64 -g -O2 -fPIC -D_THREAD_SAFE -Dlinux" "-I/home/testgrid/cl-test-grid/work-dir/agent/quicklisp/dists/quicklisp/software/cffi_0.15.0/" "-o" "/home/testgrid/cl-test-grid/work-dir/agent/test-runs/20150717092715-ecl-13.5.1-unknown-linux-i686-lisp-to-c/fasl/ql/dists/quicklisp/software/cl-charms-20150709-git/src/low-level/curses-grovel" "/home/testgrid/cl-test-grid/work-dir/agent/test-runs/20150717092715-ecl-13.5.1-unknown-linux-i686-lisp-to-c/fasl/ql/dists/quicklisp/software/cl-charms-20150709-git/src/low-level/curses-grovel.c" Output was: <see above>
crane
croatoan
(LOAD croatoan FAIL) UIOP/LISP-BUILD:COMPILE-FILE-ERROR : COMPILE-FILE-ERROR while compiling #<cl-source-file "croatoan" "source" "package">
ecl-15.2.21-ee989b97-linux-i686-bytecodecl-charms
(LOAD cl-charms FAIL) ASDF/FIND-SYSTEM:LOAD-SYSTEM-DEFINITION-ERROR : Error while trying to load definition for system cl-charms from pathname /home/testgrid/cl-test-grid/work-dir/agent/quicklisp/dists/quicklisp/software/cl-charms-20150709-git/cl-charms.asd: The variable C::*CC-FLAGS* is unbound.
(LOAD cl-charms-paint FAIL) ASDF/FIND-SYSTEM:LOAD-SYSTEM-DEFINITION-ERROR : Error while trying to load definition for system cl-charms from pathname /home/testgrid/cl-test-grid/work-dir/agent/quicklisp/dists/quicklisp/software/cl-charms-20150709-git/cl-charms.asd: The variable C::*CC-FLAGS* is unbound.
(LOAD cl-charms-timer FAIL) ASDF/FIND-SYSTEM:LOAD-SYSTEM-DEFINITION-ERROR : Error while trying to load definition for system cl-charms from pathname /home/testgrid/cl-test-grid/work-dir/agent/quicklisp/dists/quicklisp/software/cl-charms-20150709-git/cl-charms.asd: The variable C::*CC-FLAGS* is unbound.
croatoan
(LOAD croatoan FAIL) SI::SIMPLE-PACKAGE-ERROR : There exists no package with name "SB-GRAY"
rock
shelly
(LOAD shelly FAIL) ASDF/FIND-SYSTEM:LOAD-SYSTEM-DEFINITION-ERROR : Error while trying to load definition for system trivial-signal from pathname /home/testgrid/cl-test-grid/work-dir/agent/quicklisp/dists/quicklisp/software/trivial-signal-20150709-git/trivial-signal.asd: The variable C::*CC-FLAGS* is unbound.
(LOAD shelly-test FAIL) ASDF/FIND-SYSTEM:LOAD-SYSTEM-DEFINITION-ERROR : Error while trying to load definition for system trivial-signal from pathname /home/testgrid/cl-test-grid/work-dir/agent/quicklisp/dists/quicklisp/software/trivial-signal-20150709-git/trivial-signal.asd: The variable C::*CC-FLAGS* is unbound.
trivial-signal
(LOAD trivial-signal FAIL) ASDF/FIND-SYSTEM:LOAD-SYSTEM-DEFINITION-ERROR : Error while trying to load definition for system trivial-signal from pathname /home/testgrid/cl-test-grid/work-dir/agent/quicklisp/dists/quicklisp/software/trivial-signal-20150709-git/trivial-signal.asd: The variable C::*CC-FLAGS* is unbound.
ecl-15.2.21-ee989b97-linux-i686-lisp-to-ccl-charms
(LOAD cl-charms FAIL) ffi-grovel, CFFI-GROVEL:GROVEL-ERROR : External process exited with code 1. Command was: "cc" "-m32" " -D_GNU_SOURCE -D_FILE_OFFSET_BITS=64 -g -O2 -fPIC -D_THREAD_SAFE -Dlinux" "-I/home/testgrid/cl-test-grid/work-dir/agent/quicklisp/dists/quicklisp/software/cffi_0.15.0/" "-o" "/home/testgrid/cl-test-grid/work-dir/agent/test-runs/20150719081238-ecl-15.2.21-ee989b97-linux-i686-lisp-to-c/fasl/ql/dists/quicklisp/software/cl-charms-20150709-git/src/low-level/curses-grovel" "/home/testgrid/cl-test-grid/work-dir/agent/test-runs/20150719081238-ecl-15.2.21-ee989b97-linux-i686-lisp-to-c/fasl/ql/dists/quicklisp/software/cl-charms-20150709-git/src/low-level/curses-grovel.c" Output was: <see above>
(LOAD cl-charms-paint FAIL) ffi-grovel, CFFI-GROVEL:GROVEL-ERROR : External process exited with code 1. Command was: "cc" "-m32" " -D_GNU_SOURCE -D_FILE_OFFSET_BITS=64 -g -O2 -fPIC -D_THREAD_SAFE -Dlinux" "-I/home/testgrid/cl-test-grid/work-dir/agent/quicklisp/dists/quicklisp/software/cffi_0.15.0/" "-o" "/home/testgrid/cl-test-grid/work-dir/agent/test-runs/20150719081238-ecl-15.2.21-ee989b97-linux-i686-lisp-to-c/fasl/ql/dists/quicklisp/software/cl-charms-20150709-git/src/low-level/curses-grovel" "/home/testgrid/cl-test-grid/work-dir/agent/test-runs/20150719081238-ecl-15.2.21-ee989b97-linux-i686-lisp-to-c/fasl/ql/dists/quicklisp/software/cl-charms-20150709-git/src/low-level/curses-grovel.c" Output was: <see above>
(LOAD cl-charms-timer FAIL) ffi-grovel, CFFI-GROVEL:GROVEL-ERROR : External process exited with code 1. Command was: "cc" "-m32" " -D_GNU_SOURCE -D_FILE_OFFSET_BITS=64 -g -O2 -fPIC -D_THREAD_SAFE -Dlinux" "-I/home/testgrid/cl-test-grid/work-dir/agent/quicklisp/dists/quicklisp/software/cffi_0.15.0/" "-o" "/home/testgrid/cl-test-grid/work-dir/agent/test-runs/20150719081238-ecl-15.2.21-ee989b97-linux-i686-lisp-to-c/fasl/ql/dists/quicklisp/software/cl-charms-20150709-git/src/low-level/curses-grovel" "/home/testgrid/cl-test-grid/work-dir/agent/test-runs/20150719081238-ecl-15.2.21-ee989b97-linux-i686-lisp-to-c/fasl/ql/dists/quicklisp/software/cl-charms-20150709-git/src/low-level/curses-grovel.c" Output was: <see above>
clack-errors
croatoan
(LOAD croatoan FAIL) UIOP/LISP-BUILD:COMPILE-FILE-ERROR : COMPILE-FILE-ERROR while compiling #<cl-source-file "croatoan" "source" "package">
sbcl-1.0.58-linux-x86cl-ansi-term
(LOAD cl-ansi-term FAIL) SB-INT:STREAM-DECODING-ERROR : :ASCII stream decoding error on #<SB-SYS:FD-STREAM for "file /home/testgrid/cl-test-grid/work-dir/agent/quicklisp/dists/quicklisp/software/cl-ansi-term-20150709-git/cl-ansi-term.lisp" {B5F0029}>: the octet sequence #(194) cannot be decoded.
cl-charms
(LOAD cl-charms FAIL) ffi-grovel, CFFI-GROVEL:GROVEL-ERROR : External process exited with code 1. Command was: "cc" "-m32" "-I/home/testgrid/cl-test-grid/work-dir/agent/quicklisp/dists/quicklisp/software/cffi_0.15.0/" "-o" "/home/testgrid/cl-test-grid/work-dir/agent/test-runs/20150718152514-sbcl-1.0.58-linux-x86/fasl/ql/dists/quicklisp/software/cl-charms-20150709-git/src/low-level/curses-grovel" "/home/testgrid/cl-test-grid/work-dir/agent/test-runs/20150718152514-sbcl-1.0.58-linux-x86/fasl/ql/dists/quicklisp/software/cl-charms-20150709-git/src/low-level/curses-grovel.c" Output was: /home/testgrid/cl-test-grid/work-dir/agent/test-runs/20150718152514-sbcl-1.0.58-linux-x86/fasl/ql/dists/quicklisp/software/cl-charms-20150709-git/src/low-level/curses-grovel.c:6:21: fatal error: ncurses.h: No such file or directory compilation terminated.
(LOAD cl-charms-paint FAIL) ffi-grovel, CFFI-GROVEL:GROVEL-ERROR : External process exited with code 1. Command was: "cc" "-m32" "-I/home/testgrid/cl-test-grid/work-dir/agent/quicklisp/dists/quicklisp/software/cffi_0.15.0/" "-o" "/home/testgrid/cl-test-grid/work-dir/agent/test-runs/20150718152514-sbcl-1.0.58-linux-x86/fasl/ql/dists/quicklisp/software/cl-charms-20150709-git/src/low-level/curses-grovel" "/home/testgrid/cl-test-grid/work-dir/agent/test-runs/20150718152514-sbcl-1.0.58-linux-x86/fasl/ql/dists/quicklisp/software/cl-charms-20150709-git/src/low-level/curses-grovel.c" Output was: /home/testgrid/cl-test-grid/work-dir/agent/test-runs/20150718152514-sbcl-1.0.58-linux-x86/fasl/ql/dists/quicklisp/software/cl-charms-20150709-git/src/low-level/curses-grovel.c:6:21: fatal error: ncurses.h: No such file or directory compilation terminated.
(LOAD cl-charms-timer FAIL) ffi-grovel, CFFI-GROVEL:GROVEL-ERROR : External process exited with code 1. Command was: "cc" "-m32" "-I/home/testgrid/cl-test-grid/work-dir/agent/quicklisp/dists/quicklisp/software/cffi_0.15.0/" "-o" "/home/testgrid/cl-test-grid/work-dir/agent/test-runs/20150718152514-sbcl-1.0.58-linux-x86/fasl/ql/dists/quicklisp/software/cl-charms-20150709-git/src/low-level/curses-grovel" "/home/testgrid/cl-test-grid/work-dir/agent/test-runs/20150718152514-sbcl-1.0.58-linux-x86/fasl/ql/dists/quicklisp/software/cl-charms-20150709-git/src/low-level/curses-grovel.c" Output was: /home/testgrid/cl-test-grid/work-dir/agent/test-runs/20150718152514-sbcl-1.0.58-linux-x86/fasl/ql/dists/quicklisp/software/cl-charms-20150709-git/src/low-level/curses-grovel.c:6:21: fatal error: ncurses.h: No such file or directory compilation terminated.
clack
(LOAD clack FAIL) ASDF:LOAD-SYSTEM-DEFINITION-ERROR : Error while trying to load definition for system lack from pathname /home/testgrid/cl-test-grid/work-dir/agent/quicklisp/dists/quicklisp/software/lack-20150608-git/lack.asd: READ error during COMPILE-FILE: :ASCII stream decoding error on #<SB-SYS:FD-STREAM for "file /home/testgrid/cl-test-grid/work-dir/agent/quicklisp/dists/quicklisp/software/lack-20150608-git/README.md" {BDF8B69}>: the octet sequence #(226) cannot be decoded. (in form starting at line: 15, column: 23, file-position: 264)
com.informatimago
(LOAD com.informatimago.clisp.test FAIL) ASDF:LOAD-SYSTEM-DEFINITION-ERROR : Error while trying to load definition for system com.informatimago.clisp.test from pathname /home/testgrid/cl-test-grid/work-dir/agent/quicklisp/dists/quicklisp/software/com.informatimago-20150407-git/clisp/com.informatimago.clisp.test.asd: Illegal function call in method body: ((DECLARE TEST-OP) ((IGNORE OPERATION SYSTEM) (EQL #<SYSTEM "com.informatimago.clisp.test">)))
(LOAD com.informatimago.clmisc.test FAIL) ASDF:LOAD-SYSTEM-DEFINITION-ERROR : Error while trying to load definition for system com.informatimago.clmisc.test from pathname /home/testgrid/cl-test-grid/work-dir/agent/quicklisp/dists/quicklisp/software/com.informatimago-20150407-git/clmisc/com.informatimago.clmisc.test.asd: READ error during COMPILE-FILE: Package ASDF/LISP-ACTION does not exist. Line: 61, Column: 43, File-Position: 2569 Stream: #<SB-SYS:FD-STREAM for "file /home/testgrid/cl-test-grid/work-dir/agent/quicklisp/dists/quicklisp/software/com.informatimago-20150407-git/clmisc/com.informatimago.clmisc.test.asd" {B09CEC9}>
(LOAD com.informatimago.common-lisp.apple-file.test FAIL) ASDF:LOAD-SYSTEM-DEFINITION-ERROR : Error while trying to load definition for system com.informatimago.common-lisp.apple-file.test from pathname /home/testgrid/cl-test-grid/work-dir/agent/quicklisp/dists/quicklisp/software/com.informatimago-20150407-git/common-lisp/apple-file/com.informatimago.common-lisp.apple-file.test.asd: READ error during COMPILE-FILE: Package ASDF/LISP-ACTION does not exist. Line: 61, Column: 43, File-Position: 2672 Stream: #<SB-SYS:FD-STREAM for "file /home/testgrid/cl-test-grid/work-dir/agent/quicklisp/dists/quicklisp/software/com.informatimago-20150407-git/common-lisp/apple-file/com.informatimago.common-lisp.apple-file.test.asd" {B0A0E09}>
(LOAD com.informatimago.common-lisp.arithmetic.test FAIL) ASDF:LOAD-SYSTEM-DEFINITION-ERROR : Error while trying to load definition for system com.informatimago.common-lisp.arithmetic.test from pathname /home/testgrid/cl-test-grid/work-dir/agent/quicklisp/dists/quicklisp/software/com.informatimago-20150407-git/common-lisp/arithmetic/com.informatimago.common-lisp.arithmetic.test.asd: READ error during COMPILE-FILE: Package ASDF/LISP-ACTION does not exist. Line: 61, Column: 43, File-Position: 2631 Stream: #<SB-SYS:FD-STREAM for "file /home/testgrid/cl-test-grid/work-dir/agent/quicklisp/dists/quicklisp/software/com.informatimago-20150407-git/common-lisp/arithmetic/com.informatimago.common-lisp.arithmetic.test.asd" {B0A0E09}>
(LOAD com.informatimago.common-lisp.bank.test FAIL) ASDF:LOAD-SYSTEM-DEFINITION-ERROR : Error while trying to load definition for system com.informatimago.common-lisp.bank.test from pathname /home/testgrid/cl-test-grid/work-dir/agent/quicklisp/dists/quicklisp/software/com.informatimago-20150407-git/common-lisp/bank/com.informatimago.common-lisp.bank.test.asd: READ error during COMPILE-FILE: Package ASDF/LISP-ACTION does not exist. Line: 61, Column: 43, File-Position: 2589 Stream: #<SB-SYS:FD-STREAM for "file /home/testgrid/cl-test-grid/work-dir/agent/quicklisp/dists/quicklisp/software/com.informatimago-20150407-git/common-lisp/bank/com.informatimago.common-lisp.bank.test.asd" {B0A0369}>
(LOAD com.informatimago.common-lisp.cesarum.test FAIL) ASDF:LOAD-SYSTEM-DEFINITION-ERROR : Error while trying to load definition for system com.informatimago.common-lisp.cesarum.test from pathname /home/testgrid/cl-test-grid/work-dir/agent/quicklisp/dists/quicklisp/software/com.informatimago-20150407-git/common-lisp/cesarum/com.informatimago.common-lisp.cesarum.test.asd: READ error during COMPILE-FILE: Package UIOP does not exist. Line: 90, Column: 33, File-Position: 4697 Stream: #<SB-SYS:FD-STREAM for "file /home/testgrid/cl-test-grid/work-dir/agent/quicklisp/dists/quicklisp/software/com.informatimago-20150407-git/common-lisp/cesarum/com.informatimago.common-lisp.cesarum.test.asd" {B0A0DA1}>
(LOAD com.informatimago.common-lisp.csv.test FAIL) ASDF:LOAD-SYSTEM-DEFINITION-ERROR : Error while trying to load definition for system com.informatimago.common-lisp.csv.test from pathname /home/testgrid/cl-test-grid/work-dir/agent/quicklisp/dists/quicklisp/software/com.informatimago-20150407-git/common-lisp/csv/com.informatimago.common-lisp.csv.test.asd: READ error during COMPILE-FILE: Package ASDF/LISP-ACTION does not exist. Line: 61, Column: 43, File-Position: 2582 Stream: #<SB-SYS:FD-STREAM for "file /home/testgrid/cl-test-grid/work-dir/agent/quicklisp/dists/quicklisp/software/com.informatimago-20150407-git/common-lisp/csv/com.informatimago.common-lisp.csv.test.asd" {B0A0361}>
(LOAD com.informatimago.common-lisp.data-encoding.test FAIL) ASDF:LOAD-SYSTEM-DEFINITION-ERROR : Error while trying to load definition for system com.informatimago.common-lisp.data-encoding.test from pathname /home/testgrid/cl-test-grid/work-dir/agent/quicklisp/dists/quicklisp/software/com.informatimago-20150407-git/common-lisp/data-encoding/com.informatimago.common-lisp.data-encoding.test.asd: READ error during COMPILE-FILE: Package ASDF/LISP-ACTION does not exist. Line: 63, Column: 43, File-Position: 2821 Stream: #<SB-SYS:FD-STREAM for "file /home/testgrid/cl-test-grid/work-dir/agent/quicklisp/dists/quicklisp/software/com.informatimago-20150407-git/common-lisp/data-encoding/com.informatimago.common-lisp.data-encoding.test.asd" {B0A1E71}>
(LOAD com.informatimago.common-lisp.diagram.test FAIL) ASDF:LOAD-SYSTEM-DEFINITION-ERROR : Error while trying to load definition for system com.informatimago.common-lisp.diagram.test from pathname /home/testgrid/cl-test-grid/work-dir/agent/quicklisp/dists/quicklisp/software/com.informatimago-20150407-git/common-lisp/diagram/com.informatimago.common-lisp.diagram.test.asd: READ error during COMPILE-FILE: Package ASDF/LISP-ACTION does not exist. Line: 61, Column: 43, File-Position: 2610 Stream: #<SB-SYS:FD-STREAM for "file /home/testgrid/cl-test-grid/work-dir/agent/quicklisp/dists/quicklisp/software/com.informatimago-20150407-git/common-lisp/diagram/com.informatimago.common-lisp.diagram.test.asd" {B0A0DA1}>
(LOAD com.informatimago.common-lisp.ed.test FAIL) ASDF:LOAD-SYSTEM-DEFINITION-ERROR : Error while trying to load definition for system com.informatimago.common-lisp.ed.test from pathname /home/testgrid/cl-test-grid/work-dir/agent/quicklisp/dists/quicklisp/software/com.informatimago-20150407-git/common-lisp/ed/com.informatimago.common-lisp.ed.test.asd: READ error during COMPILE-FILE: Package ASDF/LISP-ACTION does not exist. Line: 61, Column: 43, File-Position: 2575 Stream: #<SB-SYS:FD-STREAM for "file /home/testgrid/cl-test-grid/work-dir/agent/quicklisp/dists/quicklisp/software/com.informatimago-20150407-git/common-lisp/ed/com.informatimago.common-lisp.ed.test.asd" {B0A0359}>
(LOAD com.informatimago.common-lisp.graphviz.test FAIL) ASDF:LOAD-SYSTEM-DEFINITION-ERROR : Error while trying to load definition for system com.informatimago.common-lisp.graphviz.test from pathname /home/testgrid/cl-test-grid/work-dir/agent/quicklisp/dists/quicklisp/software/com.informatimago-20150407-git/common-lisp/graphviz/com.informatimago.common-lisp.graphviz.test.asd: READ error during COMPILE-FILE: Package ASDF/LISP-ACTION does not exist. Line: 61, Column: 43, File-Position: 2617 Stream: #<SB-SYS:FD-STREAM for "file /home/testgrid/cl-test-grid/work-dir/agent/quicklisp/dists/quicklisp/software/com.informatimago-20150407-git/common-lisp/graphviz/com.informatimago.common-lisp.graphviz.test.asd" {B0A0DC9}>
(LOAD com.informatimago.common-lisp.heap.test FAIL) ASDF:LOAD-SYSTEM-DEFINITION-ERROR : Error while trying to load definition for system com.informatimago.common-lisp.heap.test from pathname /home/testgrid/cl-test-grid/work-dir/agent/quicklisp/dists/quicklisp/software/com.informatimago-20150407-git/common-lisp/heap/com.informatimago.common-lisp.heap.test.asd: READ error during COMPILE-FILE: Package ASDF/LISP-ACTION does not exist. Line: 61, Column: 43, File-Position: 2589 Stream: #<SB-SYS:FD-STREAM for "file /home/testgrid/cl-test-grid/work-dir/agent/quicklisp/dists/quicklisp/software/com.informatimago-20150407-git/common-lisp/heap/com.informatimago.common-lisp.heap.test.asd" {B0A0369}>
(LOAD com.informatimago.common-lisp.html-base.test FAIL) ASDF:LOAD-SYSTEM-DEFINITION-ERROR : Error while trying to load definition for system com.informatimago.common-lisp.html-base.test from pathname /home/testgrid/cl-test-grid/work-dir/agent/quicklisp/dists/quicklisp/software/com.informatimago-20150407-git/common-lisp/html-base/com.informatimago.common-lisp.html-base.test.asd: READ error during COMPILE-FILE: Package ASDF/LISP-ACTION does not exist. Line: 61, Column: 43, File-Position: 2624 Stream: #<SB-SYS:FD-STREAM for "file /home/testgrid/cl-test-grid/work-dir/agent/quicklisp/dists/quicklisp/software/com.informatimago-20150407-git/common-lisp/html-base/com.informatimago.common-lisp.html-base.test.asd" {B0A0DE9}>
(LOAD com.informatimago.common-lisp.html-generator.test FAIL) ASDF:LOAD-SYSTEM-DEFINITION-ERROR : Error while trying to load definition for system com.informatimago.common-lisp.html-generator.test from pathname /home/testgrid/cl-test-grid/work-dir/agent/quicklisp/dists/quicklisp/software/com.informatimago-20150407-git/common-lisp/html-generator/com.informatimago.common-lisp.html-generator.test.asd: READ error during COMPILE-FILE: Package ASDF/LISP-ACTION does not exist. Line: 61, Column: 43, File-Position: 2659 Stream: #<SB-SYS:FD-STREAM for "file /home/testgrid/cl-test-grid/work-dir/agent/quicklisp/dists/quicklisp/software/com.informatimago-20150407-git/common-lisp/html-generator/com.informatimago.common-lisp.html-generator.test.asd" {B0A2089}>
(LOAD com.informatimago.common-lisp.html-parser.test FAIL) ASDF:LOAD-SYSTEM-DEFINITION-ERROR : Error while trying to load definition for system com.informatimago.common-lisp.html-parser.test from pathname /home/testgrid/cl-test-grid/work-dir/agent/quicklisp/dists/quicklisp/software/com.informatimago-20150407-git/common-lisp/html-parser/com.informatimago.common-lisp.html-parser.test.asd: READ error during COMPILE-FILE: Package ASDF/LISP-ACTION does not exist. Line: 61, Column: 43, File-Position: 2638 Stream: #<SB-SYS:FD-STREAM for "file /home/testgrid/cl-test-grid/work-dir/agent/quicklisp/dists/quicklisp/software/com.informatimago-20150407-git/common-lisp/html-parser/com.informatimago.common-lisp.html-parser.test.asd" {B0A0E29}>
(LOAD com.informatimago.common-lisp.http.test FAIL) ASDF:LOAD-SYSTEM-DEFINITION-ERROR : Error while trying to load definition for system com.informatimago.common-lisp.http.test from pathname /home/testgrid/cl-test-grid/work-dir/agent/quicklisp/dists/quicklisp/software/com.informatimago-20150407-git/common-lisp/http/com.informatimago.common-lisp.http.test.asd: READ error during COMPILE-FILE: Package ASDF/LISP-ACTION does not exist. Line: 61, Column: 43, File-Position: 2589 Stream: #<SB-SYS:FD-STREAM for "file /home/testgrid/cl-test-grid/work-dir/agent/quicklisp/dists/quicklisp/software/com.informatimago-20150407-git/common-lisp/http/com.informatimago.common-lisp.http.test.asd" {B0A0369}>
(LOAD com.informatimago.common-lisp.interactive.test FAIL) ASDF:LOAD-SYSTEM-DEFINITION-ERROR : Error while trying to load definition for system com.informatimago.common-lisp.interactive.test from pathname /home/testgrid/cl-test-grid/work-dir/agent/quicklisp/dists/quicklisp/software/com.informatimago-20150407-git/common-lisp/interactive/com.informatimago.common-lisp.interactive.test.asd: READ error during COMPILE-FILE: Package ASDF/LISP-ACTION does not exist. Line: 61, Column: 43, File-Position: 2638 Stream: #<SB-SYS:FD-STREAM for "file /home/testgrid/cl-test-grid/work-dir/agent/quicklisp/dists/quicklisp/software/com.informatimago-20150407-git/common-lisp/interactive/com.informatimago.common-lisp.interactive.test.asd" {B0A0E29}>
(LOAD com.informatimago.common-lisp.invoice.test FAIL) ASDF:LOAD-SYSTEM-DEFINITION-ERROR : Error while trying to load definition for system com.informatimago.common-lisp.invoice.test from pathname /home/testgrid/cl-test-grid/work-dir/agent/quicklisp/dists/quicklisp/software/com.informatimago-20150407-git/common-lisp/invoice/com.informatimago.common-lisp.invoice.test.asd: READ error during COMPILE-FILE: Package ASDF/LISP-ACTION does not exist. Line: 61, Column: 43, File-Position: 2610 Stream: #<SB-SYS:FD-STREAM for "file /home/testgrid/cl-test-grid/work-dir/agent/quicklisp/dists/quicklisp/software/com.informatimago-20150407-git/common-lisp/invoice/com.informatimago.common-lisp.invoice.test.asd" {B0A0DA1}>
(LOAD com.informatimago.common-lisp.lisp-sexp.test FAIL) ASDF:LOAD-SYSTEM-DEFINITION-ERROR : Error while trying to load definition for system com.informatimago.common-lisp.lisp-sexp.test from pathname /home/testgrid/cl-test-grid/work-dir/agent/quicklisp/dists/quicklisp/software/com.informatimago-20150407-git/common-lisp/lisp-sexp/com.informatimago.common-lisp.lisp-sexp.test.asd: READ error during COMPILE-FILE: Package ASDF/LISP-ACTION does not exist. Line: 61, Column: 43, File-Position: 2666 Stream: #<SB-SYS:FD-STREAM for "file /home/testgrid/cl-test-grid/work-dir/agent/quicklisp/dists/quicklisp/software/com.informatimago-20150407-git/common-lisp/lisp-sexp/com.informatimago.common-lisp.lisp-sexp.test.asd" {B0A0DE9}>
(LOAD com.informatimago.common-lisp.lisp-text.test FAIL) ASDF:LOAD-SYSTEM-DEFINITION-ERROR : Error while trying to load definition for system com.informatimago.common-lisp.lisp-text.test from pathname /home/testgrid/cl-test-grid/work-dir/agent/quicklisp/dists/quicklisp/software/com.informatimago-20150407-git/common-lisp/lisp-text/com.informatimago.common-lisp.lisp-text.test.asd: READ error during COMPILE-FILE: Package ASDF/LISP-ACTION does not exist. Line: 61, Column: 43, File-Position: 2624 Stream: #<SB-SYS:FD-STREAM for "file /home/testgrid/cl-test-grid/work-dir/agent/quicklisp/dists/quicklisp/software/com.informatimago-20150407-git/common-lisp/lisp-text/com.informatimago.common-lisp.lisp-text.test.asd" {B0A0DE9}>
(LOAD com.informatimago.common-lisp.lisp.ibcl.test FAIL) ASDF:LOAD-SYSTEM-DEFINITION-ERROR : Error while trying to load definition for system com.informatimago.common-lisp.lisp.ibcl.test from pathname /home/testgrid/cl-test-grid/work-dir/agent/quicklisp/dists/quicklisp/software/com.informatimago-20150407-git/common-lisp/lisp/com.informatimago.common-lisp.lisp.ibcl.test.asd: READ error during COMPILE-FILE: Package ASDF/LISP-ACTION does not exist. Line: 61, Column: 43, File-Position: 2661 Stream: #<SB-SYS:FD-STREAM for "file /home/testgrid/cl-test-grid/work-dir/agent/quicklisp/dists/quicklisp/software/com.informatimago-20150407-git/common-lisp/lisp/com.informatimago.common-lisp.lisp.ibcl.test.asd" {B0A0D91}>
(LOAD com.informatimago.common-lisp.lisp.stepper.test FAIL) ASDF:LOAD-SYSTEM-DEFINITION-ERROR : Error while trying to load definition for system com.informatimago.common-lisp.lisp.stepper.test from pathname /home/testgrid/cl-test-grid/work-dir/agent/quicklisp/dists/quicklisp/software/com.informatimago-20150407-git/common-lisp/lisp/com.informatimago.common-lisp.lisp.stepper.test.asd: READ error during COMPILE-FILE: Package ASDF/LISP-ACTION does not exist. Line: 61, Column: 43, File-Position: 2645 Stream: #<SB-SYS:FD-STREAM for "file /home/testgrid/cl-test-grid/work-dir/agent/quicklisp/dists/quicklisp/software/com.informatimago-20150407-git/common-lisp/lisp/com.informatimago.common-lisp.lisp.stepper.test.asd" {B0A1DC9}>
(LOAD com.informatimago.common-lisp.lisp.test FAIL) ASDF:LOAD-SYSTEM-DEFINITION-ERROR : Error while trying to load definition for system com.informatimago.common-lisp.lisp.test from pathname /home/testgrid/cl-test-grid/work-dir/agent/quicklisp/dists/quicklisp/software/com.informatimago-20150407-git/common-lisp/lisp/com.informatimago.common-lisp.lisp.test.asd: READ error during COMPILE-FILE: Package ASDF/LISP-ACTION does not exist. Line: 61, Column: 43, File-Position: 2589 Stream: #<SB-SYS:FD-STREAM for "file /home/testgrid/cl-test-grid/work-dir/agent/quicklisp/dists/quicklisp/software/com.informatimago-20150407-git/common-lisp/lisp/com.informatimago.common-lisp.lisp.test.asd" {B0A0369}>
(LOAD com.informatimago.common-lisp.parser.test FAIL) ASDF:LOAD-SYSTEM-DEFINITION-ERROR : Error while trying to load definition for system com.informatimago.common-lisp.parser.test from pathname /home/testgrid/cl-test-grid/work-dir/agent/quicklisp/dists/quicklisp/software/com.informatimago-20150407-git/common-lisp/parser/com.informatimago.common-lisp.parser.test.asd: READ error during COMPILE-FILE: Package ASDF/LISP-ACTION does not exist. Line: 61, Column: 43, File-Position: 2603 Stream: #<SB-SYS:FD-STREAM for "file /home/testgrid/cl-test-grid/work-dir/agent/quicklisp/dists/quicklisp/software/com.informatimago-20150407-git/common-lisp/parser/com.informatimago.common-lisp.parser.test.asd" {B0A07C1}>
(LOAD com.informatimago.common-lisp.picture.test FAIL) ASDF:LOAD-SYSTEM-DEFINITION-ERROR : Error while trying to load definition for system com.informatimago.common-lisp.picture.test from pathname /home/testgrid/cl-test-grid/work-dir/agent/quicklisp/dists/quicklisp/software/com.informatimago-20150407-git/common-lisp/picture/com.informatimago.common-lisp.picture.test.asd: READ error during COMPILE-FILE: Package ASDF/LISP-ACTION does not exist. Line: 61, Column: 43, File-Position: 2648 Stream: #<SB-SYS:FD-STREAM for "file /home/testgrid/cl-test-grid/work-dir/agent/quicklisp/dists/quicklisp/software/com.informatimago-20150407-git/common-lisp/picture/com.informatimago.common-lisp.picture.test.asd" {B0A0DA1}>
(LOAD com.informatimago.common-lisp.regexp.test FAIL) ASDF:LOAD-SYSTEM-DEFINITION-ERROR : Error while trying to load definition for system com.informatimago.common-lisp.regexp.test from pathname /home/testgrid/cl-test-grid/work-dir/agent/quicklisp/dists/quicklisp/software/com.informatimago-20150407-git/common-lisp/regexp/com.informatimago.common-lisp.regexp.test.asd: READ error during COMPILE-FILE: Package ASDF/LISP-ACTION does not exist. Line: 61, Column: 43, File-Position: 2646 Stream: #<SB-SYS:FD-STREAM for "file /home/testgrid/cl-test-grid/work-dir/agent/quicklisp/dists/quicklisp/software/com.informatimago-20150407-git/common-lisp/regexp/com.informatimago.common-lisp.regexp.test.asd" {B0A07C1}>
(LOAD com.informatimago.common-lisp.rfc2822.test FAIL) ASDF:LOAD-SYSTEM-DEFINITION-ERROR : Error while trying to load definition for system com.informatimago.common-lisp.rfc2822.test from pathname /home/testgrid/cl-test-grid/work-dir/agent/quicklisp/dists/quicklisp/software/com.informatimago-20150407-git/common-lisp/rfc2822/com.informatimago.common-lisp.rfc2822.test.asd: READ error during COMPILE-FILE: Package ASDF/LISP-ACTION does not exist. Line: 61, Column: 43, File-Position: 2610 Stream: #<SB-SYS:FD-STREAM for "file /home/testgrid/cl-test-grid/work-dir/agent/quicklisp/dists/quicklisp/software/com.informatimago-20150407-git/common-lisp/rfc2822/com.informatimago.common-lisp.rfc2822.test.asd" {B0A0DA1}>
(LOAD com.informatimago.common-lisp.rfc3548.test FAIL) ASDF:LOAD-SYSTEM-DEFINITION-ERROR : Error while trying to load definition for system com.informatimago.common-lisp.rfc3548.test from pathname /home/testgrid/cl-test-grid/work-dir/agent/quicklisp/dists/quicklisp/software/com.informatimago-20150407-git/common-lisp/rfc3548/com.informatimago.common-lisp.rfc3548.test.asd: READ error during COMPILE-FILE: Package ASDF/LISP-ACTION does not exist. Line: 61, Column: 43, File-Position: 2648 Stream: #<SB-SYS:FD-STREAM for "file /home/testgrid/cl-test-grid/work-dir/agent/quicklisp/dists/quicklisp/software/com.informatimago-20150407-git/common-lisp/rfc3548/com.informatimago.common-lisp.rfc3548.test.asd" {B0A0DA1}>
(LOAD com.informatimago.common-lisp.telnet.test FAIL) ASDF:LOAD-SYSTEM-DEFINITION-ERROR : Error while trying to load definition for system com.informatimago.common-lisp.telnet.test from pathname /home/testgrid/cl-test-grid/work-dir/agent/quicklisp/dists/quicklisp/software/com.informatimago-20150407-git/common-lisp/telnet/com.informatimago.common-lisp.telnet.test.asd: READ error during COMPILE-FILE: Package ASDF/LISP-ACTION does not exist. Line: 61, Column: 43, File-Position: 2640 Stream: #<SB-SYS:FD-STREAM for "file /home/testgrid/cl-test-grid/work-dir/agent/quicklisp/dists/quicklisp/software/com.informatimago-20150407-git/common-lisp/telnet/com.informatimago.common-lisp.telnet.test.asd" {B0A07C1}>
(LOAD com.informatimago.common-lisp.unix.test FAIL) ASDF:LOAD-SYSTEM-DEFINITION-ERROR : Error while trying to load definition for system com.informatimago.common-lisp.unix.test from pathname /home/testgrid/cl-test-grid/work-dir/agent/quicklisp/dists/quicklisp/software/com.informatimago-20150407-git/common-lisp/unix/com.informatimago.common-lisp.unix.test.asd: READ error during COMPILE-FILE: Package ASDF/LISP-ACTION does not exist. Line: 61, Column: 43, File-Position: 2589 Stream: #<SB-SYS:FD-STREAM for "file /home/testgrid/cl-test-grid/work-dir/agent/quicklisp/dists/quicklisp/software/com.informatimago-20150407-git/common-lisp/unix/com.informatimago.common-lisp.unix.test.asd" {B0A0369}>
(LOAD com.informatimago.future.test FAIL) ASDF:LOAD-SYSTEM-DEFINITION-ERROR : Error while trying to load definition for system com.informatimago.future.test from pathname /home/testgrid/cl-test-grid/work-dir/agent/quicklisp/dists/quicklisp/software/com.informatimago-20150407-git/future/com.informatimago.future.test.asd: READ error during COMPILE-FILE: Package ASDF/LISP-ACTION does not exist. Line: 61, Column: 43, File-Position: 2447 Stream: #<SB-SYS:FD-STREAM for "file /home/testgrid/cl-test-grid/work-dir/agent/quicklisp/dists/quicklisp/software/com.informatimago-20150407-git/future/com.informatimago.future.test.asd" {B09CEC9}>
(LOAD com.informatimago.languages.cxx.test FAIL) ASDF:LOAD-SYSTEM-DEFINITION-ERROR : Error while trying to load definition for system com.informatimago.languages.cxx.test from pathname /home/testgrid/cl-test-grid/work-dir/agent/quicklisp/dists/quicklisp/software/com.informatimago-20150407-git/languages/cxx/com.informatimago.languages.cxx.test.asd: READ error during COMPILE-FILE: Package ASDF/LISP-ACTION does not exist. Line: 61, Column: 43, File-Position: 2568 Stream: #<SB-SYS:FD-STREAM for "file /home/testgrid/cl-test-grid/work-dir/agent/quicklisp/dists/quicklisp/software/com.informatimago-20150407-git/languages/cxx/com.informatimago.languages.cxx.test.asd" {B09F6B1}>
(LOAD com.informatimago.languages.lua.test FAIL) ASDF:LOAD-SYSTEM-DEFINITION-ERROR : Error while trying to load definition for system com.informatimago.languages.lua.test from pathname /home/testgrid/cl-test-grid/work-dir/agent/quicklisp/dists/quicklisp/software/com.informatimago-20150407-git/languages/lua/com.informatimago.languages.lua.test.asd: READ error during COMPILE-FILE: Package ASDF/LISP-ACTION does not exist. Line: 61, Column: 43, File-Position: 2610 Stream: #<SB-SYS:FD-STREAM for "file /home/testgrid/cl-test-grid/work-dir/agent/quicklisp/dists/quicklisp/software/com.informatimago-20150407-git/languages/lua/com.informatimago.languages.lua.test.asd" {B09F6B1}>
(LOAD com.informatimago.linc.test FAIL) ASDF:LOAD-SYSTEM-DEFINITION-ERROR : Error while trying to load definition for system com.informatimago.linc.test from pathname /home/testgrid/cl-test-grid/work-dir/agent/quicklisp/dists/quicklisp/software/com.informatimago-20150407-git/languages/linc/com.informatimago.linc.test.asd: READ error during COMPILE-FILE: Package ASDF/LISP-ACTION does not exist. Line: 61, Column: 43, File-Position: 2505 Stream: #<SB-SYS:FD-STREAM for "file /home/testgrid/cl-test-grid/work-dir/agent/quicklisp/dists/quicklisp/software/com.informatimago-20150407-git/languages/linc/com.informatimago.linc.test.asd" {B09B4C1}>
(LOAD com.informatimago.lispdoc.test FAIL) ASDF:LOAD-SYSTEM-DEFINITION-ERROR : Error while trying to load definition for system com.informatimago.lispdoc.test from pathname /home/testgrid/cl-test-grid/work-dir/agent/quicklisp/dists/quicklisp/software/com.informatimago-20150407-git/lispdoc/com.informatimago.lispdoc.test.asd: READ error during COMPILE-FILE: Package ASDF/LISP-ACTION does not exist. Line: 61, Column: 43, File-Position: 2526 Stream: #<SB-SYS:FD-STREAM for "file /home/testgrid/cl-test-grid/work-dir/agent/quicklisp/dists/quicklisp/software/com.informatimago-20150407-git/lispdoc/com.informatimago.lispdoc.test.asd" {B09D321}>
(LOAD com.informatimago.rdp.basic.test FAIL) ASDF:LOAD-SYSTEM-DEFINITION-ERROR : Error while trying to load definition for system com.informatimago.rdp.basic.test from pathname /home/testgrid/cl-test-grid/work-dir/agent/quicklisp/dists/quicklisp/software/com.informatimago-20150407-git/rdp/com.informatimago.rdp.basic.test.asd: READ error during COMPILE-FILE: Package ASDF/LISP-ACTION does not exist. Line: 61, Column: 43, File-Position: 2540 Stream: #<SB-SYS:FD-STREAM for "file /home/testgrid/cl-test-grid/work-dir/agent/quicklisp/dists/quicklisp/software/com.informatimago-20150407-git/rdp/com.informatimago.rdp.basic.test.asd" {B09CEB9}>
(LOAD com.informatimago.rdp.example.test FAIL) ASDF:LOAD-SYSTEM-DEFINITION-ERROR : Error while trying to load definition for system com.informatimago.rdp.example.test from pathname /home/testgrid/cl-test-grid/work-dir/agent/quicklisp/dists/quicklisp/software/com.informatimago-20150407-git/rdp/com.informatimago.rdp.example.test.asd: READ error during COMPILE-FILE: Package ASDF/LISP-ACTION does not exist. Line: 61, Column: 43, File-Position: 2554 Stream: #<SB-SYS:FD-STREAM for "file /home/testgrid/cl-test-grid/work-dir/agent/quicklisp/dists/quicklisp/software/com.informatimago-20150407-git/rdp/com.informatimago.rdp.example.test.asd" {B09F321}>
(LOAD com.informatimago.rdp.test FAIL) ASDF:LOAD-SYSTEM-DEFINITION-ERROR : Error while trying to load definition for system com.informatimago.rdp.test from pathname /home/testgrid/cl-test-grid/work-dir/agent/quicklisp/dists/quicklisp/software/com.informatimago-20150407-git/rdp/com.informatimago.rdp.test.asd: READ error during COMPILE-FILE: Package ASDF/LISP-ACTION does not exist. Line: 61, Column: 43, File-Position: 2498 Stream: #<SB-SYS:FD-STREAM for "file /home/testgrid/cl-test-grid/work-dir/agent/quicklisp/dists/quicklisp/software/com.informatimago-20150407-git/rdp/com.informatimago.rdp.test.asd" {B09AB81}>
(LOAD com.informatimago.small-cl-pgms.brainfuck.test FAIL) ASDF:LOAD-SYSTEM-DEFINITION-ERROR : Error while trying to load definition for system com.informatimago.small-cl-pgms.brainfuck.test from pathname /home/testgrid/cl-test-grid/work-dir/agent/quicklisp/dists/quicklisp/software/com.informatimago-20150407-git/small-cl-pgms/brainfuck/com.informatimago.small-cl-pgms.brainfuck.test.asd: READ error during COMPILE-FILE: Package ASDF/LISP-ACTION does not exist. Line: 61, Column: 43, File-Position: 2597 Stream: #<SB-SYS:FD-STREAM for "file /home/testgrid/cl-test-grid/work-dir/agent/quicklisp/dists/quicklisp/software/com.informatimago-20150407-git/small-cl-pgms/brainfuck/com.informatimago.small-cl-pgms.brainfuck.test.asd" {B0A0E29}>
(LOAD com.informatimago.small-cl-pgms.life.test FAIL) ASDF:LOAD-SYSTEM-DEFINITION-ERROR : Error while trying to load definition for system com.informatimago.small-cl-pgms.life.test from pathname /home/testgrid/cl-test-grid/work-dir/agent/quicklisp/dists/quicklisp/software/com.informatimago-20150407-git/small-cl-pgms/com.informatimago.small-cl-pgms.life.test.asd: READ error during COMPILE-FILE: Package ASDF/LISP-ACTION does not exist. Line: 61, Column: 43, File-Position: 2530 Stream: #<SB-SYS:FD-STREAM for "file /home/testgrid/cl-test-grid/work-dir/agent/quicklisp/dists/quicklisp/software/com.informatimago-20150407-git/small-cl-pgms/com.informatimago.small-cl-pgms.life.test.asd" {B0A0361}>
(LOAD com.informatimago.small-cl-pgms.quine.test FAIL) ASDF:LOAD-SYSTEM-DEFINITION-ERROR : Error while trying to load definition for system com.informatimago.small-cl-pgms.quine.test from pathname /home/testgrid/cl-test-grid/work-dir/agent/quicklisp/dists/quicklisp/software/com.informatimago-20150407-git/small-cl-pgms/com.informatimago.small-cl-pgms.quine.test.asd: READ error during COMPILE-FILE: Package ASDF/LISP-ACTION does not exist. Line: 61, Column: 43, File-Position: 2537 Stream: #<SB-SYS:FD-STREAM for "file /home/testgrid/cl-test-grid/work-dir/agent/quicklisp/dists/quicklisp/software/com.informatimago-20150407-git/small-cl-pgms/com.informatimago.small-cl-pgms.quine.test.asd" {B0A0369}>
(LOAD com.informatimago.susv3.test FAIL) ASDF:LOAD-SYSTEM-DEFINITION-ERROR : Error while trying to load definition for system com.informatimago.susv3.test from pathname /home/testgrid/cl-test-grid/work-dir/agent/quicklisp/dists/quicklisp/software/com.informatimago-20150407-git/susv3/com.informatimago.susv3.test.asd: READ error during COMPILE-FILE: Package ASDF/LISP-ACTION does not exist. Line: 61, Column: 43, File-Position: 2512 Stream: #<SB-SYS:FD-STREAM for "file /home/testgrid/cl-test-grid/work-dir/agent/quicklisp/dists/quicklisp/software/com.informatimago-20150407-git/susv3/com.informatimago.susv3.test.asd" {B09AEA1}>
(LOAD com.informatimago.tools.manifest.test FAIL) ASDF:LOAD-SYSTEM-DEFINITION-ERROR : Error while trying to load definition for system com.informatimago.tools.manifest.test from pathname /home/testgrid/cl-test-grid/work-dir/agent/quicklisp/dists/quicklisp/software/com.informatimago-20150407-git/tools/com.informatimago.tools.manifest.test.asd: READ error during COMPILE-FILE: Package ASDF/LISP-ACTION does not exist. Line: 61, Column: 43, File-Position: 2542 Stream: #<SB-SYS:FD-STREAM for "file /home/testgrid/cl-test-grid/work-dir/agent/quicklisp/dists/quicklisp/software/com.informatimago-20150407-git/tools/com.informatimago.tools.manifest.test.asd" {B09F4C1}>
(LOAD com.informatimago.tools.pathname.test FAIL) ASDF:LOAD-SYSTEM-DEFINITION-ERROR : Error while trying to load definition for system com.informatimago.tools.pathname.test from pathname /home/testgrid/cl-test-grid/work-dir/agent/quicklisp/dists/quicklisp/software/com.informatimago-20150407-git/tools/com.informatimago.tools.pathname.test.asd: READ error during COMPILE-FILE: Package UIOP/PACKAGE does not exist. Line: 66, Column: 48, File-Position: 2802 Stream: #<SB-SYS:FD-STREAM for "file /home/testgrid/cl-test-grid/work-dir/agent/quicklisp/dists/quicklisp/software/com.informatimago-20150407-git/tools/com.informatimago.tools.pathname.test.asd" {B09F4C1}>
(LOAD com.informatimago.tools.symbol.test FAIL) ASDF:LOAD-SYSTEM-DEFINITION-ERROR : Error while trying to load definition for system com.informatimago.tools.symbol.test from pathname /home/testgrid/cl-test-grid/work-dir/agent/quicklisp/dists/quicklisp/software/com.informatimago-20150407-git/tools/com.informatimago.tools.symbol.test.asd: READ error during COMPILE-FILE: Package ASDF/LISP-ACTION does not exist. Line: 61, Column: 43, File-Position: 2525 Stream: #<SB-SYS:FD-STREAM for "file /home/testgrid/cl-test-grid/work-dir/agent/quicklisp/dists/quicklisp/software/com.informatimago-20150407-git/tools/com.informatimago.tools.symbol.test.asd" {B09F4B1}>
(LOAD com.informatimago.tools.undefmethod.test FAIL) ASDF:LOAD-SYSTEM-DEFINITION-ERROR : Error while trying to load definition for system com.informatimago.tools.undefmethod.test from pathname /home/testgrid/cl-test-grid/work-dir/agent/quicklisp/dists/quicklisp/software/com.informatimago-20150407-git/tools/com.informatimago.tools.undefmethod.test.asd: READ error during COMPILE-FILE: Package ASDF/LISP-ACTION does not exist. Line: 61, Column: 43, File-Position: 2638 Stream: #<SB-SYS:FD-STREAM for "file /home/testgrid/cl-test-grid/work-dir/agent/quicklisp/dists/quicklisp/software/com.informatimago-20150407-git/tools/com.informatimago.tools.undefmethod.test.asd" {B09F4E1}>
(LOAD com.informatimago.xcode.test FAIL) ASDF:LOAD-SYSTEM-DEFINITION-ERROR : Error while trying to load definition for system com.informatimago.xcode.test from pathname /home/testgrid/cl-test-grid/work-dir/agent/quicklisp/dists/quicklisp/software/com.informatimago-20150407-git/xcode/com.informatimago.xcode.test.asd: READ error during COMPILE-FILE: Package ASDF/LISP-ACTION does not exist. Line: 62, Column: 43, File-Position: 2593 Stream: #<SB-SYS:FD-STREAM for "file /home/testgrid/cl-test-grid/work-dir/agent/quicklisp/dists/quicklisp/software/com.informatimago-20150407-git/xcode/com.informatimago.xcode.test.asd" {B09AEA1}>
lack
(LOAD lack FAIL) ASDF:LOAD-SYSTEM-DEFINITION-ERROR : Error while trying to load definition for system lack from pathname /home/testgrid/cl-test-grid/work-dir/agent/quicklisp/dists/quicklisp/software/lack-20150608-git/lack.asd: READ error during COMPILE-FILE: :ASCII stream decoding error on #<SB-SYS:FD-STREAM for "file /home/testgrid/cl-test-grid/work-dir/agent/quicklisp/dists/quicklisp/software/lack-20150608-git/README.md" {B10CBA1}>: the octet sequence #(226) cannot be decoded. (in form starting at line: 15, column: 23, file-position: 264)
qlot
(LOAD qlot-install FAIL) ASDF:LOAD-SYSTEM-DEFINITION-ERROR : Error while trying to load definition for system lack from pathname /home/testgrid/cl-test-grid/work-dir/agent/quicklisp/dists/quicklisp/software/lack-20150608-git/lack.asd: READ error during COMPILE-FILE: :ASCII stream decoding error on #<SB-SYS:FD-STREAM for "file /home/testgrid/cl-test-grid/work-dir/agent/quicklisp/dists/quicklisp/software/lack-20150608-git/README.md" {BBF3CC9}>: the octet sequence #(226) cannot be decoded. (in form starting at line: 15, column: 23, file-position: 264)
shelly
(LOAD shelly FAIL) SB-INT:STREAM-DECODING-ERROR : :ASCII stream decoding error on #<SB-SYS:FD-STREAM for "descriptor 8" {C036611}>: the octet sequence #(226) cannot be decoded.
trivial-signal
(LOAD trivial-signal FAIL) SB-INT:STREAM-DECODING-ERROR : :ASCII stream decoding error on #<SB-SYS:FD-STREAM for "descriptor 8" {BD62071}>: the octet sequence #(226) cannot be decoded.
sbcl-1.1.11-linux-x86cl-charms
(LOAD cl-charms FAIL) ffi-grovel, CFFI-GROVEL:GROVEL-ERROR : External process exited with code 1. Command was: "cc" "-m32" "-I/home/testgrid/cl-test-grid/work-dir/agent/quicklisp/dists/quicklisp/software/cffi_0.15.0/" "-o" "/home/testgrid/cl-test-grid/work-dir/agent/test-runs/20150718124641-sbcl-1.1.11-linux-x86/fasl/ql/dists/quicklisp/software/cl-charms-20150709-git/src/low-level/curses-grovel" "/home/testgrid/cl-test-grid/work-dir/agent/test-runs/20150718124641-sbcl-1.1.11-linux-x86/fasl/ql/dists/quicklisp/software/cl-charms-20150709-git/src/low-level/curses-grovel.c" Output was: /home/testgrid/cl-test-grid/work-dir/agent/test-runs/20150718124641-sbcl-1.1.11-linux-x86/fasl/ql/dists/quicklisp/software/cl-charms-20150709-git/src/low-level/curses-grovel.c:6:21: fatal error: ncurses.h: No such file or directory compilation terminated.
(LOAD cl-charms-paint FAIL) ffi-grovel, CFFI-GROVEL:GROVEL-ERROR : External process exited with code 1. Command was: "cc" "-m32" "-I/home/testgrid/cl-test-grid/work-dir/agent/quicklisp/dists/quicklisp/software/cffi_0.15.0/" "-o" "/home/testgrid/cl-test-grid/work-dir/agent/test-runs/20150718124641-sbcl-1.1.11-linux-x86/fasl/ql/dists/quicklisp/software/cl-charms-20150709-git/src/low-level/curses-grovel" "/home/testgrid/cl-test-grid/work-dir/agent/test-runs/20150718124641-sbcl-1.1.11-linux-x86/fasl/ql/dists/quicklisp/software/cl-charms-20150709-git/src/low-level/curses-grovel.c" Output was: /home/testgrid/cl-test-grid/work-dir/agent/test-runs/20150718124641-sbcl-1.1.11-linux-x86/fasl/ql/dists/quicklisp/software/cl-charms-20150709-git/src/low-level/curses-grovel.c:6:21: fatal error: ncurses.h: No such file or directory compilation terminated.
(LOAD cl-charms-timer FAIL) ffi-grovel, CFFI-GROVEL:GROVEL-ERROR : External process exited with code 1. Command was: "cc" "-m32" "-I/home/testgrid/cl-test-grid/work-dir/agent/quicklisp/dists/quicklisp/software/cffi_0.15.0/" "-o" "/home/testgrid/cl-test-grid/work-dir/agent/test-runs/20150718124641-sbcl-1.1.11-linux-x86/fasl/ql/dists/quicklisp/software/cl-charms-20150709-git/src/low-level/curses-grovel" "/home/testgrid/cl-test-grid/work-dir/agent/test-runs/20150718124641-sbcl-1.1.11-linux-x86/fasl/ql/dists/quicklisp/software/cl-charms-20150709-git/src/low-level/curses-grovel.c" Output was: /home/testgrid/cl-test-grid/work-dir/agent/test-runs/20150718124641-sbcl-1.1.11-linux-x86/fasl/ql/dists/quicklisp/software/cl-charms-20150709-git/src/low-level/curses-grovel.c:6:21: fatal error: ncurses.h: No such file or directory compilation terminated.
qt-libs
(LOAD qt-lib-generator FAIL) UIOP/LISP-BUILD:COMPILE-FILE-ERROR : COMPILE-FILE-ERROR while compiling #<CL-SOURCE-FILE "qt-lib-generator" "system">
sbcl-1.1.16-linux-x86cl-charms
(LOAD cl-charms FAIL) ffi-grovel, CFFI-GROVEL:GROVEL-ERROR : External process exited with code 1. Command was: "cc" "-m32" "-I/home/testgrid/cl-test-grid/work-dir/agent/quicklisp/dists/quicklisp/software/cffi_0.15.0/" "-o" "/home/testgrid/cl-test-grid/work-dir/agent/test-runs/20150718100633-sbcl-1.1.16-linux-x86/fasl/ql/dists/quicklisp/software/cl-charms-20150709-git/src/low-level/curses-grovel" "/home/testgrid/cl-test-grid/work-dir/agent/test-runs/20150718100633-sbcl-1.1.16-linux-x86/fasl/ql/dists/quicklisp/software/cl-charms-20150709-git/src/low-level/curses-grovel.c" Output was: /home/testgrid/cl-test-grid/work-dir/agent/test-runs/20150718100633-sbcl-1.1.16-linux-x86/fasl/ql/dists/quicklisp/software/cl-charms-20150709-git/src/low-level/curses-grovel.c:6:21: fatal error: ncurses.h: No such file or directory compilation terminated.
(LOAD cl-charms-paint FAIL) ffi-grovel, CFFI-GROVEL:GROVEL-ERROR : External process exited with code 1. Command was: "cc" "-m32" "-I/home/testgrid/cl-test-grid/work-dir/agent/quicklisp/dists/quicklisp/software/cffi_0.15.0/" "-o" "/home/testgrid/cl-test-grid/work-dir/agent/test-runs/20150718100633-sbcl-1.1.16-linux-x86/fasl/ql/dists/quicklisp/software/cl-charms-20150709-git/src/low-level/curses-grovel" "/home/testgrid/cl-test-grid/work-dir/agent/test-runs/20150718100633-sbcl-1.1.16-linux-x86/fasl/ql/dists/quicklisp/software/cl-charms-20150709-git/src/low-level/curses-grovel.c" Output was: /home/testgrid/cl-test-grid/work-dir/agent/test-runs/20150718100633-sbcl-1.1.16-linux-x86/fasl/ql/dists/quicklisp/software/cl-charms-20150709-git/src/low-level/curses-grovel.c:6:21: fatal error: ncurses.h: No such file or directory compilation terminated.
(LOAD cl-charms-timer FAIL) ffi-grovel, CFFI-GROVEL:GROVEL-ERROR : External process exited with code 1. Command was: "cc" "-m32" "-I/home/testgrid/cl-test-grid/work-dir/agent/quicklisp/dists/quicklisp/software/cffi_0.15.0/" "-o" "/home/testgrid/cl-test-grid/work-dir/agent/test-runs/20150718100633-sbcl-1.1.16-linux-x86/fasl/ql/dists/quicklisp/software/cl-charms-20150709-git/src/low-level/curses-grovel" "/home/testgrid/cl-test-grid/work-dir/agent/test-runs/20150718100633-sbcl-1.1.16-linux-x86/fasl/ql/dists/quicklisp/software/cl-charms-20150709-git/src/low-level/curses-grovel.c" Output was: /home/testgrid/cl-test-grid/work-dir/agent/test-runs/20150718100633-sbcl-1.1.16-linux-x86/fasl/ql/dists/quicklisp/software/cl-charms-20150709-git/src/low-level/curses-grovel.c:6:21: fatal error: ncurses.h: No such file or directory compilation terminated.
qt-libs
(LOAD qt-lib-generator FAIL) UIOP/LISP-BUILD:COMPILE-FILE-ERROR : COMPILE-FILE-ERROR while compiling #<CL-SOURCE-FILE "qt-lib-generator" "system">
sbcl-1.2.6-linux-x86cl-charms
(LOAD cl-charms FAIL) ffi-grovel, CFFI-GROVEL:GROVEL-ERROR : External process exited with code 1. Command was: "cc" "-m32" "-I/home/testgrid/cl-test-grid/work-dir/agent/quicklisp/dists/quicklisp/software/cffi_0.15.0/" "-o" "/home/testgrid/cl-test-grid/work-dir/agent/test-runs/20150716172431-sbcl-1.2.6-linux-x86/fasl/ql/dists/quicklisp/software/cl-charms-20150709-git/src/low-level/curses-grovel" "/home/testgrid/cl-test-grid/work-dir/agent/test-runs/20150716172431-sbcl-1.2.6-linux-x86/fasl/ql/dists/quicklisp/software/cl-charms-20150709-git/src/low-level/curses-grovel.c" Output was: /home/testgrid/cl-test-grid/work-dir/agent/test-runs/20150716172431-sbcl-1.2.6-linux-x86/fasl/ql/dists/quicklisp/software/cl-charms-20150709-git/src/low-level/curses-grovel.c:6:21: fatal error: ncurses.h: No such file or directory compilation terminated.
(LOAD cl-charms-paint FAIL) ffi-grovel, CFFI-GROVEL:GROVEL-ERROR : External process exited with code 1. Command was: "cc" "-m32" "-I/home/testgrid/cl-test-grid/work-dir/agent/quicklisp/dists/quicklisp/software/cffi_0.15.0/" "-o" "/home/testgrid/cl-test-grid/work-dir/agent/test-runs/20150716172431-sbcl-1.2.6-linux-x86/fasl/ql/dists/quicklisp/software/cl-charms-20150709-git/src/low-level/curses-grovel" "/home/testgrid/cl-test-grid/work-dir/agent/test-runs/20150716172431-sbcl-1.2.6-linux-x86/fasl/ql/dists/quicklisp/software/cl-charms-20150709-git/src/low-level/curses-grovel.c" Output was: /home/testgrid/cl-test-grid/work-dir/agent/test-runs/20150716172431-sbcl-1.2.6-linux-x86/fasl/ql/dists/quicklisp/software/cl-charms-20150709-git/src/low-level/curses-grovel.c:6:21: fatal error: ncurses.h: No such file or directory compilation terminated.
(LOAD cl-charms-timer FAIL) ffi-grovel, CFFI-GROVEL:GROVEL-ERROR : External process exited with code 1. Command was: "cc" "-m32" "-I/home/testgrid/cl-test-grid/work-dir/agent/quicklisp/dists/quicklisp/software/cffi_0.15.0/" "-o" "/home/testgrid/cl-test-grid/work-dir/agent/test-runs/20150716172431-sbcl-1.2.6-linux-x86/fasl/ql/dists/quicklisp/software/cl-charms-20150709-git/src/low-level/curses-grovel" "/home/testgrid/cl-test-grid/work-dir/agent/test-runs/20150716172431-sbcl-1.2.6-linux-x86/fasl/ql/dists/quicklisp/software/cl-charms-20150709-git/src/low-level/curses-grovel.c" Output was: /home/testgrid/cl-test-grid/work-dir/agent/test-runs/20150716172431-sbcl-1.2.6-linux-x86/fasl/ql/dists/quicklisp/software/cl-charms-20150709-git/src/low-level/curses-grovel.c:6:21: fatal error: ncurses.h: No such file or directory compilation terminated.

To reports overview

Generated at: 2015-07-23 12:58:55 GMT.