quicklisp 2014-12-17quicklisp 2015-01-13
arc-compatccl-1.10-r16196-f96-linux-x64
(LOAD arc-compat FAIL) CCL::SIMPLE-PROGRAM-ERROR : Name "SUBST", used in :SHADOWING-IMPORT-FROM option, is already used in a conflicting option .
ccl-1.10-r16196-f96-linux-x86
(LOAD arc-compat FAIL) CCL::SIMPLE-PROGRAM-ERROR : Name "SUBST", used in :SHADOWING-IMPORT-FROM option, is already used in a conflicting option .
ccl-1.9-r15756-f96-linux-x86
(LOAD arc-compat FAIL) CCL::SIMPLE-PROGRAM-ERROR : Name "SUBST", used in :SHADOWING-IMPORT-FROM option, is already used in a conflicting option .
bit-smasherccl-1.8-r15286m-f95-linux-x86
(LOAD bit-smasher FAIL) ASDF:LOAD-SYSTEM-DEFINITION-ERROR : Error while trying to load definition for system cl-base58 from pathname /home/testgrid/cl-test-grid/work-dir/agent/quicklisp/dists/quicklisp/software/cl-base58-20150113-git/cl-base58.asd: :HOMEPAGE is an invalid initarg to REINITIALIZE-INSTANCE for #<STANDARD-CLASS SYSTEM>. Valid initargs: (:NAME :VERSION :DESCRIPTION :LONG-DESCRIPTION :IN-ORDER-TO :DO-FIRST :PARENT :PATHNAME :AROUND-COMPILE :ENCODING :PROPERTIES :COMPONENTS :IF-COMPONENT-DEP-FAILS :DEFAULT-COMPONENT-CLASS :AUTHOR :MAINTAINER :LICENCE :LICENSE :SOURCE-FILE :DEFSYSTEM-DEPENDS-ON).
sbcl-1.0.58-linux-x86
(LOAD bit-smasher FAIL) ASDF:LOAD-SYSTEM-DEFINITION-ERROR : Error while trying to load definition for system cl-base58 from pathname /home/testgrid/cl-test-grid/work-dir/agent/quicklisp/dists/quicklisp/software/cl-base58-20150113-git/cl-base58.asd: Invalid initialization argument: :HOMEPAGE in call for class #<STANDARD-CLASS SYSTEM>. See also: The ANSI Standard, Section 7.1.2
cavemanecl-13.5.1-76a84246-linux-x64-bytecode
(LOAD caveman FAIL) SI::SIMPLE-PACKAGE-ERROR : Cannot find symbol "VARIABLE-INFORMATION" in package #<"SI" package>
(LOAD caveman-middleware-dbimanager FAIL) SI::SIMPLE-PACKAGE-ERROR : Cannot find symbol "VARIABLE-INFORMATION" in package #<"SI" package>
(LOAD caveman-test FAIL) SI::SIMPLE-PACKAGE-ERROR : Cannot find symbol "VARIABLE-INFORMATION" in package #<"SI" package>
(LOAD caveman2 FAIL) SI::SIMPLE-PACKAGE-ERROR : Cannot find symbol "VARIABLE-INFORMATION" in package #<"SI" package>
(LOAD caveman2-db FAIL) SI::SIMPLE-PACKAGE-ERROR : Cannot find symbol "VARIABLE-INFORMATION" in package #<"SI" package>
(LOAD caveman2-test FAIL) SI::SIMPLE-PACKAGE-ERROR : Cannot find symbol "VARIABLE-INFORMATION" in package #<"SI" package>
ecl-13.5.1-76a84246-linux-x64-lisp-to-c
(LOAD caveman FAIL) UIOP/LISP-BUILD:COMPILE-FILE-ERROR : COMPILE-FILE-ERROR while compiling #<cl-source-file "xsubseq" "src" "xsubseq">
(LOAD caveman-middleware-dbimanager FAIL) UIOP/LISP-BUILD:COMPILE-FILE-ERROR : COMPILE-FILE-ERROR while compiling #<cl-source-file "xsubseq" "src" "xsubseq">
(LOAD caveman-test FAIL) UIOP/LISP-BUILD:COMPILE-FILE-ERROR : COMPILE-FILE-ERROR while compiling #<cl-source-file "xsubseq" "src" "xsubseq">
(LOAD caveman2 FAIL) UIOP/LISP-BUILD:COMPILE-FILE-ERROR : COMPILE-FILE-ERROR while compiling #<cl-source-file "quri" "src" "parser">
(LOAD caveman2-db FAIL) UIOP/LISP-BUILD:COMPILE-FILE-ERROR : COMPILE-FILE-ERROR while compiling #<cl-source-file "xsubseq" "src" "xsubseq">
(LOAD caveman2-test FAIL) UIOP/LISP-BUILD:COMPILE-FILE-ERROR : COMPILE-FILE-ERROR while compiling #<cl-source-file "quri" "src" "parser">
ecl-13.5.1-unknown-linux-i686-bytecode
(LOAD caveman FAIL) SI::SIMPLE-PACKAGE-ERROR : Cannot find symbol "VARIABLE-INFORMATION" in package #<"SI" package>
(LOAD caveman-middleware-dbimanager FAIL) SI::SIMPLE-PACKAGE-ERROR : Cannot find symbol "VARIABLE-INFORMATION" in package #<"SI" package>
(LOAD caveman-test FAIL) SI::SIMPLE-PACKAGE-ERROR : Cannot find symbol "VARIABLE-INFORMATION" in package #<"SI" package>
(LOAD caveman2 FAIL) SI::SIMPLE-PACKAGE-ERROR : Cannot find symbol "VARIABLE-INFORMATION" in package #<"SI" package>
(LOAD caveman2-db FAIL) SI::SIMPLE-PACKAGE-ERROR : Cannot find symbol "VARIABLE-INFORMATION" in package #<"SI" package>
(LOAD caveman2-test FAIL) SI::SIMPLE-PACKAGE-ERROR : Cannot find symbol "VARIABLE-INFORMATION" in package #<"SI" package>
cfficcl-1.10-r16196-f96-linux-x64
(LOAD cffi-libffi FAIL) ffi-grovel, CFFI-GROVEL:GROVEL-ERROR : External process exited with code 1. Command was: "cc" "-m64" "-I/home/hijarian/systems/cl-test-grid/work-dir/agent/quicklisp/dists/quicklisp/software/cffi_0.14.0/" "-o" "/home/hijarian/systems/cl-test-grid/work-dir/agent/test-runs/20141218093601-ccl-1.10-r16196-f96-linux-x64/fasl/ql/dists/quicklisp/software/cffi_0.14.0/libffi/libffi-unix" "/home/hijarian/systems/cl-test-grid/work-dir/agent/test-runs/20141218093601-ccl-1.10-r16196-f96-linux-x64/fasl/ql/dists/quicklisp/software/cffi_0.14.0/libffi/libffi-unix.c" Output was: /home/hijarian/systems/cl-test-grid/work-dir/agent/test-runs/20141218093601-ccl-1.10-r16196-f96-linux-x64/fasl/ql/dists/quicklisp/software/cffi_0.14.0/libffi/libffi-unix.c:7:17: fatal error: ffi.h: Нет такого файла или каталога #include <ffi.h> ^ compilation terminated.
(LOAD cffi-tests FAIL) ffi-grovel, CFFI-GROVEL:GROVEL-ERROR : External process exited with code 1. Command was: "cc" "-m64" "-I/home/hijarian/systems/cl-test-grid/work-dir/agent/quicklisp/dists/quicklisp/software/cffi_0.14.0/" "-o" "/home/hijarian/systems/cl-test-grid/work-dir/agent/test-runs/20141218093601-ccl-1.10-r16196-f96-linux-x64/fasl/ql/dists/quicklisp/software/cffi_0.14.0/libffi/libffi-unix" "/home/hijarian/systems/cl-test-grid/work-dir/agent/test-runs/20141218093601-ccl-1.10-r16196-f96-linux-x64/fasl/ql/dists/quicklisp/software/cffi_0.14.0/libffi/libffi-unix.c" Output was: /home/hijarian/systems/cl-test-grid/work-dir/agent/test-runs/20141218093601-ccl-1.10-r16196-f96-linux-x64/fasl/ql/dists/quicklisp/software/cffi_0.14.0/libffi/libffi-unix.c:7:17: fatal error: ffi.h: Нет такого файла или каталога #include <ffi.h> ^ compilation terminated.
clisp-2.49-unix-x64
(LOAD cffi-libffi FAIL) ffi-grovel, CFFI-GROVEL:GROVEL-ERROR : External process exited with code 1. Command was: "cc" "-m64" "-I/home/hijarian/systems/cl-test-grid/work-dir/agent/quicklisp/dists/quicklisp/software/cffi_0.14.0/" "-o" "/home/hijarian/systems/cl-test-grid/work-dir/agent/test-runs/20141218073936-clisp-2.49-unix-x64/fasl/ql/dists/quicklisp/software/cffi_0.14.0/libffi/libffi-unix" "/home/hijarian/systems/cl-test-grid/work-dir/agent/test-runs/20141218073936-clisp-2.49-unix-x64/fasl/ql/dists/quicklisp/software/cffi_0.14.0/libffi/libffi-unix.c" Output was: <see above>
(LOAD cffi-tests FAIL) ffi-grovel, CFFI-GROVEL:GROVEL-ERROR : External process exited with code 1. Command was: "cc" "-m64" "-I/home/hijarian/systems/cl-test-grid/work-dir/agent/quicklisp/dists/quicklisp/software/cffi_0.14.0/" "-o" "/home/hijarian/systems/cl-test-grid/work-dir/agent/test-runs/20141218073936-clisp-2.49-unix-x64/fasl/ql/dists/quicklisp/software/cffi_0.14.0/libffi/libffi-unix" "/home/hijarian/systems/cl-test-grid/work-dir/agent/test-runs/20141218073936-clisp-2.49-unix-x64/fasl/ql/dists/quicklisp/software/cffi_0.14.0/libffi/libffi-unix.c" Output was: <see above>
ecl-13.5.1-76a84246-linux-x64-lisp-to-c
(LOAD cffi-libffi FAIL) ffi-grovel, CFFI-GROVEL:GROVEL-ERROR : External process exited with code 1. Command was: "cc" "-m64" " -D_GNU_SOURCE -D_FILE_OFFSET_BITS=64 -g -O2 -fPIC -D_THREAD_SAFE -Dlinux" "-I/home/hijarian/systems/cl-test-grid/work-dir/agent/quicklisp/dists/quicklisp/software/cffi_0.14.0/" "-o" "/home/hijarian/systems/cl-test-grid/work-dir/agent/test-runs/20141218135157-ecl-13.5.1-76a84246-linux-x64-lisp-to-c/fasl/ql/dists/quicklisp/software/cffi_0.14.0/libffi/libffi-unix" "/home/hijarian/systems/cl-test-grid/work-dir/agent/test-runs/20141218135157-ecl-13.5.1-76a84246-linux-x64-lisp-to-c/fasl/ql/dists/quicklisp/software/cffi_0.14.0/libffi/libffi-unix.c" Output was: <see above>
(LOAD cffi-tests FAIL) ffi-grovel, CFFI-GROVEL:GROVEL-ERROR : External process exited with code 1. Command was: "cc" "-m64" " -D_GNU_SOURCE -D_FILE_OFFSET_BITS=64 -g -O2 -fPIC -D_THREAD_SAFE -Dlinux" "-I/home/hijarian/systems/cl-test-grid/work-dir/agent/quicklisp/dists/quicklisp/software/cffi_0.14.0/" "-o" "/home/hijarian/systems/cl-test-grid/work-dir/agent/test-runs/20141218135157-ecl-13.5.1-76a84246-linux-x64-lisp-to-c/fasl/ql/dists/quicklisp/software/cffi_0.14.0/libffi/libffi-unix" "/home/hijarian/systems/cl-test-grid/work-dir/agent/test-runs/20141218135157-ecl-13.5.1-76a84246-linux-x64-lisp-to-c/fasl/ql/dists/quicklisp/software/cffi_0.14.0/libffi/libffi-unix.c" Output was: <see above>
sbcl-1.2.3-linux-x64
(LOAD cffi-libffi FAIL) ffi-grovel, CFFI-GROVEL:GROVEL-ERROR : External process exited with code 1. Command was: "cc" "-m64" "-I/home/hijarian/systems/cl-test-grid/work-dir/agent/quicklisp/dists/quicklisp/software/cffi_0.14.0/" "-o" "/home/hijarian/systems/cl-test-grid/work-dir/agent/test-runs/20141218115532-sbcl-1.2.3-linux-x64/fasl/ql/dists/quicklisp/software/cffi_0.14.0/libffi/libffi-unix" "/home/hijarian/systems/cl-test-grid/work-dir/agent/test-runs/20141218115532-sbcl-1.2.3-linux-x64/fasl/ql/dists/quicklisp/software/cffi_0.14.0/libffi/libffi-unix.c" Output was: /home/hijarian/systems/cl-test-grid/work-dir/agent/test-runs/20141218115532-sbcl-1.2.3-linux-x64/fasl/ql/dists/quicklisp/software/cffi_0.14.0/libffi/libffi-unix.c:7:17: fatal error: ffi.h: Нет такого файла или каталога #include <ffi.h> ^ compilation terminated.
(LOAD cffi-tests FAIL) ffi-grovel, CFFI-GROVEL:GROVEL-ERROR : External process exited with code 1. Command was: "cc" "-m64" "-I/home/hijarian/systems/cl-test-grid/work-dir/agent/quicklisp/dists/quicklisp/software/cffi_0.14.0/" "-o" "/home/hijarian/systems/cl-test-grid/work-dir/agent/test-runs/20141218115532-sbcl-1.2.3-linux-x64/fasl/ql/dists/quicklisp/software/cffi_0.14.0/libffi/libffi-unix" "/home/hijarian/systems/cl-test-grid/work-dir/agent/test-runs/20141218115532-sbcl-1.2.3-linux-x64/fasl/ql/dists/quicklisp/software/cffi_0.14.0/libffi/libffi-unix.c" Output was: /home/hijarian/systems/cl-test-grid/work-dir/agent/test-runs/20141218115532-sbcl-1.2.3-linux-x64/fasl/ql/dists/quicklisp/software/cffi_0.14.0/libffi/libffi-unix.c:7:17: fatal error: ffi.h: Нет такого файла или каталога #include <ffi.h> ^ compilation terminated.
cl-acronymsabcl-1.2.1-fasl42-linux-x86
(LOAD cl-acronyms FAIL) COMMON-LISP:TYPE-ERROR : The value NIL is not of type NUMBER.
abcl-1.3.0-fasl42-linux-x86
(LOAD cl-acronyms FAIL) COMMON-LISP:TYPE-ERROR : The value NIL is not of type NUMBER.
abcl-1.3.1-fasl42-linux-x86
(LOAD cl-acronyms FAIL) COMMON-LISP:TYPE-ERROR : The value NIL is not of type NUMBER.
cl-ansi-textabcl-1.2.1-fasl42-linux-x86
(LOAD cl-ansi-text FAIL) COMMON-LISP:READER-ERROR : The symbol "RGB-RED" is not external in package CL-COLORS.
abcl-1.3.0-fasl42-linux-x86
(LOAD cl-ansi-text FAIL) COMMON-LISP:READER-ERROR : The symbol "RGB-RED" is not external in package CL-COLORS.
abcl-1.3.1-fasl42-linux-x86
(LOAD cl-ansi-text FAIL) COMMON-LISP:READER-ERROR : The symbol "RGB-RED" is not external in package CL-COLORS.
cl-base58ccl-1.8-r15286m-f95-linux-x86
(LOAD cl-base58 FAIL) ASDF:LOAD-SYSTEM-DEFINITION-ERROR : Error while trying to load definition for system cl-base58 from pathname /home/testgrid/cl-test-grid/work-dir/agent/quicklisp/dists/quicklisp/software/cl-base58-20150113-git/cl-base58.asd: :HOMEPAGE is an invalid initarg to REINITIALIZE-INSTANCE for #<STANDARD-CLASS SYSTEM>. Valid initargs: (:NAME :VERSION :DESCRIPTION :LONG-DESCRIPTION :IN-ORDER-TO :DO-FIRST :PARENT :PATHNAME :AROUND-COMPILE :ENCODING :PROPERTIES :COMPONENTS :IF-COMPONENT-DEP-FAILS :DEFAULT-COMPONENT-CLASS :AUTHOR :MAINTAINER :LICENCE :LICENSE :SOURCE-FILE :DEFSYSTEM-DEPENDS-ON).
(LOAD cl-base58-test FAIL) ASDF:LOAD-SYSTEM-DEFINITION-ERROR : Error while trying to load definition for system cl-base58 from pathname /home/testgrid/cl-test-grid/work-dir/agent/quicklisp/dists/quicklisp/software/cl-base58-20150113-git/cl-base58.asd: :HOMEPAGE is an invalid initarg to REINITIALIZE-INSTANCE for #<STANDARD-CLASS SYSTEM>. Valid initargs: (:NAME :VERSION :DESCRIPTION :LONG-DESCRIPTION :IN-ORDER-TO :DO-FIRST :PARENT :PATHNAME :AROUND-COMPILE :ENCODING :PROPERTIES :COMPONENTS :IF-COMPONENT-DEP-FAILS :DEFAULT-COMPONENT-CLASS :AUTHOR :MAINTAINER :LICENCE :LICENSE :SOURCE-FILE :DEFSYSTEM-DEPENDS-ON).
clisp-2.49-unix-x64
(LOAD cl-base58 FAIL) ASDF:LOAD-SYSTEM-DEFINITION-ERROR : Error while trying to load definition for system cl-base58 from pathname /home/hijarian/systems/cl-test-grid/work-dir/agent/quicklisp/dists/quicklisp/software/cl-base58-20150113-git/cl-base58.asd: REINITIALIZE-INSTANCE: некорректная пара ключевое слово/значение :HOMEPAGE, "https://github.com/eudoxia0/cl-base58" в списке аргументов. Разрешенные ключевые слова: (:NAME :VERSION :IN-ORDER-TO :DO-FIRST :PARENT :PATHNAME :AROUND-COMPILE :ENCODING :PROPERTIES :COMPONENTS :IF-COMPONENT-DEP-FAILS :DEFAULT-COMPONENT-CLASS :DESCRIPTION :LONG-DESCRIPTION :AUTHOR :MAINTAINER :LICENCE :LICENSE :SOURCE-FILE :DEFSYSTEM-DEPENDS-ON)
(LOAD cl-base58-test FAIL) ASDF:LOAD-SYSTEM-DEFINITION-ERROR : Error while trying to load definition for system cl-base58 from pathname /home/hijarian/systems/cl-test-grid/work-dir/agent/quicklisp/dists/quicklisp/software/cl-base58-20150113-git/cl-base58.asd: REINITIALIZE-INSTANCE: некорректная пара ключевое слово/значение :HOMEPAGE, "https://github.com/eudoxia0/cl-base58" в списке аргументов. Разрешенные ключевые слова: (:NAME :VERSION :IN-ORDER-TO :DO-FIRST :PARENT :PATHNAME :AROUND-COMPILE :ENCODING :PROPERTIES :COMPONENTS :IF-COMPONENT-DEP-FAILS :DEFAULT-COMPONENT-CLASS :DESCRIPTION :LONG-DESCRIPTION :AUTHOR :MAINTAINER :LICENCE :LICENSE :SOURCE-FILE :DEFSYSTEM-DEPENDS-ON)
clisp-2.49-unix-x86
(LOAD cl-base58 FAIL) ASDF:LOAD-SYSTEM-DEFINITION-ERROR : Error while trying to load definition for system cl-base58 from pathname /home/testgrid/cl-test-grid/work-dir/agent/quicklisp/dists/quicklisp/software/cl-base58-20150113-git/cl-base58.asd: REINITIALIZE-INSTANCE: illegal keyword/value pair :HOMEPAGE, "https://github.com/eudoxia0/cl-base58" in argument list. The allowed keywords are (:NAME :VERSION :IN-ORDER-TO :DO-FIRST :PARENT :PATHNAME :AROUND-COMPILE :ENCODING :PROPERTIES :COMPONENTS :IF-COMPONENT-DEP-FAILS :DEFAULT-COMPONENT-CLASS :DESCRIPTION :LONG-DESCRIPTION :AUTHOR :MAINTAINER :LICENCE :LICENSE :SOURCE-FILE :DEFSYSTEM-DEPENDS-ON)
(LOAD cl-base58-test FAIL) ASDF:LOAD-SYSTEM-DEFINITION-ERROR : Error while trying to load definition for system cl-base58 from pathname /home/testgrid/cl-test-grid/work-dir/agent/quicklisp/dists/quicklisp/software/cl-base58-20150113-git/cl-base58.asd: REINITIALIZE-INSTANCE: illegal keyword/value pair :HOMEPAGE, "https://github.com/eudoxia0/cl-base58" in argument list. The allowed keywords are (:NAME :VERSION :IN-ORDER-TO :DO-FIRST :PARENT :PATHNAME :AROUND-COMPILE :ENCODING :PROPERTIES :COMPONENTS :IF-COMPONENT-DEP-FAILS :DEFAULT-COMPONENT-CLASS :DESCRIPTION :LONG-DESCRIPTION :AUTHOR :MAINTAINER :LICENCE :LICENSE :SOURCE-FILE :DEFSYSTEM-DEPENDS-ON)
sbcl-1.0.58-linux-x86
(LOAD cl-base58 FAIL) ASDF:LOAD-SYSTEM-DEFINITION-ERROR : Error while trying to load definition for system cl-base58 from pathname /home/testgrid/cl-test-grid/work-dir/agent/quicklisp/dists/quicklisp/software/cl-base58-20150113-git/cl-base58.asd: Invalid initialization argument: :HOMEPAGE in call for class #<STANDARD-CLASS SYSTEM>. See also: The ANSI Standard, Section 7.1.2
cl-cffi-gtkclisp-2.49-unix-x64
cl-libusbccl-1.10-r16196-f96-linux-x64
(LOAD cl-libusb FAIL) ffi-grovel, CFFI-GROVEL:GROVEL-ERROR : External process exited with code 1. Command was: "cc" "-m64" "-I/home/hijarian/systems/cl-test-grid/work-dir/agent/quicklisp/dists/quicklisp/software/cffi_0.14.0/" "-o" "/home/hijarian/systems/cl-test-grid/work-dir/agent/test-runs/20141218093601-ccl-1.10-r16196-f96-linux-x64/fasl/ql/dists/quicklisp/software/cl-libusb-20130312-git/libusb-grovel" "/home/hijarian/systems/cl-test-grid/work-dir/agent/test-runs/20141218093601-ccl-1.10-r16196-f96-linux-x64/fasl/ql/dists/quicklisp/software/cl-libusb-20130312-git/libusb-grovel.c" Output was: /home/hijarian/systems/cl-test-grid/work-dir/agent/test-runs/20141218093601-ccl-1.10-r16196-f96-linux-x64/fasl/ql/dists/quicklisp/software/cl-libusb-20130312-git/libusb-grovel.c:6:17: fatal error: usb.h: Нет такого файла или каталога #include <usb.h> ^ compilation terminated.
(LOAD libusb-ffi FAIL) ffi-grovel, CFFI-GROVEL:GROVEL-ERROR : External process exited with code 1. Command was: "cc" "-m64" "-I/home/hijarian/systems/cl-test-grid/work-dir/agent/quicklisp/dists/quicklisp/software/cffi_0.14.0/" "-o" "/home/hijarian/systems/cl-test-grid/work-dir/agent/test-runs/20141218093601-ccl-1.10-r16196-f96-linux-x64/fasl/ql/dists/quicklisp/software/cl-libusb-20130312-git/libusb-grovel" "/home/hijarian/systems/cl-test-grid/work-dir/agent/test-runs/20141218093601-ccl-1.10-r16196-f96-linux-x64/fasl/ql/dists/quicklisp/software/cl-libusb-20130312-git/libusb-grovel.c" Output was: /home/hijarian/systems/cl-test-grid/work-dir/agent/test-runs/20141218093601-ccl-1.10-r16196-f96-linux-x64/fasl/ql/dists/quicklisp/software/cl-libusb-20130312-git/libusb-grovel.c:6:17: fatal error: usb.h: Нет такого файла или каталога #include <usb.h> ^ compilation terminated.
sbcl-1.2.3-linux-x64
(LOAD cl-libusb FAIL) ffi-grovel, CFFI-GROVEL:GROVEL-ERROR : External process exited with code 1. Command was: "cc" "-m64" "-I/home/hijarian/systems/cl-test-grid/work-dir/agent/quicklisp/dists/quicklisp/software/cffi_0.14.0/" "-o" "/home/hijarian/systems/cl-test-grid/work-dir/agent/test-runs/20141218115532-sbcl-1.2.3-linux-x64/fasl/ql/dists/quicklisp/software/cl-libusb-20130312-git/libusb-grovel" "/home/hijarian/systems/cl-test-grid/work-dir/agent/test-runs/20141218115532-sbcl-1.2.3-linux-x64/fasl/ql/dists/quicklisp/software/cl-libusb-20130312-git/libusb-grovel.c" Output was: /home/hijarian/systems/cl-test-grid/work-dir/agent/test-runs/20141218115532-sbcl-1.2.3-linux-x64/fasl/ql/dists/quicklisp/software/cl-libusb-20130312-git/libusb-grovel.c:6:17: fatal error: usb.h: Нет такого файла или каталога #include <usb.h> ^ compilation terminated.
(LOAD libusb-ffi FAIL) ffi-grovel, CFFI-GROVEL:GROVEL-ERROR : External process exited with code 1. Command was: "cc" "-m64" "-I/home/hijarian/systems/cl-test-grid/work-dir/agent/quicklisp/dists/quicklisp/software/cffi_0.14.0/" "-o" "/home/hijarian/systems/cl-test-grid/work-dir/agent/test-runs/20141218115532-sbcl-1.2.3-linux-x64/fasl/ql/dists/quicklisp/software/cl-libusb-20130312-git/libusb-grovel" "/home/hijarian/systems/cl-test-grid/work-dir/agent/test-runs/20141218115532-sbcl-1.2.3-linux-x64/fasl/ql/dists/quicklisp/software/cl-libusb-20130312-git/libusb-grovel.c" Output was: /home/hijarian/systems/cl-test-grid/work-dir/agent/test-runs/20141218115532-sbcl-1.2.3-linux-x64/fasl/ql/dists/quicklisp/software/cl-libusb-20130312-git/libusb-grovel.c:6:17: fatal error: usb.h: Нет такого файла или каталога #include <usb.h> ^ compilation terminated.
cl-popenabcl-1.2.1-fasl42-linux-x86
(LOAD cl-popen FAIL) ASDF/FIND-SYSTEM:MISSING-COMPONENT : Component "iolib/streams" not found
ccl-1.9-r15756-f96-linux-x86
(LOAD cl-popen FAIL) ASDF/FIND-SYSTEM:MISSING-COMPONENT : Component "iolib/streams" not found
cmu-snapshot-2013-04__20d_unicode_-linux-x86
(LOAD cl-popen FAIL) ASDF/FIND-SYSTEM:MISSING-COMPONENT : Component "iolib/streams" not found
sbcl-1.1.11-linux-x86
(LOAD cl-popen FAIL) ASDF/FIND-SYSTEM:MISSING-COMPONENT : Component "iolib/streams" not found
sbcl-1.1.16-linux-x86
(LOAD cl-popen FAIL) ASDF/FIND-SYSTEM:MISSING-COMPONENT : Component "iolib/streams" not found
cl-rrtabcl-1.3.0-fasl42-linux-x86
clisp-2.49-unix-x64
(LOAD cl-rrt.benchmark FAIL) SYSTEM::SIMPLE-UNBOUND-VARIABLE : NEXT-ITERATION: variable ITERATE::*LOOP-STEP* has no value
ecl-13.5.1-76a84246-linux-x64-bytecode
cl-rsvg2clisp-2.49-unix-x64
clackecl-13.5.1-76a84246-linux-x64-bytecode
(LOAD clack FAIL) SI::SIMPLE-PACKAGE-ERROR : Cannot find symbol "VARIABLE-INFORMATION" in package #<"SI" package>
(LOAD clack-handler-hunchentoot FAIL) SI::SIMPLE-PACKAGE-ERROR : Cannot find symbol "VARIABLE-INFORMATION" in package #<"SI" package>
(LOAD clack-handler-toot FAIL) SI::SIMPLE-PACKAGE-ERROR : Cannot find symbol "VARIABLE-INFORMATION" in package #<"SI" package>
(LOAD clack-middleware-auth-basic FAIL) SI::SIMPLE-PACKAGE-ERROR : Cannot find symbol "VARIABLE-INFORMATION" in package #<"SI" package>
(LOAD clack-middleware-csrf FAIL) SI::SIMPLE-PACKAGE-ERROR : Cannot find symbol "VARIABLE-INFORMATION" in package #<"SI" package>
(LOAD clack-middleware-dbi FAIL) SI::SIMPLE-PACKAGE-ERROR : Cannot find symbol "VARIABLE-INFORMATION" in package #<"SI" package>
(LOAD clack-middleware-oauth FAIL) SI::SIMPLE-PACKAGE-ERROR : Cannot find symbol "VARIABLE-INFORMATION" in package #<"SI" package>
(LOAD clack-session-store-dbi FAIL) SI::SIMPLE-PACKAGE-ERROR : Cannot find symbol "VARIABLE-INFORMATION" in package #<"SI" package>
(LOAD clack-test FAIL) SI::SIMPLE-PACKAGE-ERROR : Cannot find symbol "VARIABLE-INFORMATION" in package #<"SI" package>
(LOAD t-clack-middleware-csrf FAIL) SI::SIMPLE-PACKAGE-ERROR : Cannot find symbol "VARIABLE-INFORMATION" in package #<"SI" package>
ecl-13.5.1-76a84246-linux-x64-lisp-to-c
(LOAD clack FAIL) UIOP/LISP-BUILD:COMPILE-FILE-ERROR : COMPILE-FILE-ERROR while compiling #<cl-source-file "xsubseq" "src" "xsubseq">
(LOAD clack-handler-hunchentoot FAIL) UIOP/LISP-BUILD:COMPILE-FILE-ERROR : COMPILE-FILE-ERROR while compiling #<cl-source-file "xsubseq" "src" "xsubseq">
(LOAD clack-handler-toot FAIL) UIOP/LISP-BUILD:COMPILE-FILE-ERROR : COMPILE-FILE-ERROR while compiling #<cl-source-file "xsubseq" "src" "xsubseq">
(LOAD clack-middleware-auth-basic FAIL) UIOP/LISP-BUILD:COMPILE-FILE-ERROR : COMPILE-FILE-ERROR while compiling #<cl-source-file "xsubseq" "src" "xsubseq">
(LOAD clack-middleware-csrf FAIL) UIOP/LISP-BUILD:COMPILE-FILE-ERROR : COMPILE-FILE-ERROR while compiling #<cl-source-file "xsubseq" "src" "xsubseq">
(LOAD clack-middleware-dbi FAIL) UIOP/LISP-BUILD:COMPILE-FILE-ERROR : COMPILE-FILE-ERROR while compiling #<cl-source-file "xsubseq" "src" "xsubseq">
(LOAD clack-middleware-oauth FAIL) UIOP/LISP-BUILD:COMPILE-FILE-ERROR : COMPILE-FILE-ERROR while compiling #<cl-source-file "xsubseq" "src" "xsubseq">
(LOAD clack-session-store-dbi FAIL) UIOP/LISP-BUILD:COMPILE-FILE-ERROR : COMPILE-FILE-ERROR while compiling #<cl-source-file "xsubseq" "src" "xsubseq">
(LOAD clack-test FAIL) UIOP/LISP-BUILD:COMPILE-FILE-ERROR : COMPILE-FILE-ERROR while compiling #<cl-source-file "xsubseq" "src" "xsubseq">
(LOAD t-clack-middleware-csrf FAIL) UIOP/LISP-BUILD:COMPILE-FILE-ERROR : COMPILE-FILE-ERROR while compiling #<cl-source-file "xsubseq" "src" "xsubseq">
ecl-13.5.1-unknown-linux-i686-bytecode
(LOAD clack FAIL) SI::SIMPLE-PACKAGE-ERROR : Cannot find symbol "VARIABLE-INFORMATION" in package #<"SI" package>
(LOAD clack-handler-hunchentoot FAIL) SI::SIMPLE-PACKAGE-ERROR : Cannot find symbol "VARIABLE-INFORMATION" in package #<"SI" package>
(LOAD clack-handler-toot FAIL) SI::SIMPLE-PACKAGE-ERROR : Cannot find symbol "VARIABLE-INFORMATION" in package #<"SI" package>
(LOAD clack-middleware-auth-basic FAIL) SI::SIMPLE-PACKAGE-ERROR : Cannot find symbol "VARIABLE-INFORMATION" in package #<"SI" package>
(LOAD clack-middleware-csrf FAIL) SI::SIMPLE-PACKAGE-ERROR : Cannot find symbol "VARIABLE-INFORMATION" in package #<"SI" package>
(LOAD clack-middleware-dbi FAIL) SI::SIMPLE-PACKAGE-ERROR : Cannot find symbol "VARIABLE-INFORMATION" in package #<"SI" package>
(LOAD clack-middleware-oauth FAIL) SI::SIMPLE-PACKAGE-ERROR : Cannot find symbol "VARIABLE-INFORMATION" in package #<"SI" package>
(LOAD clack-session-store-dbi FAIL) SI::SIMPLE-PACKAGE-ERROR : Cannot find symbol "VARIABLE-INFORMATION" in package #<"SI" package>
(LOAD clack-test FAIL) SI::SIMPLE-PACKAGE-ERROR : Cannot find symbol "VARIABLE-INFORMATION" in package #<"SI" package>
(LOAD t-clack-middleware-csrf FAIL) SI::SIMPLE-PACKAGE-ERROR : Cannot find symbol "VARIABLE-INFORMATION" in package #<"SI" package>
clack-errorsecl-13.5.1-76a84246-linux-x64-bytecode
(LOAD clack-errors FAIL) SI::SIMPLE-PACKAGE-ERROR : Cannot find symbol "VARIABLE-INFORMATION" in package #<"SI" package>
(LOAD clack-errors-demo FAIL) SI::SIMPLE-PACKAGE-ERROR : Cannot find symbol "VARIABLE-INFORMATION" in package #<"SI" package>
ecl-13.5.1-76a84246-linux-x64-lisp-to-c
(LOAD clack-errors FAIL) UIOP/LISP-BUILD:COMPILE-FILE-ERROR : COMPILE-FILE-ERROR while compiling #<cl-source-file "xsubseq" "src" "xsubseq">
(LOAD clack-errors-demo FAIL) UIOP/LISP-BUILD:COMPILE-FILE-ERROR : COMPILE-FILE-ERROR while compiling #<cl-source-file "xsubseq" "src" "xsubseq">
ecl-13.5.1-unknown-linux-i686-bytecode
(LOAD clack-errors FAIL) SI::SIMPLE-PACKAGE-ERROR : Cannot find symbol "VARIABLE-INFORMATION" in package #<"SI" package>
(LOAD clack-errors-demo FAIL) SI::SIMPLE-PACKAGE-ERROR : Cannot find symbol "VARIABLE-INFORMATION" in package #<"SI" package>
clipcmu-snapshot-2013-04__20d_unicode_-linux-x86
(LOAD clip FAIL) COMMON-LISP:SIMPLE-ERROR : Error in function C::DUMP-STRUCTURE: Attempt to dump invalid structure: #<KERNEL::STANDARD-CLASS PLUMP-DOM:CHILD-NODE {58217355}> How did this happen?
cmu-snapshot-2014-01__20e_unicode_-linux-x86
(LOAD clip FAIL) COMMON-LISP:SIMPLE-ERROR : Error in function C::DUMP-STRUCTURE: Attempt to dump invalid structure: #<KERNEL::STANDARD-CLASS PLUMP-DOM:CHILD-NODE {5812C7AD}> How did this happen?
cmu-snapshot-2014-05-dirty__20e_unicode_-linux-x86
(LOAD clip FAIL) COMMON-LISP:SIMPLE-ERROR : Error in function C::DUMP-STRUCTURE: Attempt to dump invalid structure: #<KERNEL::STANDARD-CLASS PLUMP-DOM:CHILD-NODE {5824627D}> How did this happen?
cmu-snapshot-2014-12___20f_unicode_-linux-x86
(LOAD clip FAIL) COMMON-LISP:SIMPLE-ERROR : Error in function C::DUMP-STRUCTURE: Attempt to dump invalid structure: #<KERNEL::STANDARD-CLASS PLUMP-DOM:CHILD-NODE {5836F64D}> How did this happen?
clos-fixturesccl-1.9-r15756-f96-linux-x86
(LOAD clos-fixtures FAIL) ASDF/FIND-COMPONENT:MISSING-DEPENDENCY-OF-VERSION : Component "asdf" does not match version 3.0, required by #<SYSTEM "clos-fixtures">
(LOAD clos-fixtures-test FAIL) ASDF/FIND-SYSTEM:LOAD-SYSTEM-DEFINITION-ERROR : Error while trying to load definition for system clos-fixtures-test from pathname /home/testgrid/cl-test-grid/work-dir/agent/quicklisp/dists/quicklisp/software/clos-fixtures-20140713-git/clos-fixtures-test.asd: Component "asdf" does not match version 3.0, required by #<SYSTEM "clos-fixtures">
cmu-snapshot-2013-04__20d_unicode_-linux-x86
(LOAD clos-fixtures FAIL) ASDF/FIND-COMPONENT:MISSING-DEPENDENCY-OF-VERSION : Component "asdf" does not match version 3.0, required by #<SYSTEM "clos-fixtures">
(LOAD clos-fixtures-test FAIL) ASDF/FIND-SYSTEM:LOAD-SYSTEM-DEFINITION-ERROR : Error while trying to load definition for system clos-fixtures-test from pathname /home/testgrid/cl-test-grid/work-dir/agent/quicklisp/dists/quicklisp/software/clos-fixtures-20140713-git/clos-fixtures-test.asd: Component "asdf" does not match version 3.0, required by #<SYSTEM "clos-fixtures">
ecl-13.5.1-unknown-linux-i686-bytecode
(LOAD clos-fixtures FAIL) ASDF/FIND-COMPONENT:MISSING-DEPENDENCY-OF-VERSION : Component "asdf" does not match version 3.0, required by #<system "clos-fixtures">
(LOAD clos-fixtures-test FAIL) ASDF/FIND-SYSTEM:LOAD-SYSTEM-DEFINITION-ERROR : Error while trying to load definition for system clos-fixtures-test from pathname /home/testgrid/cl-test-grid/work-dir/agent/quicklisp/dists/quicklisp/software/clos-fixtures-20140713-git/clos-fixtures-test.asd: Component "asdf" does not match version 3.0, required by #<system "clos-fixtures">
ecl-13.5.1-unknown-linux-i686-lisp-to-c
(LOAD clos-fixtures FAIL) ASDF/FIND-COMPONENT:MISSING-DEPENDENCY-OF-VERSION : Component "asdf" does not match version 3.0, required by #<system "clos-fixtures">
(LOAD clos-fixtures-test FAIL) ASDF/FIND-SYSTEM:LOAD-SYSTEM-DEFINITION-ERROR : Error while trying to load definition for system clos-fixtures-test from pathname /home/testgrid/cl-test-grid/work-dir/agent/quicklisp/dists/quicklisp/software/clos-fixtures-20140713-git/clos-fixtures-test.asd: Component "asdf" does not match version 3.0, required by #<system "clos-fixtures">
com.informatimagoecl-13.5.1-76a84246-linux-x64-bytecode
(LOAD com.informatimago.clext FAIL) COMMON-LISP:SIMPLE-ERROR : Too many arguments supplied to a macro or a destructuring-bind form: (DEFPARAMETER *LISP-ENCODINGS* '(("ISO-8859-1") ("UTF-8")) (PROGN (WARN "What are the available external formats in ~A ?" (LISP-IMPLEMENTATION-TYPE)) '(("US-ASCII"))) "Give an a-list of name and list of aliases of encoding systems in the current Common Lisp implementation. Those names and aliases are strings.")
(LOAD com.informatimago.tools.make-depends FAIL) COMMON-LISP:SIMPLE-ERROR : Too many arguments supplied to a macro or a destructuring-bind form: (DEFPARAMETER *LISP-ENCODINGS* '(("ISO-8859-1") ("UTF-8")) (PROGN (WARN "What are the available external formats in ~A ?" (LISP-IMPLEMENTATION-TYPE)) '(("US-ASCII"))) "Give an a-list of name and list of aliases of encoding systems in the current Common Lisp implementation. Those names and aliases are strings.")
ecl-13.5.1-76a84246-linux-x64-lisp-to-c
(LOAD com.informatimago.clext FAIL) UIOP/LISP-BUILD:COMPILE-FILE-ERROR : COMPILE-FILE-ERROR while compiling #<cl-source-file "com.informatimago.clext" "character-sets">
(LOAD com.informatimago.lispdoc FAIL) UIOP/LISP-BUILD:COMPILE-FILE-ERROR : COMPILE-FILE-ERROR while compiling #<cl-source-file "com.informatimago.clext" "character-sets">
(LOAD com.informatimago.tools.make-depends FAIL) UIOP/LISP-BUILD:COMPILE-FILE-ERROR : COMPILE-FILE-ERROR while compiling #<cl-source-file "com.informatimago.clext" "character-sets">
ecl-13.5.1-unknown-linux-i686-bytecode
(LOAD com.informatimago.clext FAIL) COMMON-LISP:SIMPLE-ERROR : Too many arguments supplied to a macro or a destructuring-bind form: (DEFPARAMETER *LISP-ENCODINGS* '(("ISO-8859-1") ("UTF-8")) (PROGN (WARN "What are the available external formats in ~A ?" (LISP-IMPLEMENTATION-TYPE)) '(("US-ASCII"))) "Give an a-list of name and list of aliases of encoding systems in the current Common Lisp implementation. Those names and aliases are strings.")
(LOAD com.informatimago.tools.make-depends FAIL) COMMON-LISP:SIMPLE-ERROR : Too many arguments supplied to a macro or a destructuring-bind form: (DEFPARAMETER *LISP-ENCODINGS* '(("ISO-8859-1") ("UTF-8")) (PROGN (WARN "What are the available external formats in ~A ?" (LISP-IMPLEMENTATION-TYPE)) '(("US-ASCII"))) "Give an a-list of name and list of aliases of encoding systems in the current Common Lisp implementation. Those names and aliases are strings.")
ecl-13.5.1-unknown-linux-i686-lisp-to-c
(LOAD com.informatimago.clext FAIL) UIOP/LISP-BUILD:COMPILE-FILE-ERROR : COMPILE-FILE-ERROR while compiling #<cl-source-file "com.informatimago.clext" "character-sets">
(LOAD com.informatimago.lispdoc FAIL) UIOP/LISP-BUILD:COMPILE-FILE-ERROR : COMPILE-FILE-ERROR while compiling #<cl-source-file "com.informatimago.clext" "character-sets">
(LOAD com.informatimago.tools.make-depends FAIL) UIOP/LISP-BUILD:COMPILE-FILE-ERROR : COMPILE-FILE-ERROR while compiling #<cl-source-file "com.informatimago.clext" "character-sets">
coronaecl-13.5.1-76a84246-linux-x64-bytecode
(LOAD corona-test FAIL) SI::SIMPLE-PACKAGE-ERROR : Cannot find symbol "VARIABLE-INFORMATION" in package #<"SI" package>
ecl-13.5.1-76a84246-linux-x64-lisp-to-c
(LOAD corona-test FAIL) UIOP/LISP-BUILD:COMPILE-FILE-ERROR : COMPILE-FILE-ERROR while compiling #<cl-source-file "xsubseq" "src" "xsubseq">
ecl-13.5.1-unknown-linux-i686-bytecode
(LOAD corona-test FAIL) SI::SIMPLE-PACKAGE-ERROR : Cannot find symbol "VARIABLE-INFORMATION" in package #<"SI" package>
craneccl-1.9-r15756-f96-linux-x86
(LOAD crane FAIL) ASDF/FIND-COMPONENT:MISSING-DEPENDENCY-OF-VERSION : Component "asdf" does not match version 3.0, required by #<SYSTEM "clos-fixtures">
(LOAD crane-test FAIL) ASDF/FIND-COMPONENT:MISSING-DEPENDENCY-OF-VERSION : Component "asdf" does not match version 3.0, required by #<SYSTEM "clos-fixtures">
ecl-13.5.1-unknown-linux-i686-bytecode
(LOAD crane FAIL) ASDF/FIND-COMPONENT:MISSING-DEPENDENCY-OF-VERSION : Component "asdf" does not match version 3.0, required by #<system "clos-fixtures">
ecl-13.5.1-unknown-linux-i686-lisp-to-c
(LOAD crane FAIL) ASDF/FIND-COMPONENT:MISSING-DEPENDENCY-OF-VERSION : Component "asdf" does not match version 3.0, required by #<system "clos-fixtures">
ernestineclisp-2.49-unix-x64
(LOAD ernestine FAIL) SYSTEM::SIMPLE-PACKAGE-ERROR : READ из #<INPUT BUFFERED FILE-STREAM CHARACTER #P"/home/hijarian/systems/cl-test-grid/work-dir/agent/quicklisp/dists/quicklisp/software/ernestine-20141217-git/src/tools/misc.lisp" @26>: не существует пакета с именем "SB-EXT"
fast-httpabcl-1.2.1-fasl42-linux-x86
(LOAD fast-http FAIL) COMMON-LISP:PACKAGE-ERROR : The symbol VARIABLE-INFORMATION is not present in package LISP.
(LOAD fast-http-test FAIL) COMMON-LISP:PACKAGE-ERROR : The symbol VARIABLE-INFORMATION is not present in package LISP.
abcl-1.3.0-fasl42-linux-x86
(LOAD fast-http FAIL) COMMON-LISP:PACKAGE-ERROR : The symbol VARIABLE-INFORMATION is not present in package LISP.
abcl-1.3.1-fasl42-linux-x86
(LOAD fast-http FAIL) COMMON-LISP:PACKAGE-ERROR : The symbol VARIABLE-INFORMATION is not present in package LISP.
(LOAD fast-http-test FAIL) COMMON-LISP:PACKAGE-ERROR : The symbol VARIABLE-INFORMATION is not present in package LISP.
clisp-2.49-unix-x64
(LOAD fast-http FAIL) SYSTEM::SIMPLE-PACKAGE-ERROR : SYSTEM::%FIND-PACKAGE: Нет пакетов с именем "VARIABLE-INFORMATION".
(LOAD fast-http-test FAIL) SYSTEM::SIMPLE-PACKAGE-ERROR : SYSTEM::%FIND-PACKAGE: Нет пакетов с именем "VARIABLE-INFORMATION".
clisp-2.49-unix-x86
(LOAD fast-http FAIL) SYSTEM::SIMPLE-PACKAGE-ERROR : SYSTEM::%FIND-PACKAGE: There is no package with name "VARIABLE-INFORMATION"
(LOAD fast-http-test FAIL) SYSTEM::SIMPLE-PACKAGE-ERROR : SYSTEM::%FIND-PACKAGE: There is no package with name "VARIABLE-INFORMATION"
ecl-13.5.1-76a84246-linux-x64-bytecode
(LOAD fast-http FAIL) SI::SIMPLE-PACKAGE-ERROR : Cannot find symbol "VARIABLE-INFORMATION" in package #<"SI" package>
(LOAD fast-http-test FAIL) SI::SIMPLE-PACKAGE-ERROR : Cannot find symbol "VARIABLE-INFORMATION" in package #<"SI" package>
ecl-13.5.1-76a84246-linux-x64-lisp-to-c
(LOAD fast-http FAIL) UIOP/LISP-BUILD:COMPILE-FILE-ERROR : COMPILE-FILE-ERROR while compiling #<cl-source-file "xsubseq" "src" "xsubseq">
(LOAD fast-http-test FAIL) UIOP/LISP-BUILD:COMPILE-FILE-ERROR : COMPILE-FILE-ERROR while compiling #<cl-source-file "xsubseq" "src" "xsubseq">
ecl-13.5.1-unknown-linux-i686-bytecode
(LOAD fast-http FAIL) SI::SIMPLE-PACKAGE-ERROR : Cannot find symbol "VARIABLE-INFORMATION" in package #<"SI" package>
(LOAD fast-http-test FAIL) SI::SIMPLE-PACKAGE-ERROR : Cannot find symbol "VARIABLE-INFORMATION" in package #<"SI" package>
ecl-13.5.1-unknown-linux-i686-lisp-to-c
(LOAD fast-http FAIL) UIOP/LISP-BUILD:COMPILE-FILE-ERROR : COMPILE-FILE-ERROR while compiling #<cl-source-file "xsubseq" "src" "xsubseq">
(LOAD fast-http-test FAIL) UIOP/LISP-BUILD:COMPILE-FILE-ERROR : COMPILE-FILE-ERROR while compiling #<cl-source-file "xsubseq" "src" "xsubseq">
hermeticecl-13.5.1-76a84246-linux-x64-bytecode
(LOAD hermetic FAIL) SI::SIMPLE-PACKAGE-ERROR : Cannot find symbol "VARIABLE-INFORMATION" in package #<"SI" package>
ecl-13.5.1-76a84246-linux-x64-lisp-to-c
(LOAD hermetic FAIL) UIOP/LISP-BUILD:COMPILE-FILE-ERROR : COMPILE-FILE-ERROR while compiling #<cl-source-file "xsubseq" "src" "xsubseq">
ecl-13.5.1-unknown-linux-i686-bytecode
(LOAD hermetic FAIL) SI::SIMPLE-PACKAGE-ERROR : Cannot find symbol "VARIABLE-INFORMATION" in package #<"SI" package>
http-bodyabcl-1.2.1-fasl42-linux-x86
(LOAD http-body FAIL) COMMON-LISP:PACKAGE-ERROR : The symbol VARIABLE-INFORMATION is not present in package LISP.
(LOAD http-body-test FAIL) COMMON-LISP:PACKAGE-ERROR : The symbol VARIABLE-INFORMATION is not present in package LISP.
abcl-1.3.0-fasl42-linux-x86
(LOAD http-body FAIL) COMMON-LISP:PACKAGE-ERROR : The symbol VARIABLE-INFORMATION is not present in package LISP.
(LOAD http-body-test FAIL) COMMON-LISP:PACKAGE-ERROR : The symbol VARIABLE-INFORMATION is not present in package LISP.
abcl-1.3.1-fasl42-linux-x86
(LOAD http-body FAIL) COMMON-LISP:PACKAGE-ERROR : The symbol VARIABLE-INFORMATION is not present in package LISP.
(LOAD http-body-test FAIL) COMMON-LISP:PACKAGE-ERROR : The symbol VARIABLE-INFORMATION is not present in package LISP.
clisp-2.49-unix-x64
(LOAD http-body FAIL) ASDF:LOAD-SYSTEM-DEFINITION-ERROR : Error while trying to load definition for system quri from pathname /home/hijarian/systems/cl-test-grid/work-dir/agent/quicklisp/dists/quicklisp/software/quri-20141217-git/quri.asd: OPEN: Illegal :EXTERNAL-FORMAT argument :UTF-8
(LOAD http-body-test FAIL) ASDF:LOAD-SYSTEM-DEFINITION-ERROR : Error while trying to load definition for system quri from pathname /home/hijarian/systems/cl-test-grid/work-dir/agent/quicklisp/dists/quicklisp/software/quri-20141217-git/quri.asd: OPEN: Illegal :EXTERNAL-FORMAT argument :UTF-8
clisp-2.49-unix-x86
(LOAD http-body FAIL) ASDF:LOAD-SYSTEM-DEFINITION-ERROR : Error while trying to load definition for system quri from pathname /home/testgrid/cl-test-grid/work-dir/agent/quicklisp/dists/quicklisp/software/quri-20141217-git/quri.asd: OPEN: Illegal :EXTERNAL-FORMAT argument :UTF-8
(LOAD http-body-test FAIL) ASDF:LOAD-SYSTEM-DEFINITION-ERROR : Error while trying to load definition for system quri from pathname /home/testgrid/cl-test-grid/work-dir/agent/quicklisp/dists/quicklisp/software/quri-20141217-git/quri.asd: OPEN: Illegal :EXTERNAL-FORMAT argument :UTF-8
ecl-13.5.1-76a84246-linux-x64-bytecode
(LOAD http-body FAIL) SI::SIMPLE-PACKAGE-ERROR : Cannot find symbol "VARIABLE-INFORMATION" in package #<"SI" package>
(LOAD http-body-test FAIL) SI::SIMPLE-PACKAGE-ERROR : Cannot find symbol "VARIABLE-INFORMATION" in package #<"SI" package>
ecl-13.5.1-76a84246-linux-x64-lisp-to-c
(LOAD http-body FAIL) UIOP/LISP-BUILD:COMPILE-FILE-ERROR : COMPILE-FILE-ERROR while compiling #<cl-source-file "xsubseq" "src" "xsubseq">
(LOAD http-body-test FAIL) UIOP/LISP-BUILD:COMPILE-FILE-ERROR : COMPILE-FILE-ERROR while compiling #<cl-source-file "xsubseq" "src" "xsubseq">
ecl-13.5.1-unknown-linux-i686-bytecode
(LOAD http-body FAIL) SI::SIMPLE-PACKAGE-ERROR : Cannot find symbol "VARIABLE-INFORMATION" in package #<"SI" package>
(LOAD http-body-test FAIL) SI::SIMPLE-PACKAGE-ERROR : Cannot find symbol "VARIABLE-INFORMATION" in package #<"SI" package>
ecl-13.5.1-unknown-linux-i686-lisp-to-c
(LOAD http-body FAIL) UIOP/LISP-BUILD:COMPILE-FILE-ERROR : COMPILE-FILE-ERROR while compiling #<cl-source-file "xsubseq" "src" "xsubseq">
(LOAD http-body-test FAIL) UIOP/LISP-BUILD:COMPILE-FILE-ERROR : COMPILE-FILE-ERROR while compiling #<cl-source-file "xsubseq" "src" "xsubseq">
hu.dwim.defclass-starecl-13.5.1-76a84246-linux-x64-bytecode
hu.dwim.delicoccl-1.9-r15756-f96-linux-x86
(LOAD hu.dwim.delico.test FAIL) ASDF/FIND-SYSTEM:MISSING-COMPONENT : Component "iolib/os" not found
sbcl-1.1.11-linux-x86
(LOAD hu.dwim.delico.test FAIL) ASDF/FIND-SYSTEM:MISSING-COMPONENT : Component "iolib/os" not found
sbcl-1.1.16-linux-x86
(LOAD hu.dwim.delico.test FAIL) ASDF/FIND-SYSTEM:MISSING-COMPONENT : Component "iolib/os" not found
hu.dwim.perecsbcl-1.1.11-linux-x86
(LOAD hu.dwim.perec+iolib FAIL) ASDF/FIND-SYSTEM:MISSING-COMPONENT : Component "iolib/sockets" not found
sbcl-1.1.16-linux-x86
(LOAD hu.dwim.perec+iolib FAIL) ASDF/FIND-SYSTEM:MISSING-COMPONENT : Component "iolib/sockets" not found
hu.dwim.quasi-quoteccl-1.9-r15756-f96-linux-x86
(LOAD hu.dwim.quasi-quote.js FAIL) ASDF/FIND-SYSTEM:MISSING-COMPONENT : Component "iolib/os" not found
(LOAD hu.dwim.quasi-quote.test FAIL) ASDF/FIND-SYSTEM:MISSING-COMPONENT : Component "iolib/os" not found
(LOAD hu.dwim.quasi-quote.xml+hu.dwim.quasi-quote.js FAIL) ASDF/FIND-SYSTEM:MISSING-COMPONENT : Component "iolib/os" not found
sbcl-1.1.11-linux-x86
(LOAD hu.dwim.quasi-quote.js FAIL) ASDF/FIND-SYSTEM:MISSING-COMPONENT : Component "iolib/os" not found
(LOAD hu.dwim.quasi-quote.test FAIL) ASDF/FIND-SYSTEM:MISSING-COMPONENT : Component "iolib/os" not found
(LOAD hu.dwim.quasi-quote.xml+hu.dwim.quasi-quote.js FAIL) ASDF/FIND-SYSTEM:MISSING-COMPONENT : Component "iolib/os" not found
sbcl-1.1.16-linux-x86
(LOAD hu.dwim.quasi-quote.js FAIL) ASDF/FIND-SYSTEM:MISSING-COMPONENT : Component "iolib/os" not found
(LOAD hu.dwim.quasi-quote.test FAIL) ASDF/FIND-SYSTEM:MISSING-COMPONENT : Component "iolib/os" not found
(LOAD hu.dwim.quasi-quote.xml+hu.dwim.quasi-quote.js FAIL) ASDF/FIND-SYSTEM:MISSING-COMPONENT : Component "iolib/os" not found
hu.dwim.uriabcl-1.2.1-fasl42-linux-x86
(LOAD hu.dwim.uri FAIL) ASDF/FIND-SYSTEM:MISSING-COMPONENT : Component "iolib/sockets" not found
(LOAD hu.dwim.uri.test FAIL) ASDF/FIND-SYSTEM:MISSING-COMPONENT : Component "iolib/sockets" not found
ccl-1.9-r15756-f96-linux-x86
(LOAD hu.dwim.uri FAIL) ASDF/FIND-SYSTEM:MISSING-COMPONENT : Component "iolib/sockets" not found
(LOAD hu.dwim.uri.test FAIL) ASDF/FIND-SYSTEM:MISSING-COMPONENT : Component "iolib/sockets" not found
sbcl-1.1.11-linux-x86
(LOAD hu.dwim.uri FAIL) ASDF/FIND-SYSTEM:MISSING-COMPONENT : Component "iolib/sockets" not found
(LOAD hu.dwim.uri.test FAIL) ASDF/FIND-SYSTEM:MISSING-COMPONENT : Component "iolib/sockets" not found
sbcl-1.1.16-linux-x86
(LOAD hu.dwim.uri FAIL) ASDF/FIND-SYSTEM:MISSING-COMPONENT : Component "iolib/sockets" not found
(LOAD hu.dwim.uri.test FAIL) ASDF/FIND-SYSTEM:MISSING-COMPONENT : Component "iolib/sockets" not found
hu.dwim.utilabcl-1.2.1-fasl42-linux-x86
(LOAD hu.dwim.util+iolib FAIL) ASDF/FIND-SYSTEM:MISSING-COMPONENT : Component "iolib/os" not found
(LOAD hu.dwim.util.temporary-files FAIL) ASDF/FIND-SYSTEM:MISSING-COMPONENT : Component "iolib/os" not found
ccl-1.9-r15756-f96-linux-x86
(LOAD hu.dwim.util+iolib FAIL) ASDF/FIND-SYSTEM:MISSING-COMPONENT : Component "iolib/os" not found
(LOAD hu.dwim.util.temporary-files FAIL) ASDF/FIND-SYSTEM:MISSING-COMPONENT : Component "iolib/os" not found
sbcl-1.1.11-linux-x86
(LOAD hu.dwim.util+iolib FAIL) ASDF/FIND-SYSTEM:MISSING-COMPONENT : Component "iolib/os" not found
(LOAD hu.dwim.util.temporary-files FAIL) ASDF/FIND-SYSTEM:MISSING-COMPONENT : Component "iolib/os" not found
sbcl-1.1.16-linux-x86
(LOAD hu.dwim.util+iolib FAIL) ASDF/FIND-SYSTEM:MISSING-COMPONENT : Component "iolib/os" not found
(LOAD hu.dwim.util.temporary-files FAIL) ASDF/FIND-SYSTEM:MISSING-COMPONENT : Component "iolib/os" not found
hu.dwim.walkerabcl-1.2.1-fasl42-linux-x86
(LOAD hu.dwim.walker.test FAIL) ASDF/FIND-SYSTEM:MISSING-COMPONENT : Component "iolib/os" not found
ccl-1.9-r15756-f96-linux-x86
(LOAD hu.dwim.walker.test FAIL) ASDF/FIND-SYSTEM:MISSING-COMPONENT : Component "iolib/os" not found
sbcl-1.1.11-linux-x86
(LOAD hu.dwim.walker.test FAIL) ASDF/FIND-SYSTEM:MISSING-COMPONENT : Component "iolib/os" not found
sbcl-1.1.16-linux-x86
(LOAD hu.dwim.walker.test FAIL) ASDF/FIND-SYSTEM:MISSING-COMPONENT : Component "iolib/os" not found
intercomecl-13.5.1-unknown-linux-i686-bytecode
iolibabcl-1.2.1-fasl42-linux-x86
(LOAD iolib-grovel FAIL) ASDF/FIND-SYSTEM:MISSING-COMPONENT : Component "iolib/grovel" not found
(LOAD iolib.base FAIL) ASDF/FIND-SYSTEM:MISSING-COMPONENT : Component "iolib/base" not found
(LOAD iolib.common-lisp FAIL) ASDF/FIND-SYSTEM:MISSING-COMPONENT : Component "iolib/common-lisp" not found
(LOAD iolib.conf FAIL) ASDF/FIND-SYSTEM:MISSING-COMPONENT : Component "iolib/conf" not found
(LOAD iolib.multiplex FAIL) ASDF/FIND-SYSTEM:MISSING-COMPONENT : Component "iolib/multiplex" not found
(LOAD iolib.os FAIL) ASDF/FIND-SYSTEM:MISSING-COMPONENT : Component "iolib/os" not found
(LOAD iolib.pathnames FAIL) ASDF/FIND-SYSTEM:MISSING-COMPONENT : Component "iolib/pathnames" not found
(LOAD iolib.sockets FAIL) ASDF/FIND-SYSTEM:MISSING-COMPONENT : Component "iolib/sockets" not found
(LOAD iolib.streams FAIL) ASDF/FIND-SYSTEM:MISSING-COMPONENT : Component "iolib/streams" not found
(LOAD iolib.syscalls FAIL) ASDF/FIND-SYSTEM:MISSING-COMPONENT : Component "iolib/syscalls" not found
(LOAD iolib.trivial-sockets FAIL) ASDF/FIND-SYSTEM:MISSING-COMPONENT : Component "iolib/trivial-sockets" not found
ccl-1.9-r15756-f96-linux-x86
(LOAD iolib-grovel FAIL) ASDF/FIND-SYSTEM:MISSING-COMPONENT : Component "iolib/grovel" not found
(LOAD iolib.base FAIL) ASDF/FIND-SYSTEM:MISSING-COMPONENT : Component "iolib/base" not found
(LOAD iolib.common-lisp FAIL) ASDF/FIND-SYSTEM:MISSING-COMPONENT : Component "iolib/common-lisp" not found
(LOAD iolib.conf FAIL) ASDF/FIND-SYSTEM:MISSING-COMPONENT : Component "iolib/conf" not found
(LOAD iolib.multiplex FAIL) ASDF/FIND-SYSTEM:MISSING-COMPONENT : Component "iolib/multiplex" not found
(LOAD iolib.os FAIL) ASDF/FIND-SYSTEM:MISSING-COMPONENT : Component "iolib/os" not found
(LOAD iolib.pathnames FAIL) ASDF/FIND-SYSTEM:MISSING-COMPONENT : Component "iolib/pathnames" not found
(LOAD iolib.sockets FAIL) ASDF/FIND-SYSTEM:MISSING-COMPONENT : Component "iolib/sockets" not found
(LOAD iolib.streams FAIL) ASDF/FIND-SYSTEM:MISSING-COMPONENT : Component "iolib/streams" not found
(LOAD iolib.syscalls FAIL) ASDF/FIND-SYSTEM:MISSING-COMPONENT : Component "iolib/syscalls" not found
(LOAD iolib.trivial-sockets FAIL) ASDF/FIND-SYSTEM:MISSING-COMPONENT : Component "iolib/trivial-sockets" not found
cmu-snapshot-2013-04__20d_unicode_-linux-x86
(LOAD iolib-grovel FAIL) ASDF/FIND-SYSTEM:MISSING-COMPONENT : Component "iolib/grovel" not found
(LOAD iolib.base FAIL) ASDF/FIND-SYSTEM:MISSING-COMPONENT : Component "iolib/base" not found
(LOAD iolib.common-lisp FAIL) ASDF/FIND-SYSTEM:MISSING-COMPONENT : Component "iolib/common-lisp" not found
(LOAD iolib.conf FAIL) ASDF/FIND-SYSTEM:MISSING-COMPONENT : Component "iolib/conf" not found
(LOAD iolib.multiplex FAIL) ASDF/FIND-SYSTEM:MISSING-COMPONENT : Component "iolib/multiplex" not found
(LOAD iolib.os FAIL) ASDF/FIND-SYSTEM:MISSING-COMPONENT : Component "iolib/os" not found
(LOAD iolib.pathnames FAIL) ASDF/FIND-SYSTEM:MISSING-COMPONENT : Component "iolib/pathnames" not found
(LOAD iolib.sockets FAIL) ASDF/FIND-SYSTEM:MISSING-COMPONENT : Component "iolib/sockets" not found
(LOAD iolib.streams FAIL) ASDF/FIND-SYSTEM:MISSING-COMPONENT : Component "iolib/streams" not found
(LOAD iolib.syscalls FAIL) ASDF/FIND-SYSTEM:MISSING-COMPONENT : Component "iolib/syscalls" not found
(LOAD iolib.trivial-sockets FAIL) ASDF/FIND-SYSTEM:MISSING-COMPONENT : Component "iolib/trivial-sockets" not found
ecl-13.5.1-unknown-linux-i686-lisp-to-c
(LOAD iolib-grovel FAIL) ASDF/FIND-SYSTEM:MISSING-COMPONENT : Component "iolib/grovel" not found
(LOAD iolib.base FAIL) ASDF/FIND-SYSTEM:MISSING-COMPONENT : Component "iolib/base" not found
(LOAD iolib.common-lisp FAIL) ASDF/FIND-SYSTEM:MISSING-COMPONENT : Component "iolib/common-lisp" not found
(LOAD iolib.conf FAIL) ASDF/FIND-SYSTEM:MISSING-COMPONENT : Component "iolib/conf" not found
sbcl-1.1.11-linux-x86
(LOAD iolib-grovel FAIL) ASDF/FIND-SYSTEM:MISSING-COMPONENT : Component "iolib/grovel" not found
(LOAD iolib.base FAIL) ASDF/FIND-SYSTEM:MISSING-COMPONENT : Component "iolib/base" not found
(LOAD iolib.common-lisp FAIL) ASDF/FIND-SYSTEM:MISSING-COMPONENT : Component "iolib/common-lisp" not found
(LOAD iolib.conf FAIL) ASDF/FIND-SYSTEM:MISSING-COMPONENT : Component "iolib/conf" not found
(LOAD iolib.multiplex FAIL) ASDF/FIND-SYSTEM:MISSING-COMPONENT : Component "iolib/multiplex" not found
(LOAD iolib.os FAIL) ASDF/FIND-SYSTEM:MISSING-COMPONENT : Component "iolib/os" not found
(LOAD iolib.pathnames FAIL) ASDF/FIND-SYSTEM:MISSING-COMPONENT : Component "iolib/pathnames" not found
(LOAD iolib.sockets FAIL) ASDF/FIND-SYSTEM:MISSING-COMPONENT : Component "iolib/sockets" not found
(LOAD iolib.streams FAIL) ASDF/FIND-SYSTEM:MISSING-COMPONENT : Component "iolib/streams" not found
(LOAD iolib.syscalls FAIL) ASDF/FIND-SYSTEM:MISSING-COMPONENT : Component "iolib/syscalls" not found
(LOAD iolib.trivial-sockets FAIL) ASDF/FIND-SYSTEM:MISSING-COMPONENT : Component "iolib/trivial-sockets" not found
sbcl-1.1.16-linux-x86
(LOAD iolib-grovel FAIL) ASDF/FIND-SYSTEM:MISSING-COMPONENT : Component "iolib/grovel" not found
(LOAD iolib.base FAIL) ASDF/FIND-SYSTEM:MISSING-COMPONENT : Component "iolib/base" not found
(LOAD iolib.common-lisp FAIL) ASDF/FIND-SYSTEM:MISSING-COMPONENT : Component "iolib/common-lisp" not found
(LOAD iolib.conf FAIL) ASDF/FIND-SYSTEM:MISSING-COMPONENT : Component "iolib/conf" not found
(LOAD iolib.multiplex FAIL) ASDF/FIND-SYSTEM:MISSING-COMPONENT : Component "iolib/multiplex" not found
(LOAD iolib.os FAIL) ASDF/FIND-SYSTEM:MISSING-COMPONENT : Component "iolib/os" not found
(LOAD iolib.pathnames FAIL) ASDF/FIND-SYSTEM:MISSING-COMPONENT : Component "iolib/pathnames" not found
(LOAD iolib.sockets FAIL) ASDF/FIND-SYSTEM:MISSING-COMPONENT : Component "iolib/sockets" not found
(LOAD iolib.streams FAIL) ASDF/FIND-SYSTEM:MISSING-COMPONENT : Component "iolib/streams" not found
(LOAD iolib.syscalls FAIL) ASDF/FIND-SYSTEM:MISSING-COMPONENT : Component "iolib/syscalls" not found
(LOAD iolib.trivial-sockets FAIL) ASDF/FIND-SYSTEM:MISSING-COMPONENT : Component "iolib/trivial-sockets" not found
modularizecmu-snapshot-2013-04__20d_unicode_-linux-x86
(LOAD modularize-test-module FAIL) COMMON-LISP:SIMPLE-ERROR : Error in function C::DUMP-STRUCTURE: Attempt to dump invalid structure: #<The MODULARIZE-TEST-MODULE package, 0/8 internal, 1/2 external> How did this happen?
cmu-snapshot-2014-01__20e_unicode_-linux-x86
(LOAD modularize-test-module FAIL) COMMON-LISP:SIMPLE-ERROR : Error in function C::DUMP-STRUCTURE: Attempt to dump invalid structure: #<The MODULARIZE-TEST-MODULE package, 0/8 internal, 1/2 external> How did this happen?
cmu-snapshot-2014-05-dirty__20e_unicode_-linux-x86
(LOAD modularize-test-module FAIL) COMMON-LISP:SIMPLE-ERROR : Error in function C::DUMP-STRUCTURE: Attempt to dump invalid structure: #<The MODULARIZE-TEST-MODULE package, 0/8 internal, 1/2 external> How did this happen?
cmu-snapshot-2014-12___20f_unicode_-linux-x86
(LOAD modularize-test-module FAIL) COMMON-LISP:SIMPLE-ERROR : Error in function C::DUMP-STRUCTURE: Attempt to dump invalid structure: #<The MODULARIZE-TEST-MODULE package, 0/8 internal, 1/2 external> How did this happen?
modularize-interfacescmu-snapshot-2013-04__20d_unicode_-linux-x86
(LOAD interfaces-test-implementation FAIL) COMMON-LISP:SIMPLE-ERROR : Error in function C::DUMP-STRUCTURE: Attempt to dump invalid structure: #<The INTERFACES-TEST-INTERFACE package, 0/7 internal, 3/3 external> How did this happen?
cmu-snapshot-2014-01__20e_unicode_-linux-x86
(LOAD interfaces-test-implementation FAIL) COMMON-LISP:SIMPLE-ERROR : Error in function C::DUMP-STRUCTURE: Attempt to dump invalid structure: #<The INTERFACES-TEST-INTERFACE package, 0/7 internal, 3/3 external> How did this happen?
cmu-snapshot-2014-05-dirty__20e_unicode_-linux-x86
(LOAD interfaces-test-implementation FAIL) COMMON-LISP:SIMPLE-ERROR : Error in function C::DUMP-STRUCTURE: Attempt to dump invalid structure: #<The INTERFACES-TEST-INTERFACE package, 0/7 internal, 3/3 external> How did this happen?
cmu-snapshot-2014-12___20f_unicode_-linux-x86
(LOAD interfaces-test-implementation FAIL) COMMON-LISP:SIMPLE-ERROR : Error in function C::DUMP-STRUCTURE: Attempt to dump invalid structure: #<The INTERFACES-TEST-INTERFACE package, 0/7 internal, 3/3 external> How did this happen?
mywayabcl-1.2.1-fasl42-linux-x86
(LOAD myway FAIL) COMMON-LISP:PACKAGE-ERROR : The symbol VARIABLE-INFORMATION is not present in package LISP.
(LOAD myway-test FAIL) COMMON-LISP:PACKAGE-ERROR : The symbol VARIABLE-INFORMATION is not present in package LISP.
abcl-1.3.0-fasl42-linux-x86
(LOAD myway FAIL) COMMON-LISP:PACKAGE-ERROR : The symbol VARIABLE-INFORMATION is not present in package LISP.
(LOAD myway-test FAIL) COMMON-LISP:PACKAGE-ERROR : The symbol VARIABLE-INFORMATION is not present in package LISP.
abcl-1.3.1-fasl42-linux-x86
(LOAD myway FAIL) COMMON-LISP:PACKAGE-ERROR : The symbol VARIABLE-INFORMATION is not present in package LISP.
(LOAD myway-test FAIL) COMMON-LISP:PACKAGE-ERROR : The symbol VARIABLE-INFORMATION is not present in package LISP.
clisp-2.49-unix-x64
(LOAD myway FAIL) ASDF:LOAD-SYSTEM-DEFINITION-ERROR : Error while trying to load definition for system quri from pathname /home/hijarian/systems/cl-test-grid/work-dir/agent/quicklisp/dists/quicklisp/software/quri-20141217-git/quri.asd: OPEN: Illegal :EXTERNAL-FORMAT argument :UTF-8
(LOAD myway-test FAIL) ASDF:LOAD-SYSTEM-DEFINITION-ERROR : Error while trying to load definition for system quri from pathname /home/hijarian/systems/cl-test-grid/work-dir/agent/quicklisp/dists/quicklisp/software/quri-20141217-git/quri.asd: OPEN: Illegal :EXTERNAL-FORMAT argument :UTF-8
clisp-2.49-unix-x86
(LOAD myway FAIL) ASDF:LOAD-SYSTEM-DEFINITION-ERROR : Error while trying to load definition for system quri from pathname /home/testgrid/cl-test-grid/work-dir/agent/quicklisp/dists/quicklisp/software/quri-20141217-git/quri.asd: OPEN: Illegal :EXTERNAL-FORMAT argument :UTF-8
(LOAD myway-test FAIL) ASDF:LOAD-SYSTEM-DEFINITION-ERROR : Error while trying to load definition for system quri from pathname /home/testgrid/cl-test-grid/work-dir/agent/quicklisp/dists/quicklisp/software/quri-20141217-git/quri.asd: OPEN: Illegal :EXTERNAL-FORMAT argument :UTF-8
ecl-13.5.1-76a84246-linux-x64-bytecode
(LOAD myway FAIL) SI::SIMPLE-PACKAGE-ERROR : Cannot find symbol "VARIABLE-INFORMATION" in package #<"SI" package>
(LOAD myway-test FAIL) SI::SIMPLE-PACKAGE-ERROR : Cannot find symbol "VARIABLE-INFORMATION" in package #<"SI" package>
ecl-13.5.1-76a84246-linux-x64-lisp-to-c
(LOAD myway FAIL) UIOP/LISP-BUILD:COMPILE-FILE-ERROR : COMPILE-FILE-ERROR while compiling #<cl-source-file "quri" "src" "parser">
(LOAD myway-test FAIL) UIOP/LISP-BUILD:COMPILE-FILE-ERROR : COMPILE-FILE-ERROR while compiling #<cl-source-file "quri" "src" "parser">
ecl-13.5.1-unknown-linux-i686-bytecode
(LOAD myway FAIL) SI::SIMPLE-PACKAGE-ERROR : Cannot find symbol "VARIABLE-INFORMATION" in package #<"SI" package>
(LOAD myway-test FAIL) SI::SIMPLE-PACKAGE-ERROR : Cannot find symbol "VARIABLE-INFORMATION" in package #<"SI" package>
ecl-13.5.1-unknown-linux-i686-lisp-to-c
(LOAD myway FAIL) UIOP/LISP-BUILD:COMPILE-FILE-ERROR : COMPILE-FILE-ERROR while compiling #<cl-source-file "quri" "src" "parser">
(LOAD myway-test FAIL) UIOP/LISP-BUILD:COMPILE-FILE-ERROR : COMPILE-FILE-ERROR while compiling #<cl-source-file "quri" "src" "parser">
ningleecl-13.5.1-76a84246-linux-x64-bytecode
(LOAD ningle FAIL) SI::SIMPLE-PACKAGE-ERROR : Cannot find symbol "VARIABLE-INFORMATION" in package #<"SI" package>
(LOAD ningle-test FAIL) SI::SIMPLE-PACKAGE-ERROR : Cannot find symbol "VARIABLE-INFORMATION" in package #<"SI" package>
ecl-13.5.1-76a84246-linux-x64-lisp-to-c
(LOAD ningle FAIL) UIOP/LISP-BUILD:COMPILE-FILE-ERROR : COMPILE-FILE-ERROR while compiling #<cl-source-file "quri" "src" "parser">
(LOAD ningle-test FAIL) UIOP/LISP-BUILD:COMPILE-FILE-ERROR : COMPILE-FILE-ERROR while compiling #<cl-source-file "quri" "src" "parser">
ecl-13.5.1-unknown-linux-i686-bytecode
(LOAD ningle FAIL) SI::SIMPLE-PACKAGE-ERROR : Cannot find symbol "VARIABLE-INFORMATION" in package #<"SI" package>
(LOAD ningle-test FAIL) SI::SIMPLE-PACKAGE-ERROR : Cannot find symbol "VARIABLE-INFORMATION" in package #<"SI" package>
qlotecl-13.5.1-76a84246-linux-x64-bytecode
(LOAD qlot-install FAIL) SI::SIMPLE-PACKAGE-ERROR : Cannot find symbol "VARIABLE-INFORMATION" in package #<"SI" package>
(LOAD qlot-test FAIL) SI::SIMPLE-PACKAGE-ERROR : Cannot find symbol "VARIABLE-INFORMATION" in package #<"SI" package>
ecl-13.5.1-76a84246-linux-x64-lisp-to-c
(LOAD qlot-install FAIL) UIOP/LISP-BUILD:COMPILE-FILE-ERROR : COMPILE-FILE-ERROR while compiling #<cl-source-file "xsubseq" "src" "xsubseq">
(LOAD qlot-test FAIL) UIOP/LISP-BUILD:COMPILE-FILE-ERROR : COMPILE-FILE-ERROR while compiling #<cl-source-file "xsubseq" "src" "xsubseq">
ecl-13.5.1-unknown-linux-i686-bytecode
(LOAD qlot-install FAIL) SI::SIMPLE-PACKAGE-ERROR : Cannot find symbol "VARIABLE-INFORMATION" in package #<"SI" package>
(LOAD qlot-test FAIL) SI::SIMPLE-PACKAGE-ERROR : Cannot find symbol "VARIABLE-INFORMATION" in package #<"SI" package>
quickutilecl-13.5.1-76a84246-linux-x64-bytecode
(LOAD quickutil-server FAIL) SI::SIMPLE-PACKAGE-ERROR : Cannot find symbol "VARIABLE-INFORMATION" in package #<"SI" package>
(LOAD quickutil-utilities-test FAIL) SI::SIMPLE-PACKAGE-ERROR : Cannot find symbol "VARIABLE-INFORMATION" in package #<"SI" package>
ecl-13.5.1-unknown-linux-i686-bytecode
(LOAD quickutil-server FAIL) SI::SIMPLE-PACKAGE-ERROR : Cannot find symbol "VARIABLE-INFORMATION" in package #<"SI" package>
(LOAD quickutil-utilities-test FAIL) SI::SIMPLE-PACKAGE-ERROR : Cannot find symbol "VARIABLE-INFORMATION" in package #<"SI" package>
quriabcl-1.2.1-fasl42-linux-x86
(LOAD quri FAIL) COMMON-LISP:PACKAGE-ERROR : The symbol VARIABLE-INFORMATION is not present in package LISP.
(LOAD quri-test FAIL) COMMON-LISP:PACKAGE-ERROR : The symbol VARIABLE-INFORMATION is not present in package LISP.
abcl-1.3.0-fasl42-linux-x86
(LOAD quri FAIL) COMMON-LISP:PACKAGE-ERROR : The symbol VARIABLE-INFORMATION is not present in package LISP.
(LOAD quri-test FAIL) COMMON-LISP:PACKAGE-ERROR : The symbol VARIABLE-INFORMATION is not present in package LISP.
abcl-1.3.1-fasl42-linux-x86
(LOAD quri FAIL) COMMON-LISP:PACKAGE-ERROR : The symbol VARIABLE-INFORMATION is not present in package LISP.
(LOAD quri-test FAIL) COMMON-LISP:PACKAGE-ERROR : The symbol VARIABLE-INFORMATION is not present in package LISP.
clisp-2.49-unix-x64
(LOAD quri FAIL) ASDF:LOAD-SYSTEM-DEFINITION-ERROR : Error while trying to load definition for system quri from pathname /home/hijarian/systems/cl-test-grid/work-dir/agent/quicklisp/dists/quicklisp/software/quri-20141217-git/quri.asd: OPEN: Illegal :EXTERNAL-FORMAT argument :UTF-8
(LOAD quri-test FAIL) ASDF:LOAD-SYSTEM-DEFINITION-ERROR : Error while trying to load definition for system quri from pathname /home/hijarian/systems/cl-test-grid/work-dir/agent/quicklisp/dists/quicklisp/software/quri-20141217-git/quri.asd: OPEN: Illegal :EXTERNAL-FORMAT argument :UTF-8
clisp-2.49-unix-x86
(LOAD quri FAIL) ASDF:LOAD-SYSTEM-DEFINITION-ERROR : Error while trying to load definition for system quri from pathname /home/testgrid/cl-test-grid/work-dir/agent/quicklisp/dists/quicklisp/software/quri-20141217-git/quri.asd: OPEN: Illegal :EXTERNAL-FORMAT argument :UTF-8
(LOAD quri-test FAIL) ASDF:LOAD-SYSTEM-DEFINITION-ERROR : Error while trying to load definition for system quri from pathname /home/testgrid/cl-test-grid/work-dir/agent/quicklisp/dists/quicklisp/software/quri-20141217-git/quri.asd: OPEN: Illegal :EXTERNAL-FORMAT argument :UTF-8
ecl-13.5.1-76a84246-linux-x64-bytecode
(LOAD quri FAIL) SI::SIMPLE-PACKAGE-ERROR : Cannot find symbol "VARIABLE-INFORMATION" in package #<"SI" package>
(LOAD quri-test FAIL) SI::SIMPLE-PACKAGE-ERROR : Cannot find symbol "VARIABLE-INFORMATION" in package #<"SI" package>
ecl-13.5.1-76a84246-linux-x64-lisp-to-c
(LOAD quri FAIL) UIOP/LISP-BUILD:COMPILE-FILE-ERROR : COMPILE-FILE-ERROR while compiling #<cl-source-file "quri" "src" "parser">
(LOAD quri-test FAIL) UIOP/LISP-BUILD:COMPILE-FILE-ERROR : COMPILE-FILE-ERROR while compiling #<cl-source-file "quri" "src" "parser">
ecl-13.5.1-unknown-linux-i686-bytecode
(LOAD quri FAIL) SI::SIMPLE-PACKAGE-ERROR : Cannot find symbol "VARIABLE-INFORMATION" in package #<"SI" package>
(LOAD quri-test FAIL) SI::SIMPLE-PACKAGE-ERROR : Cannot find symbol "VARIABLE-INFORMATION" in package #<"SI" package>
ecl-13.5.1-unknown-linux-i686-lisp-to-c
(LOAD quri FAIL) UIOP/LISP-BUILD:COMPILE-FILE-ERROR : COMPILE-FILE-ERROR while compiling #<cl-source-file "quri" "src" "parser">
(LOAD quri-test FAIL) UIOP/LISP-BUILD:COMPILE-FILE-ERROR : COMPILE-FILE-ERROR while compiling #<cl-source-file "quri" "src" "parser">
racersbcl-1.2.3-linux-x64
rockecl-13.5.1-76a84246-linux-x64-bytecode
scalplecl-13.5.1-76a84246-linux-x64-bytecode
(LOAD scalpl FAIL) COMMON-LISP:SIMPLE-ERROR : Cannot add the method #<standard-method UNNAMED (#<The BUILT-IN-CLASS T>)> to the generic function #<standard-generic-function VWAP> because their lambda lists (TRACKER &KEY TYPE DEPTH &ALLOW-OTHER-KEYS) and (TRACKER &KEY) are not congruent.
ecl-13.5.1-76a84246-linux-x64-lisp-to-c
(LOAD scalpl FAIL) COMMON-LISP:SIMPLE-ERROR : Cannot add the method #<standard-method UNNAMED (#<The BUILT-IN-CLASS T>)> to the generic function #<standard-generic-function VWAP> because their lambda lists (TRACKER &KEY TYPE DEPTH &ALLOW-OTHER-KEYS) and (TRACKER &KEY) are not congruent.
ecl-13.5.1-unknown-linux-i686-bytecode
(LOAD scalpl FAIL) COMMON-LISP:SIMPLE-ERROR : Cannot add the method #<standard-method UNNAMED (#<The BUILT-IN-CLASS T>)> to the generic function #<standard-generic-function VWAP> because their lambda lists (TRACKER &KEY TYPE DEPTH &ALLOW-OTHER-KEYS) and (TRACKER &KEY) are not congruent.
weblockssbcl-1.1.16-linux-x86
(LOAD weblocks-demo-popover FAIL) UIOP/LISP-BUILD:COMPILE-FILE-ERROR : COMPILE-FILE-ERROR while compiling #<CL-SOURCE-FILE "weblocks-stores" "src" "package">
xsubseqabcl-1.2.1-fasl42-linux-x86
(LOAD xsubseq FAIL) COMMON-LISP:PACKAGE-ERROR : The symbol VARIABLE-INFORMATION is not present in package LISP.
(LOAD xsubseq-test FAIL) COMMON-LISP:PACKAGE-ERROR : The symbol VARIABLE-INFORMATION is not present in package LISP.
abcl-1.3.0-fasl42-linux-x86
(LOAD xsubseq FAIL) COMMON-LISP:PACKAGE-ERROR : The symbol VARIABLE-INFORMATION is not present in package LISP.
(LOAD xsubseq-test FAIL) COMMON-LISP:PACKAGE-ERROR : The symbol VARIABLE-INFORMATION is not present in package LISP.
abcl-1.3.1-fasl42-linux-x86
(LOAD xsubseq FAIL) COMMON-LISP:PACKAGE-ERROR : The symbol VARIABLE-INFORMATION is not present in package LISP.
(LOAD xsubseq-test FAIL) COMMON-LISP:PACKAGE-ERROR : The symbol VARIABLE-INFORMATION is not present in package LISP.
clisp-2.49-unix-x64
(LOAD xsubseq FAIL) SYSTEM::SIMPLE-PACKAGE-ERROR : SYSTEM::%FIND-PACKAGE: Нет пакетов с именем "VARIABLE-INFORMATION".
(LOAD xsubseq-test FAIL) SYSTEM::SIMPLE-PACKAGE-ERROR : SYSTEM::%FIND-PACKAGE: Нет пакетов с именем "VARIABLE-INFORMATION".
clisp-2.49-unix-x86
(LOAD xsubseq FAIL) SYSTEM::SIMPLE-PACKAGE-ERROR : SYSTEM::%FIND-PACKAGE: There is no package with name "VARIABLE-INFORMATION"
(LOAD xsubseq-test FAIL) SYSTEM::SIMPLE-PACKAGE-ERROR : SYSTEM::%FIND-PACKAGE: There is no package with name "VARIABLE-INFORMATION"
ecl-13.5.1-76a84246-linux-x64-bytecode
(LOAD xsubseq FAIL) SI::SIMPLE-PACKAGE-ERROR : Cannot find symbol "VARIABLE-INFORMATION" in package #<"SI" package>
(LOAD xsubseq-test FAIL) SI::SIMPLE-PACKAGE-ERROR : Cannot find symbol "VARIABLE-INFORMATION" in package #<"SI" package>
ecl-13.5.1-76a84246-linux-x64-lisp-to-c
(LOAD xsubseq FAIL) UIOP/LISP-BUILD:COMPILE-FILE-ERROR : COMPILE-FILE-ERROR while compiling #<cl-source-file "xsubseq" "src" "xsubseq">
(LOAD xsubseq-test FAIL) UIOP/LISP-BUILD:COMPILE-FILE-ERROR : COMPILE-FILE-ERROR while compiling #<cl-source-file "xsubseq" "src" "xsubseq">
ecl-13.5.1-unknown-linux-i686-bytecode
(LOAD xsubseq FAIL) SI::SIMPLE-PACKAGE-ERROR : Cannot find symbol "VARIABLE-INFORMATION" in package #<"SI" package>
(LOAD xsubseq-test FAIL) SI::SIMPLE-PACKAGE-ERROR : Cannot find symbol "VARIABLE-INFORMATION" in package #<"SI" package>
ecl-13.5.1-unknown-linux-i686-lisp-to-c
(LOAD xsubseq FAIL) UIOP/LISP-BUILD:COMPILE-FILE-ERROR : COMPILE-FILE-ERROR while compiling #<cl-source-file "xsubseq" "src" "xsubseq">
(LOAD xsubseq-test FAIL) UIOP/LISP-BUILD:COMPILE-FILE-ERROR : COMPILE-FILE-ERROR while compiling #<cl-source-file "xsubseq" "src" "xsubseq">
zawsclisp-2.49-unix-x64

To reports overview

Generated at: 2015-02-22 08:50:45 GMT.