scriptl results collected by cl-test-grid

Results on the last two Quicklisp distributions

 quicklisp 2016-03-18quicklisp 2016-02-08
abcl-1.2.1-fasl42-linux-x86
(LOAD scriptl-util FAIL) ASDF/FIND-SYSTEM:LOAD-SYSTEM-DEFINITION-ERROR : Error while trying to load definition for system scriptl-util from pathname /home/testgrid/cl-test-grid/work-dir/agent/quicklisp/dists/quicklisp/software/scriptl-20151031-git/scriptl-util.asd: Error while trying to load definition for system bordeaux-threads from pathname /home/testgrid/cl-test-grid/work-dir/agent/quicklisp/dists/quicklisp/software/bordeaux-threads-v0.8.5/bordeaux-threads.asd: You need ASDF >= 3.1 to load this system correctly.
(LOAD scriptl-examples FAIL) ASDF/FIND-SYSTEM:LOAD-SYSTEM-DEFINITION-ERROR : Error while trying to load definition for system scriptl-examples from pathname /home/testgrid/cl-test-grid/work-dir/agent/quicklisp/dists/quicklisp/software/scriptl-20151031-git/scriptl-examples.asd: Error while trying to load definition for system bordeaux-threads from pathname /home/testgrid/cl-test-grid/work-dir/agent/quicklisp/dists/quicklisp/software/bordeaux-threads-v0.8.5/bordeaux-threads.asd: You need ASDF >= 3.1 to load this system correctly.
(LOAD scriptl FAIL) ASDF/FIND-SYSTEM:LOAD-SYSTEM-DEFINITION-ERROR : Error while trying to load definition for system bordeaux-threads from pathname /home/testgrid/cl-test-grid/work-dir/agent/quicklisp/dists/quicklisp/software/bordeaux-threads-v0.8.5/bordeaux-threads.asd: You need ASDF >= 3.1 to load this system correctly.
(LOAD scriptl-util FAIL) ASDF/FIND-SYSTEM:LOAD-SYSTEM-DEFINITION-ERROR : Error while trying to load definition for system scriptl-util from pathname /home/testgrid/cl-test-grid/work-dir/agent/quicklisp/dists/quicklisp/software/scriptl-20151031-git/scriptl-util.asd: Error while trying to load definition for system iolib from pathname /home/testgrid/cl-test-grid/work-dir/agent/quicklisp/dists/quicklisp/software/iolib-20160208-git/iolib.asd: You need ASDF >= 3.1 to load this system correctly.
(LOAD scriptl-examples FAIL) ASDF/FIND-SYSTEM:LOAD-SYSTEM-DEFINITION-ERROR : Error while trying to load definition for system scriptl-examples from pathname /home/testgrid/cl-test-grid/work-dir/agent/quicklisp/dists/quicklisp/software/scriptl-20151031-git/scriptl-examples.asd: Error while trying to load definition for system iolib from pathname /home/testgrid/cl-test-grid/work-dir/agent/quicklisp/dists/quicklisp/software/iolib-20160208-git/iolib.asd: You need ASDF >= 3.1 to load this system correctly.
(LOAD scriptl FAIL) ASDF/FIND-SYSTEM:LOAD-SYSTEM-DEFINITION-ERROR : Error while trying to load definition for system iolib from pathname /home/testgrid/cl-test-grid/work-dir/agent/quicklisp/dists/quicklisp/software/iolib-20160208-git/iolib.asd: You need ASDF >= 3.1 to load this system correctly.
abcl-1.3.0-fasl42-linux-x86
(LOAD scriptl-util FAIL) ASDF/FIND-SYSTEM:LOAD-SYSTEM-DEFINITION-ERROR : Error while trying to load definition for system scriptl-util from pathname /home/testgrid/cl-test-grid/work-dir/agent/quicklisp/dists/quicklisp/software/scriptl-20151031-git/scriptl-util.asd: Error while trying to load definition for system scriptl from pathname /home/testgrid/cl-test-grid/work-dir/agent/quicklisp/dists/quicklisp/software/scriptl-20151031-git/scriptl.asd: don't recognize component type :AUTOCONF-MODULE
(LOAD scriptl-examples FAIL) ASDF/FIND-SYSTEM:LOAD-SYSTEM-DEFINITION-ERROR : Error while trying to load definition for system scriptl-examples from pathname /home/testgrid/cl-test-grid/work-dir/agent/quicklisp/dists/quicklisp/software/scriptl-20151031-git/scriptl-examples.asd: Error while trying to load definition for system scriptl from pathname /home/testgrid/cl-test-grid/work-dir/agent/quicklisp/dists/quicklisp/software/scriptl-20151031-git/scriptl.asd: don't recognize component type :AUTOCONF-MODULE
(LOAD scriptl FAIL) ASDF/FIND-SYSTEM:LOAD-SYSTEM-DEFINITION-ERROR : Error while trying to load definition for system scriptl from pathname /home/testgrid/cl-test-grid/work-dir/agent/quicklisp/dists/quicklisp/software/scriptl-20151031-git/scriptl.asd: don't recognize component type :AUTOCONF-MODULE
(LOAD scriptl-util FAIL) ASDF/FIND-SYSTEM:LOAD-SYSTEM-DEFINITION-ERROR : Error while trying to load definition for system scriptl-util from pathname /home/testgrid/cl-test-grid/work-dir/agent/quicklisp/dists/quicklisp/software/scriptl-20151031-git/scriptl-util.asd: Error while trying to load definition for system scriptl from pathname /home/testgrid/cl-test-grid/work-dir/agent/quicklisp/dists/quicklisp/software/scriptl-20151031-git/scriptl.asd: don't recognize component type :AUTOCONF-MODULE
(LOAD scriptl-examples FAIL) ASDF/FIND-SYSTEM:LOAD-SYSTEM-DEFINITION-ERROR : Error while trying to load definition for system scriptl-examples from pathname /home/testgrid/cl-test-grid/work-dir/agent/quicklisp/dists/quicklisp/software/scriptl-20151031-git/scriptl-examples.asd: Error while trying to load definition for system scriptl from pathname /home/testgrid/cl-test-grid/work-dir/agent/quicklisp/dists/quicklisp/software/scriptl-20151031-git/scriptl.asd: don't recognize component type :AUTOCONF-MODULE
(LOAD scriptl FAIL) ASDF/FIND-SYSTEM:LOAD-SYSTEM-DEFINITION-ERROR : Error while trying to load definition for system scriptl from pathname /home/testgrid/cl-test-grid/work-dir/agent/quicklisp/dists/quicklisp/software/scriptl-20151031-git/scriptl.asd: don't recognize component type :AUTOCONF-MODULE
abcl-1.3.1-fasl42-linux-x86
(LOAD scriptl-util FAIL) ASDF/FIND-SYSTEM:LOAD-SYSTEM-DEFINITION-ERROR : Error while trying to load definition for system scriptl-util from pathname /home/testgrid/cl-test-grid/work-dir/agent/quicklisp/dists/quicklisp/software/scriptl-20151031-git/scriptl-util.asd: Error while trying to load definition for system osicat from pathname /home/testgrid/cl-test-grid/work-dir/agent/quicklisp/dists/quicklisp/software/osicat-20160318-git/osicat.asd: Component "asdf" does not match version 3.1.2, required by #<ASDF/SYSTEM:SYSTEM "cffi-toolchain">
(LOAD scriptl-examples FAIL) ASDF/FIND-SYSTEM:LOAD-SYSTEM-DEFINITION-ERROR : Error while trying to load definition for system scriptl-examples from pathname /home/testgrid/cl-test-grid/work-dir/agent/quicklisp/dists/quicklisp/software/scriptl-20151031-git/scriptl-examples.asd: Error while trying to load definition for system osicat from pathname /home/testgrid/cl-test-grid/work-dir/agent/quicklisp/dists/quicklisp/software/osicat-20160318-git/osicat.asd: Component "asdf" does not match version 3.1.2, required by #<ASDF/SYSTEM:SYSTEM "cffi-toolchain">
(LOAD scriptl FAIL) ASDF/FIND-SYSTEM:LOAD-SYSTEM-DEFINITION-ERROR : Error while trying to load definition for system osicat from pathname /home/testgrid/cl-test-grid/work-dir/agent/quicklisp/dists/quicklisp/software/osicat-20160318-git/osicat.asd: Component "asdf" does not match version 3.1.2, required by #<ASDF/SYSTEM:SYSTEM "cffi-toolchain">
abcl-1.3.2-fasl42-linux-x86
ccl-1.10-r16196-f101-linux-arm
ccl-1.10-r16196-f96-linux-x64
(LOAD scriptl-util FAIL) ASDF/FIND-SYSTEM:LOAD-SYSTEM-DEFINITION-ERROR : Error while trying to load definition for system scriptl-util from pathname /home/hijarian/systems/cl-test-grid/work-dir/agent/quicklisp/dists/quicklisp/software/scriptl-20151031-git/scriptl-util.asd: Invalid program: In the form ((OS-UNIX-P) NIL), (OS-UNIX-P) is not a symbol or lambda expression.
(LOAD scriptl-examples FAIL) ASDF/FIND-SYSTEM:LOAD-SYSTEM-DEFINITION-ERROR : Error while trying to load definition for system scriptl-examples from pathname /home/hijarian/systems/cl-test-grid/work-dir/agent/quicklisp/dists/quicklisp/software/scriptl-20151031-git/scriptl-examples.asd: Invalid program: In the form ((OS-UNIX-P) NIL), (OS-UNIX-P) is not a symbol or lambda expression.
(LOAD scriptl FAIL) CCL::SIMPLE-PROGRAM-ERROR : Invalid program: In the form ((OS-UNIX-P) NIL), (OS-UNIX-P) is not a symbol or lambda expression.
(LOAD scriptl-util FAIL) ASDF/FIND-SYSTEM:LOAD-SYSTEM-DEFINITION-ERROR : Error while trying to load definition for system scriptl-util from pathname /home/hijarian/systems/cl-test-grid/work-dir/agent/quicklisp/dists/quicklisp/software/scriptl-20151031-git/scriptl-util.asd: External process exited with code 1. Command was: "g++" "-m64" "-Wno-write-strings" "-I/home/hijarian/systems/cl-test-grid/work-dir/agent/quicklisp/dists/quicklisp/software/iolib-20160208-git/src/grovel/" "-o" "/home/hijarian/systems/cl-test-grid/work-dir/agent/test-runs/20160309055500-ccl-1.10-r16196-f96-linux-x64/fasl/ql/dists/quicklisp/software/iolib-20160208-git/src/syscalls/ffi-types-unix" "/home/hijarian/systems/cl-test-grid/work-dir/agent/test-runs/20160309055500-ccl-1.10-r16196-f96-linux-x64/fasl/ql/dists/quicklisp/software/iolib-20160208-git/src/syscalls/ffi-types-unix.c" Output was: Error output was: /home/hijarian/systems/cl-test-grid/work-dir/agent/test-runs/20160309055500-ccl-1.10-r16196-f96-linux-x64/fasl/ql/dists/quicklisp/software/iolib-20160208-git/src/syscalls/ffi-types-unix.c:14:17: fatal error: lfp.h: Нет такого файла или каталога compilation terminated.
(LOAD scriptl-examples FAIL) ASDF/FIND-SYSTEM:LOAD-SYSTEM-DEFINITION-ERROR : Error while trying to load definition for system scriptl-examples from pathname /home/hijarian/systems/cl-test-grid/work-dir/agent/quicklisp/dists/quicklisp/software/scriptl-20151031-git/scriptl-examples.asd: External process exited with code 1. Command was: "g++" "-m64" "-Wno-write-strings" "-I/home/hijarian/systems/cl-test-grid/work-dir/agent/quicklisp/dists/quicklisp/software/iolib-20160208-git/src/grovel/" "-o" "/home/hijarian/systems/cl-test-grid/work-dir/agent/test-runs/20160309055500-ccl-1.10-r16196-f96-linux-x64/fasl/ql/dists/quicklisp/software/iolib-20160208-git/src/syscalls/ffi-types-unix" "/home/hijarian/systems/cl-test-grid/work-dir/agent/test-runs/20160309055500-ccl-1.10-r16196-f96-linux-x64/fasl/ql/dists/quicklisp/software/iolib-20160208-git/src/syscalls/ffi-types-unix.c" Output was: Error output was: /home/hijarian/systems/cl-test-grid/work-dir/agent/test-runs/20160309055500-ccl-1.10-r16196-f96-linux-x64/fasl/ql/dists/quicklisp/software/iolib-20160208-git/src/syscalls/ffi-types-unix.c:14:17: fatal error: lfp.h: Нет такого файла или каталога compilation terminated.
(LOAD scriptl FAIL) IOLIB/GROVEL::GROVEL-ERROR : External process exited with code 1. Command was: "g++" "-m64" "-Wno-write-strings" "-I/home/hijarian/systems/cl-test-grid/work-dir/agent/quicklisp/dists/quicklisp/software/iolib-20160208-git/src/grovel/" "-o" "/home/hijarian/systems/cl-test-grid/work-dir/agent/test-runs/20160309055500-ccl-1.10-r16196-f96-linux-x64/fasl/ql/dists/quicklisp/software/iolib-20160208-git/src/syscalls/ffi-types-unix" "/home/hijarian/systems/cl-test-grid/work-dir/agent/test-runs/20160309055500-ccl-1.10-r16196-f96-linux-x64/fasl/ql/dists/quicklisp/software/iolib-20160208-git/src/syscalls/ffi-types-unix.c" Output was: Error output was: /home/hijarian/systems/cl-test-grid/work-dir/agent/test-runs/20160309055500-ccl-1.10-r16196-f96-linux-x64/fasl/ql/dists/quicklisp/software/iolib-20160208-git/src/syscalls/ffi-types-unix.c:14:17: fatal error: lfp.h: Нет такого файла или каталога compilation terminated.
(LOAD scriptl-util FAIL) ASDF/FIND-SYSTEM:LOAD-SYSTEM-DEFINITION-ERROR : Error while trying to load definition for system scriptl-util from pathname /home/hijarian/systems/cl-test-grid/work-dir/agent/quicklisp/dists/quicklisp/software/scriptl-20151031-git/scriptl-util.asd: External process exited with code 1. Command was: "g++" "-m64" "-Wno-write-strings" "-I/home/hijarian/systems/cl-test-grid/work-dir/agent/quicklisp/dists/quicklisp/software/iolib-20160208-git/src/grovel/" "-o" "/home/hijarian/systems/cl-test-grid/work-dir/agent/test-runs/20160306095236-ccl-1.10-r16196-f96-linux-x64/fasl/ql/dists/quicklisp/software/iolib-20160208-git/src/syscalls/ffi-types-unix" "/home/hijarian/systems/cl-test-grid/work-dir/agent/test-runs/20160306095236-ccl-1.10-r16196-f96-linux-x64/fasl/ql/dists/quicklisp/software/iolib-20160208-git/src/syscalls/ffi-types-unix.c" Output was: Error output was: /home/hijarian/systems/cl-test-grid/work-dir/agent/test-runs/20160306095236-ccl-1.10-r16196-f96-linux-x64/fasl/ql/dists/quicklisp/software/iolib-20160208-git/src/syscalls/ffi-types-unix.c:14:17: fatal error: lfp.h: Нет такого файла или каталога compilation terminated.
(LOAD scriptl-examples FAIL) ASDF/FIND-SYSTEM:LOAD-SYSTEM-DEFINITION-ERROR : Error while trying to load definition for system scriptl-examples from pathname /home/hijarian/systems/cl-test-grid/work-dir/agent/quicklisp/dists/quicklisp/software/scriptl-20151031-git/scriptl-examples.asd: External process exited with code 1. Command was: "g++" "-m64" "-Wno-write-strings" "-I/home/hijarian/systems/cl-test-grid/work-dir/agent/quicklisp/dists/quicklisp/software/iolib-20160208-git/src/grovel/" "-o" "/home/hijarian/systems/cl-test-grid/work-dir/agent/test-runs/20160306095236-ccl-1.10-r16196-f96-linux-x64/fasl/ql/dists/quicklisp/software/iolib-20160208-git/src/syscalls/ffi-types-unix" "/home/hijarian/systems/cl-test-grid/work-dir/agent/test-runs/20160306095236-ccl-1.10-r16196-f96-linux-x64/fasl/ql/dists/quicklisp/software/iolib-20160208-git/src/syscalls/ffi-types-unix.c" Output was: Error output was: /home/hijarian/systems/cl-test-grid/work-dir/agent/test-runs/20160306095236-ccl-1.10-r16196-f96-linux-x64/fasl/ql/dists/quicklisp/software/iolib-20160208-git/src/syscalls/ffi-types-unix.c:14:17: fatal error: lfp.h: Нет такого файла или каталога compilation terminated.
(LOAD scriptl FAIL) IOLIB/GROVEL::GROVEL-ERROR : External process exited with code 1. Command was: "g++" "-m64" "-Wno-write-strings" "-I/home/hijarian/systems/cl-test-grid/work-dir/agent/quicklisp/dists/quicklisp/software/iolib-20160208-git/src/grovel/" "-o" "/home/hijarian/systems/cl-test-grid/work-dir/agent/test-runs/20160306095236-ccl-1.10-r16196-f96-linux-x64/fasl/ql/dists/quicklisp/software/iolib-20160208-git/src/syscalls/ffi-types-unix" "/home/hijarian/systems/cl-test-grid/work-dir/agent/test-runs/20160306095236-ccl-1.10-r16196-f96-linux-x64/fasl/ql/dists/quicklisp/software/iolib-20160208-git/src/syscalls/ffi-types-unix.c" Output was: Error output was: /home/hijarian/systems/cl-test-grid/work-dir/agent/test-runs/20160306095236-ccl-1.10-r16196-f96-linux-x64/fasl/ql/dists/quicklisp/software/iolib-20160208-git/src/syscalls/ffi-types-unix.c:14:17: fatal error: lfp.h: Нет такого файла или каталога compilation terminated.
(LOAD scriptl-util FAIL) ASDF/FIND-SYSTEM:LOAD-SYSTEM-DEFINITION-ERROR : Error while trying to load definition for system scriptl-util from pathname /home/hijarian/systems/cl-test-grid/work-dir/agent/quicklisp/dists/quicklisp/software/scriptl-20151031-git/scriptl-util.asd: External process exited with code 1. Command was: "g++" "-m64" "-Wno-write-strings" "-I/home/hijarian/systems/cl-test-grid/work-dir/agent/quicklisp/dists/quicklisp/software/iolib-20160208-git/src/grovel/" "-o" "/home/hijarian/systems/cl-test-grid/work-dir/agent/test-runs/20160214121759-ccl-1.10-r16196-f96-linux-x64/fasl/ql/dists/quicklisp/software/iolib-20160208-git/src/syscalls/ffi-types-unix" "/home/hijarian/systems/cl-test-grid/work-dir/agent/test-runs/20160214121759-ccl-1.10-r16196-f96-linux-x64/fasl/ql/dists/quicklisp/software/iolib-20160208-git/src/syscalls/ffi-types-unix.c" Output was: Error output was: /home/hijarian/systems/cl-test-grid/work-dir/agent/test-runs/20160214121759-ccl-1.10-r16196-f96-linux-x64/fasl/ql/dists/quicklisp/software/iolib-20160208-git/src/syscalls/ffi-types-unix.c:14:17: fatal error: lfp.h: Нет такого файла или каталога #include <lfp.h> ^ compilation terminated.
(LOAD scriptl-examples FAIL) ASDF/FIND-SYSTEM:LOAD-SYSTEM-DEFINITION-ERROR : Error while trying to load definition for system scriptl-examples from pathname /home/hijarian/systems/cl-test-grid/work-dir/agent/quicklisp/dists/quicklisp/software/scriptl-20151031-git/scriptl-examples.asd: External process exited with code 1. Command was: "g++" "-m64" "-Wno-write-strings" "-I/home/hijarian/systems/cl-test-grid/work-dir/agent/quicklisp/dists/quicklisp/software/iolib-20160208-git/src/grovel/" "-o" "/home/hijarian/systems/cl-test-grid/work-dir/agent/test-runs/20160214121759-ccl-1.10-r16196-f96-linux-x64/fasl/ql/dists/quicklisp/software/iolib-20160208-git/src/syscalls/ffi-types-unix" "/home/hijarian/systems/cl-test-grid/work-dir/agent/test-runs/20160214121759-ccl-1.10-r16196-f96-linux-x64/fasl/ql/dists/quicklisp/software/iolib-20160208-git/src/syscalls/ffi-types-unix.c" Output was: Error output was: /home/hijarian/systems/cl-test-grid/work-dir/agent/test-runs/20160214121759-ccl-1.10-r16196-f96-linux-x64/fasl/ql/dists/quicklisp/software/iolib-20160208-git/src/syscalls/ffi-types-unix.c:14:17: fatal error: lfp.h: Нет такого файла или каталога #include <lfp.h> ^ compilation terminated.
(LOAD scriptl FAIL) IOLIB/GROVEL::GROVEL-ERROR : External process exited with code 1. Command was: "g++" "-m64" "-Wno-write-strings" "-I/home/hijarian/systems/cl-test-grid/work-dir/agent/quicklisp/dists/quicklisp/software/iolib-20160208-git/src/grovel/" "-o" "/home/hijarian/systems/cl-test-grid/work-dir/agent/test-runs/20160214121759-ccl-1.10-r16196-f96-linux-x64/fasl/ql/dists/quicklisp/software/iolib-20160208-git/src/syscalls/ffi-types-unix" "/home/hijarian/systems/cl-test-grid/work-dir/agent/test-runs/20160214121759-ccl-1.10-r16196-f96-linux-x64/fasl/ql/dists/quicklisp/software/iolib-20160208-git/src/syscalls/ffi-types-unix.c" Output was: Error output was: /home/hijarian/systems/cl-test-grid/work-dir/agent/test-runs/20160214121759-ccl-1.10-r16196-f96-linux-x64/fasl/ql/dists/quicklisp/software/iolib-20160208-git/src/syscalls/ffi-types-unix.c:14:17: fatal error: lfp.h: Нет такого файла или каталога #include <lfp.h> ^ compilation terminated.
ccl-1.10-r16196-f96-linux-x86
ccl-1.11-r16635-f96-linux-x86
ccl-1.11-r16635-f96-macosx-x64
(LOAD scriptl-util FAIL) ASDF/FIND-SYSTEM:LOAD-SYSTEM-DEFINITION-ERROR : Error while trying to load definition for system scriptl-util from pathname /Users/testgrid/cl-test-grid/work-dir/agent/quicklisp/dists/quicklisp/software/scriptl-20151031-git/scriptl-util.asd: External process exited with code 1. Command was: "g++" "-m64" "-Wno-write-strings" "-I" "/opt/local/include/" "-I/Users/testgrid/cl-test-grid/work-dir/agent/quicklisp/dists/quicklisp/software/iolib-20160208-git/src/grovel/" "-o" "/Users/testgrid/cl-test-grid/work-dir/agent/test-runs/20160220010916-ccl-1.11-r16635-f96-macosx-x64/fasl/ql/dists/quicklisp/software/iolib-20160208-git/src/syscalls/ffi-types-unix" "/Users/testgrid/cl-test-grid/work-dir/agent/test-runs/20160220010916-ccl-1.11-r16635-f96-macosx-x64/fasl/ql/dists/quicklisp/software/iolib-20160208-git/src/syscalls/ffi-types-unix.c" Output was: Error output was: clang: warning: treating 'c' input as 'c++' when in C++ mode, this behavior is deprecated /Users/testgrid/cl-test-grid/work-dir/agent/test-runs/20160220010916-ccl-1.11-r16635-f96-macosx-x64/fasl/ql/dists/quicklisp/software/iolib-20160208-git/src/syscalls/ffi-types-unix.c:6:10: fatal error: 'lfp.h' file not found #include <lfp.h> ^ 1 error generated.
(LOAD scriptl-examples FAIL) ASDF/FIND-SYSTEM:LOAD-SYSTEM-DEFINITION-ERROR : Error while trying to load definition for system scriptl-examples from pathname /Users/testgrid/cl-test-grid/work-dir/agent/quicklisp/dists/quicklisp/software/scriptl-20151031-git/scriptl-examples.asd: External process exited with code 1. Command was: "g++" "-m64" "-Wno-write-strings" "-I" "/opt/local/include/" "-I/Users/testgrid/cl-test-grid/work-dir/agent/quicklisp/dists/quicklisp/software/iolib-20160208-git/src/grovel/" "-o" "/Users/testgrid/cl-test-grid/work-dir/agent/test-runs/20160220010916-ccl-1.11-r16635-f96-macosx-x64/fasl/ql/dists/quicklisp/software/iolib-20160208-git/src/syscalls/ffi-types-unix" "/Users/testgrid/cl-test-grid/work-dir/agent/test-runs/20160220010916-ccl-1.11-r16635-f96-macosx-x64/fasl/ql/dists/quicklisp/software/iolib-20160208-git/src/syscalls/ffi-types-unix.c" Output was: Error output was: clang: warning: treating 'c' input as 'c++' when in C++ mode, this behavior is deprecated /Users/testgrid/cl-test-grid/work-dir/agent/test-runs/20160220010916-ccl-1.11-r16635-f96-macosx-x64/fasl/ql/dists/quicklisp/software/iolib-20160208-git/src/syscalls/ffi-types-unix.c:6:10: fatal error: 'lfp.h' file not found #include <lfp.h> ^ 1 error generated.
(LOAD scriptl FAIL) IOLIB/GROVEL::GROVEL-ERROR : External process exited with code 1. Command was: "g++" "-m64" "-Wno-write-strings" "-I" "/opt/local/include/" "-I/Users/testgrid/cl-test-grid/work-dir/agent/quicklisp/dists/quicklisp/software/iolib-20160208-git/src/grovel/" "-o" "/Users/testgrid/cl-test-grid/work-dir/agent/test-runs/20160220010916-ccl-1.11-r16635-f96-macosx-x64/fasl/ql/dists/quicklisp/software/iolib-20160208-git/src/syscalls/ffi-types-unix" "/Users/testgrid/cl-test-grid/work-dir/agent/test-runs/20160220010916-ccl-1.11-r16635-f96-macosx-x64/fasl/ql/dists/quicklisp/software/iolib-20160208-git/src/syscalls/ffi-types-unix.c" Output was: Error output was: clang: warning: treating 'c' input as 'c++' when in C++ mode, this behavior is deprecated /Users/testgrid/cl-test-grid/work-dir/agent/test-runs/20160220010916-ccl-1.11-r16635-f96-macosx-x64/fasl/ql/dists/quicklisp/software/iolib-20160208-git/src/syscalls/ffi-types-unix.c:6:10: fatal error: 'lfp.h' file not found #include <lfp.h> ^ 1 error generated.
ccl-1.11-r16635-f96-macosx-x86
(LOAD scriptl-util FAIL) ASDF/FIND-SYSTEM:LOAD-SYSTEM-DEFINITION-ERROR : Error while trying to load definition for system scriptl-util from pathname /Users/testgrid/cl-test-grid/work-dir/agent/quicklisp/dists/quicklisp/software/scriptl-20151031-git/scriptl-util.asd: External process exited with code 1. Command was: "g++" "-m32" "-Wno-write-strings" "-I" "/opt/local/include/" "-I/Users/testgrid/cl-test-grid/work-dir/agent/quicklisp/dists/quicklisp/software/iolib-20160208-git/src/grovel/" "-o" "/Users/testgrid/cl-test-grid/work-dir/agent/test-runs/20160219210452-ccl-1.11-r16635-f96-macosx-x86/fasl/ql/dists/quicklisp/software/iolib-20160208-git/src/syscalls/ffi-types-unix" "/Users/testgrid/cl-test-grid/work-dir/agent/test-runs/20160219210452-ccl-1.11-r16635-f96-macosx-x86/fasl/ql/dists/quicklisp/software/iolib-20160208-git/src/syscalls/ffi-types-unix.c" Output was: Error output was: clang: warning: treating 'c' input as 'c++' when in C++ mode, this behavior is deprecated /Users/testgrid/cl-test-grid/work-dir/agent/test-runs/20160219210452-ccl-1.11-r16635-f96-macosx-x86/fasl/ql/dists/quicklisp/software/iolib-20160208-git/src/syscalls/ffi-types-unix.c:6:10: fatal error: 'lfp.h' file not found #include <lfp.h> ^ 1 error generated.
(LOAD scriptl-examples FAIL) ASDF/FIND-SYSTEM:LOAD-SYSTEM-DEFINITION-ERROR : Error while trying to load definition for system scriptl-examples from pathname /Users/testgrid/cl-test-grid/work-dir/agent/quicklisp/dists/quicklisp/software/scriptl-20151031-git/scriptl-examples.asd: External process exited with code 1. Command was: "g++" "-m32" "-Wno-write-strings" "-I" "/opt/local/include/" "-I/Users/testgrid/cl-test-grid/work-dir/agent/quicklisp/dists/quicklisp/software/iolib-20160208-git/src/grovel/" "-o" "/Users/testgrid/cl-test-grid/work-dir/agent/test-runs/20160219210452-ccl-1.11-r16635-f96-macosx-x86/fasl/ql/dists/quicklisp/software/iolib-20160208-git/src/syscalls/ffi-types-unix" "/Users/testgrid/cl-test-grid/work-dir/agent/test-runs/20160219210452-ccl-1.11-r16635-f96-macosx-x86/fasl/ql/dists/quicklisp/software/iolib-20160208-git/src/syscalls/ffi-types-unix.c" Output was: Error output was: clang: warning: treating 'c' input as 'c++' when in C++ mode, this behavior is deprecated /Users/testgrid/cl-test-grid/work-dir/agent/test-runs/20160219210452-ccl-1.11-r16635-f96-macosx-x86/fasl/ql/dists/quicklisp/software/iolib-20160208-git/src/syscalls/ffi-types-unix.c:6:10: fatal error: 'lfp.h' file not found #include <lfp.h> ^ 1 error generated.
(LOAD scriptl FAIL) IOLIB/GROVEL::GROVEL-ERROR : External process exited with code 1. Command was: "g++" "-m32" "-Wno-write-strings" "-I" "/opt/local/include/" "-I/Users/testgrid/cl-test-grid/work-dir/agent/quicklisp/dists/quicklisp/software/iolib-20160208-git/src/grovel/" "-o" "/Users/testgrid/cl-test-grid/work-dir/agent/test-runs/20160219210452-ccl-1.11-r16635-f96-macosx-x86/fasl/ql/dists/quicklisp/software/iolib-20160208-git/src/syscalls/ffi-types-unix" "/Users/testgrid/cl-test-grid/work-dir/agent/test-runs/20160219210452-ccl-1.11-r16635-f96-macosx-x86/fasl/ql/dists/quicklisp/software/iolib-20160208-git/src/syscalls/ffi-types-unix.c" Output was: Error output was: clang: warning: treating 'c' input as 'c++' when in C++ mode, this behavior is deprecated /Users/testgrid/cl-test-grid/work-dir/agent/test-runs/20160219210452-ccl-1.11-r16635-f96-macosx-x86/fasl/ql/dists/quicklisp/software/iolib-20160208-git/src/syscalls/ffi-types-unix.c:6:10: fatal error: 'lfp.h' file not found #include <lfp.h> ^ 1 error generated.
ccl-1.11-r16702m-f101-linux-arm
(LOAD scriptl-util FAIL) ASDF/FIND-SYSTEM:LOAD-SYSTEM-DEFINITION-ERROR : Error while trying to load definition for system scriptl-util from pathname /home/testgrid/cl-test-grid/work-dir/agent/quicklisp/dists/quicklisp/software/scriptl-20151031-git/scriptl-util.asd: External process exited with code 1. Command was: "g++" "-marm" "-Wno-write-strings" "-I/home/testgrid/cl-test-grid/work-dir/agent/quicklisp/dists/quicklisp/software/iolib-20160208-git/src/grovel/" "-o" "/home/testgrid/cl-test-grid/work-dir/agent/test-runs/20160218133323-ccl-1.11-r16702m-f101-linux-arm/fasl/ql/dists/quicklisp/software/iolib-20160208-git/src/syscalls/ffi-types-unix" "/home/testgrid/cl-test-grid/work-dir/agent/test-runs/20160218133323-ccl-1.11-r16702m-f101-linux-arm/fasl/ql/dists/quicklisp/software/iolib-20160208-git/src/syscalls/ffi-types-unix.c" Output was: Error output was: /home/testgrid/cl-test-grid/work-dir/agent/test-runs/20160218133323-ccl-1.11-r16702m-f101-linux-arm/fasl/ql/dists/quicklisp/software/iolib-20160208-git/src/syscalls/ffi-types-unix.c:14:17: fatal error: lfp.h: No such file or directory compilation terminated.
(LOAD scriptl-examples FAIL) ASDF/FIND-SYSTEM:LOAD-SYSTEM-DEFINITION-ERROR : Error while trying to load definition for system scriptl-examples from pathname /home/testgrid/cl-test-grid/work-dir/agent/quicklisp/dists/quicklisp/software/scriptl-20151031-git/scriptl-examples.asd: External process exited with code 1. Command was: "g++" "-marm" "-Wno-write-strings" "-I/home/testgrid/cl-test-grid/work-dir/agent/quicklisp/dists/quicklisp/software/iolib-20160208-git/src/grovel/" "-o" "/home/testgrid/cl-test-grid/work-dir/agent/test-runs/20160218133323-ccl-1.11-r16702m-f101-linux-arm/fasl/ql/dists/quicklisp/software/iolib-20160208-git/src/syscalls/ffi-types-unix" "/home/testgrid/cl-test-grid/work-dir/agent/test-runs/20160218133323-ccl-1.11-r16702m-f101-linux-arm/fasl/ql/dists/quicklisp/software/iolib-20160208-git/src/syscalls/ffi-types-unix.c" Output was: Error output was: /home/testgrid/cl-test-grid/work-dir/agent/test-runs/20160218133323-ccl-1.11-r16702m-f101-linux-arm/fasl/ql/dists/quicklisp/software/iolib-20160208-git/src/syscalls/ffi-types-unix.c:14:17: fatal error: lfp.h: No such file or directory compilation terminated.
(LOAD scriptl FAIL) IOLIB/GROVEL::GROVEL-ERROR : External process exited with code 1. Command was: "g++" "-marm" "-Wno-write-strings" "-I/home/testgrid/cl-test-grid/work-dir/agent/quicklisp/dists/quicklisp/software/iolib-20160208-git/src/grovel/" "-o" "/home/testgrid/cl-test-grid/work-dir/agent/test-runs/20160218133323-ccl-1.11-r16702m-f101-linux-arm/fasl/ql/dists/quicklisp/software/iolib-20160208-git/src/syscalls/ffi-types-unix" "/home/testgrid/cl-test-grid/work-dir/agent/test-runs/20160218133323-ccl-1.11-r16702m-f101-linux-arm/fasl/ql/dists/quicklisp/software/iolib-20160208-git/src/syscalls/ffi-types-unix.c" Output was: Error output was: /home/testgrid/cl-test-grid/work-dir/agent/test-runs/20160218133323-ccl-1.11-r16702m-f101-linux-arm/fasl/ql/dists/quicklisp/software/iolib-20160208-git/src/syscalls/ffi-types-unix.c:14:17: fatal error: lfp.h: No such file or directory compilation terminated.
ccl-1.11-rc1-r16536-f101-linux-arm
ccl-1.11-rc1-r16536-f96-linux-x86
ccl-1.8-r15286m-f95-linux-x86
(LOAD scriptl-util FAIL) ASDF:LOAD-SYSTEM-DEFINITION-ERROR : Error while trying to load definition for system scriptl-util from pathname /home/testgrid/cl-test-grid/work-dir/agent/quicklisp/dists/quicklisp/software/scriptl-20151031-git/scriptl-util.asd: Error while trying to load definition for system osicat from pathname /home/testgrid/cl-test-grid/work-dir/agent/quicklisp/dists/quicklisp/software/osicat-20160318-git/osicat.asd: Error while trying to load definition for system cffi-toolchain from pathname /home/testgrid/cl-test-grid/work-dir/agent/quicklisp/dists/quicklisp/software/cffi_0.17.1/cffi-toolchain.asd: CFFI-toolchain requires ASDF 3.1!
(LOAD scriptl-examples FAIL) ASDF:LOAD-SYSTEM-DEFINITION-ERROR : Error while trying to load definition for system scriptl-examples from pathname /home/testgrid/cl-test-grid/work-dir/agent/quicklisp/dists/quicklisp/software/scriptl-20151031-git/scriptl-examples.asd: Error while trying to load definition for system osicat from pathname /home/testgrid/cl-test-grid/work-dir/agent/quicklisp/dists/quicklisp/software/osicat-20160318-git/osicat.asd: Error while trying to load definition for system cffi-toolchain from pathname /home/testgrid/cl-test-grid/work-dir/agent/quicklisp/dists/quicklisp/software/cffi_0.17.1/cffi-toolchain.asd: CFFI-toolchain requires ASDF 3.1!
(LOAD scriptl FAIL) ASDF:LOAD-SYSTEM-DEFINITION-ERROR : Error while trying to load definition for system osicat from pathname /home/testgrid/cl-test-grid/work-dir/agent/quicklisp/dists/quicklisp/software/osicat-20160318-git/osicat.asd: Error while trying to load definition for system cffi-toolchain from pathname /home/testgrid/cl-test-grid/work-dir/agent/quicklisp/dists/quicklisp/software/cffi_0.17.1/cffi-toolchain.asd: CFFI-toolchain requires ASDF 3.1!
(LOAD scriptl-util FAIL) ASDF:LOAD-SYSTEM-DEFINITION-ERROR : Error while trying to load definition for system scriptl-util from pathname /home/testgrid/cl-test-grid/work-dir/agent/quicklisp/dists/quicklisp/software/scriptl-20151031-git/scriptl-util.asd: Error while trying to load definition for system iolib from pathname /home/testgrid/cl-test-grid/work-dir/agent/quicklisp/dists/quicklisp/software/iolib-20160208-git/iolib.asd: You need ASDF >= 3.1 to load this system correctly.
(LOAD scriptl-examples FAIL) ASDF:LOAD-SYSTEM-DEFINITION-ERROR : Error while trying to load definition for system scriptl-examples from pathname /home/testgrid/cl-test-grid/work-dir/agent/quicklisp/dists/quicklisp/software/scriptl-20151031-git/scriptl-examples.asd: Error while trying to load definition for system iolib from pathname /home/testgrid/cl-test-grid/work-dir/agent/quicklisp/dists/quicklisp/software/iolib-20160208-git/iolib.asd: You need ASDF >= 3.1 to load this system correctly.
(LOAD scriptl FAIL) ASDF:LOAD-SYSTEM-DEFINITION-ERROR : Error while trying to load definition for system iolib from pathname /home/testgrid/cl-test-grid/work-dir/agent/quicklisp/dists/quicklisp/software/iolib-20160208-git/iolib.asd: You need ASDF >= 3.1 to load this system correctly.
ccl-1.8-r15286m-f97-linux-arm
(LOAD scriptl-util FAIL) ASDF:LOAD-SYSTEM-DEFINITION-ERROR : Error while trying to load definition for system scriptl-util from pathname /home/testgrid/cl-test-grid/work-dir/agent/quicklisp/dists/quicklisp/software/scriptl-20151031-git/scriptl-util.asd: Error while trying to load definition for system osicat from pathname /home/testgrid/cl-test-grid/work-dir/agent/quicklisp/dists/quicklisp/software/osicat-20160318-git/osicat.asd: Error while trying to load definition for system cffi-toolchain from pathname /home/testgrid/cl-test-grid/work-dir/agent/quicklisp/dists/quicklisp/software/cffi_0.17.1/cffi-toolchain.asd: CFFI-toolchain requires ASDF 3.1!
(LOAD scriptl-examples FAIL) ASDF:LOAD-SYSTEM-DEFINITION-ERROR : Error while trying to load definition for system scriptl-examples from pathname /home/testgrid/cl-test-grid/work-dir/agent/quicklisp/dists/quicklisp/software/scriptl-20151031-git/scriptl-examples.asd: Error while trying to load definition for system osicat from pathname /home/testgrid/cl-test-grid/work-dir/agent/quicklisp/dists/quicklisp/software/osicat-20160318-git/osicat.asd: Error while trying to load definition for system cffi-toolchain from pathname /home/testgrid/cl-test-grid/work-dir/agent/quicklisp/dists/quicklisp/software/cffi_0.17.1/cffi-toolchain.asd: CFFI-toolchain requires ASDF 3.1!
(LOAD scriptl FAIL) ASDF:LOAD-SYSTEM-DEFINITION-ERROR : Error while trying to load definition for system osicat from pathname /home/testgrid/cl-test-grid/work-dir/agent/quicklisp/dists/quicklisp/software/osicat-20160318-git/osicat.asd: Error while trying to load definition for system cffi-toolchain from pathname /home/testgrid/cl-test-grid/work-dir/agent/quicklisp/dists/quicklisp/software/cffi_0.17.1/cffi-toolchain.asd: CFFI-toolchain requires ASDF 3.1!
(LOAD scriptl-util FAIL) ASDF:LOAD-SYSTEM-DEFINITION-ERROR : Error while trying to load definition for system scriptl-util from pathname /home/testgrid/cl-test-grid/work-dir/agent/quicklisp/dists/quicklisp/software/scriptl-20151031-git/scriptl-util.asd: Error while trying to load definition for system iolib from pathname /home/testgrid/cl-test-grid/work-dir/agent/quicklisp/dists/quicklisp/software/iolib-20160208-git/iolib.asd: You need ASDF >= 3.1 to load this system correctly.
(LOAD scriptl-examples FAIL) ASDF:LOAD-SYSTEM-DEFINITION-ERROR : Error while trying to load definition for system scriptl-examples from pathname /home/testgrid/cl-test-grid/work-dir/agent/quicklisp/dists/quicklisp/software/scriptl-20151031-git/scriptl-examples.asd: Error while trying to load definition for system iolib from pathname /home/testgrid/cl-test-grid/work-dir/agent/quicklisp/dists/quicklisp/software/iolib-20160208-git/iolib.asd: You need ASDF >= 3.1 to load this system correctly.
(LOAD scriptl FAIL) ASDF:LOAD-SYSTEM-DEFINITION-ERROR : Error while trying to load definition for system iolib from pathname /home/testgrid/cl-test-grid/work-dir/agent/quicklisp/dists/quicklisp/software/iolib-20160208-git/iolib.asd: You need ASDF >= 3.1 to load this system correctly.
ccl-1.9-r15756-f96-linux-x86
(LOAD scriptl-util FAIL) ASDF/FIND-SYSTEM:LOAD-SYSTEM-DEFINITION-ERROR : Error while trying to load definition for system scriptl-util from pathname /home/testgrid/cl-test-grid/work-dir/agent/quicklisp/dists/quicklisp/software/scriptl-20151031-git/scriptl-util.asd: Error while trying to load definition for system bordeaux-threads from pathname /home/testgrid/cl-test-grid/work-dir/agent/quicklisp/dists/quicklisp/software/bordeaux-threads-v0.8.5/bordeaux-threads.asd: You need ASDF >= 3.1 to load this system correctly.
(LOAD scriptl-examples FAIL) ASDF/FIND-SYSTEM:LOAD-SYSTEM-DEFINITION-ERROR : Error while trying to load definition for system scriptl-examples from pathname /home/testgrid/cl-test-grid/work-dir/agent/quicklisp/dists/quicklisp/software/scriptl-20151031-git/scriptl-examples.asd: Error while trying to load definition for system bordeaux-threads from pathname /home/testgrid/cl-test-grid/work-dir/agent/quicklisp/dists/quicklisp/software/bordeaux-threads-v0.8.5/bordeaux-threads.asd: You need ASDF >= 3.1 to load this system correctly.
(LOAD scriptl FAIL) ASDF/FIND-SYSTEM:LOAD-SYSTEM-DEFINITION-ERROR : Error while trying to load definition for system bordeaux-threads from pathname /home/testgrid/cl-test-grid/work-dir/agent/quicklisp/dists/quicklisp/software/bordeaux-threads-v0.8.5/bordeaux-threads.asd: You need ASDF >= 3.1 to load this system correctly.
(LOAD scriptl-util FAIL) ASDF/FIND-SYSTEM:LOAD-SYSTEM-DEFINITION-ERROR : Error while trying to load definition for system scriptl-util from pathname /home/testgrid/cl-test-grid/work-dir/agent/quicklisp/dists/quicklisp/software/scriptl-20151031-git/scriptl-util.asd: Error while trying to load definition for system iolib from pathname /home/testgrid/cl-test-grid/work-dir/agent/quicklisp/dists/quicklisp/software/iolib-20160208-git/iolib.asd: You need ASDF >= 3.1 to load this system correctly.
(LOAD scriptl-examples FAIL) ASDF/FIND-SYSTEM:LOAD-SYSTEM-DEFINITION-ERROR : Error while trying to load definition for system scriptl-examples from pathname /home/testgrid/cl-test-grid/work-dir/agent/quicklisp/dists/quicklisp/software/scriptl-20151031-git/scriptl-examples.asd: Error while trying to load definition for system iolib from pathname /home/testgrid/cl-test-grid/work-dir/agent/quicklisp/dists/quicklisp/software/iolib-20160208-git/iolib.asd: You need ASDF >= 3.1 to load this system correctly.
(LOAD scriptl FAIL) ASDF/FIND-SYSTEM:LOAD-SYSTEM-DEFINITION-ERROR : Error while trying to load definition for system iolib from pathname /home/testgrid/cl-test-grid/work-dir/agent/quicklisp/dists/quicklisp/software/iolib-20160208-git/iolib.asd: You need ASDF >= 3.1 to load this system correctly.
ccl-1.9-r15767-f99-linux-arm
(LOAD scriptl-util FAIL) ASDF/FIND-SYSTEM:LOAD-SYSTEM-DEFINITION-ERROR : Error while trying to load definition for system scriptl-util from pathname /home/testgrid/cl-test-grid/work-dir/agent/quicklisp/dists/quicklisp/software/scriptl-20151031-git/scriptl-util.asd: Error while trying to load definition for system bordeaux-threads from pathname /home/testgrid/cl-test-grid/work-dir/agent/quicklisp/dists/quicklisp/software/bordeaux-threads-v0.8.5/bordeaux-threads.asd: You need ASDF >= 3.1 to load this system correctly.
(LOAD scriptl-examples FAIL) ASDF/FIND-SYSTEM:LOAD-SYSTEM-DEFINITION-ERROR : Error while trying to load definition for system scriptl-examples from pathname /home/testgrid/cl-test-grid/work-dir/agent/quicklisp/dists/quicklisp/software/scriptl-20151031-git/scriptl-examples.asd: Error while trying to load definition for system bordeaux-threads from pathname /home/testgrid/cl-test-grid/work-dir/agent/quicklisp/dists/quicklisp/software/bordeaux-threads-v0.8.5/bordeaux-threads.asd: You need ASDF >= 3.1 to load this system correctly.
(LOAD scriptl FAIL) ASDF/FIND-SYSTEM:LOAD-SYSTEM-DEFINITION-ERROR : Error while trying to load definition for system bordeaux-threads from pathname /home/testgrid/cl-test-grid/work-dir/agent/quicklisp/dists/quicklisp/software/bordeaux-threads-v0.8.5/bordeaux-threads.asd: You need ASDF >= 3.1 to load this system correctly.
(LOAD scriptl-util FAIL) ASDF/FIND-SYSTEM:LOAD-SYSTEM-DEFINITION-ERROR : Error while trying to load definition for system scriptl-util from pathname /home/testgrid/cl-test-grid/work-dir/agent/quicklisp/dists/quicklisp/software/scriptl-20151031-git/scriptl-util.asd: Error while trying to load definition for system iolib from pathname /home/testgrid/cl-test-grid/work-dir/agent/quicklisp/dists/quicklisp/software/iolib-20160208-git/iolib.asd: You need ASDF >= 3.1 to load this system correctly.
(LOAD scriptl-examples FAIL) ASDF/FIND-SYSTEM:LOAD-SYSTEM-DEFINITION-ERROR : Error while trying to load definition for system scriptl-examples from pathname /home/testgrid/cl-test-grid/work-dir/agent/quicklisp/dists/quicklisp/software/scriptl-20151031-git/scriptl-examples.asd: Error while trying to load definition for system iolib from pathname /home/testgrid/cl-test-grid/work-dir/agent/quicklisp/dists/quicklisp/software/iolib-20160208-git/iolib.asd: You need ASDF >= 3.1 to load this system correctly.
(LOAD scriptl FAIL) ASDF/FIND-SYSTEM:LOAD-SYSTEM-DEFINITION-ERROR : Error while trying to load definition for system iolib from pathname /home/testgrid/cl-test-grid/work-dir/agent/quicklisp/dists/quicklisp/software/iolib-20160208-git/iolib.asd: You need ASDF >= 3.1 to load this system correctly.
clisp-2.49-unix-armv7l
(LOAD scriptl-util FAIL) ASDF:LOAD-SYSTEM-DEFINITION-ERROR : Error while trying to load definition for system scriptl-util from pathname /home/testgrid/cl-test-grid/work-dir/agent/quicklisp/dists/quicklisp/software/scriptl-20151031-git/scriptl-util.asd: Error while trying to load definition for system osicat from pathname /home/testgrid/cl-test-grid/work-dir/agent/quicklisp/dists/quicklisp/software/osicat-20160318-git/osicat.asd: Error while trying to load definition for system cffi-toolchain from pathname /home/testgrid/cl-test-grid/work-dir/agent/quicklisp/dists/quicklisp/software/cffi_0.17.1/cffi-toolchain.asd: CFFI-toolchain requires ASDF 3.1!
(LOAD scriptl-examples FAIL) ASDF:LOAD-SYSTEM-DEFINITION-ERROR : Error while trying to load definition for system scriptl-examples from pathname /home/testgrid/cl-test-grid/work-dir/agent/quicklisp/dists/quicklisp/software/scriptl-20151031-git/scriptl-examples.asd: Error while trying to load definition for system osicat from pathname /home/testgrid/cl-test-grid/work-dir/agent/quicklisp/dists/quicklisp/software/osicat-20160318-git/osicat.asd: Error while trying to load definition for system cffi-toolchain from pathname /home/testgrid/cl-test-grid/work-dir/agent/quicklisp/dists/quicklisp/software/cffi_0.17.1/cffi-toolchain.asd: CFFI-toolchain requires ASDF 3.1!
(LOAD scriptl FAIL) ASDF:LOAD-SYSTEM-DEFINITION-ERROR : Error while trying to load definition for system osicat from pathname /home/testgrid/cl-test-grid/work-dir/agent/quicklisp/dists/quicklisp/software/osicat-20160318-git/osicat.asd: Error while trying to load definition for system cffi-toolchain from pathname /home/testgrid/cl-test-grid/work-dir/agent/quicklisp/dists/quicklisp/software/cffi_0.17.1/cffi-toolchain.asd: CFFI-toolchain requires ASDF 3.1!
(LOAD scriptl-util FAIL) ASDF:LOAD-SYSTEM-DEFINITION-ERROR : Error while trying to load definition for system scriptl-util from pathname /home/testgrid/cl-test-grid/work-dir/agent/quicklisp/dists/quicklisp/software/scriptl-20151031-git/scriptl-util.asd: Error while trying to load definition for system iolib from pathname /home/testgrid/cl-test-grid/work-dir/agent/quicklisp/dists/quicklisp/software/iolib-20160208-git/iolib.asd: You need ASDF >= 3.1 to load this system correctly.
(LOAD scriptl-examples FAIL) ASDF:LOAD-SYSTEM-DEFINITION-ERROR : Error while trying to load definition for system scriptl-examples from pathname /home/testgrid/cl-test-grid/work-dir/agent/quicklisp/dists/quicklisp/software/scriptl-20151031-git/scriptl-examples.asd: Error while trying to load definition for system iolib from pathname /home/testgrid/cl-test-grid/work-dir/agent/quicklisp/dists/quicklisp/software/iolib-20160208-git/iolib.asd: You need ASDF >= 3.1 to load this system correctly.
(LOAD scriptl FAIL) ASDF:LOAD-SYSTEM-DEFINITION-ERROR : Error while trying to load definition for system iolib from pathname /home/testgrid/cl-test-grid/work-dir/agent/quicklisp/dists/quicklisp/software/iolib-20160208-git/iolib.asd: You need ASDF >= 3.1 to load this system correctly.
clisp-2.49-unix-x86
(LOAD scriptl-util FAIL) ASDF:LOAD-SYSTEM-DEFINITION-ERROR : Error while trying to load definition for system scriptl-util from pathname /home/testgrid/cl-test-grid/work-dir/agent/quicklisp/dists/quicklisp/software/scriptl-20151031-git/scriptl-util.asd: Error while trying to load definition for system osicat from pathname /home/testgrid/cl-test-grid/work-dir/agent/quicklisp/dists/quicklisp/software/osicat-20160318-git/osicat.asd: Error while trying to load definition for system cffi-toolchain from pathname /home/testgrid/cl-test-grid/work-dir/agent/quicklisp/dists/quicklisp/software/cffi_0.17.1/cffi-toolchain.asd: CFFI-toolchain requires ASDF 3.1!
(LOAD scriptl-examples FAIL) ASDF:LOAD-SYSTEM-DEFINITION-ERROR : Error while trying to load definition for system scriptl-examples from pathname /home/testgrid/cl-test-grid/work-dir/agent/quicklisp/dists/quicklisp/software/scriptl-20151031-git/scriptl-examples.asd: Error while trying to load definition for system osicat from pathname /home/testgrid/cl-test-grid/work-dir/agent/quicklisp/dists/quicklisp/software/osicat-20160318-git/osicat.asd: Error while trying to load definition for system cffi-toolchain from pathname /home/testgrid/cl-test-grid/work-dir/agent/quicklisp/dists/quicklisp/software/cffi_0.17.1/cffi-toolchain.asd: CFFI-toolchain requires ASDF 3.1!
(LOAD scriptl FAIL) ASDF:LOAD-SYSTEM-DEFINITION-ERROR : Error while trying to load definition for system osicat from pathname /home/testgrid/cl-test-grid/work-dir/agent/quicklisp/dists/quicklisp/software/osicat-20160318-git/osicat.asd: Error while trying to load definition for system cffi-toolchain from pathname /home/testgrid/cl-test-grid/work-dir/agent/quicklisp/dists/quicklisp/software/cffi_0.17.1/cffi-toolchain.asd: CFFI-toolchain requires ASDF 3.1!
(LOAD scriptl-util FAIL) ASDF:LOAD-SYSTEM-DEFINITION-ERROR : Error while trying to load definition for system scriptl-util from pathname /home/testgrid/cl-test-grid/work-dir/agent/quicklisp/dists/quicklisp/software/scriptl-20151031-git/scriptl-util.asd: Error while trying to load definition for system iolib from pathname /home/testgrid/cl-test-grid/work-dir/agent/quicklisp/dists/quicklisp/software/iolib-20160208-git/iolib.asd: You need ASDF >= 3.1 to load this system correctly.
(LOAD scriptl-examples FAIL) ASDF:LOAD-SYSTEM-DEFINITION-ERROR : Error while trying to load definition for system scriptl-examples from pathname /home/testgrid/cl-test-grid/work-dir/agent/quicklisp/dists/quicklisp/software/scriptl-20151031-git/scriptl-examples.asd: Error while trying to load definition for system iolib from pathname /home/testgrid/cl-test-grid/work-dir/agent/quicklisp/dists/quicklisp/software/iolib-20160208-git/iolib.asd: You need ASDF >= 3.1 to load this system correctly.
(LOAD scriptl FAIL) ASDF:LOAD-SYSTEM-DEFINITION-ERROR : Error while trying to load definition for system iolib from pathname /home/testgrid/cl-test-grid/work-dir/agent/quicklisp/dists/quicklisp/software/iolib-20160208-git/iolib.asd: You need ASDF >= 3.1 to load this system correctly.
cmu-snapshot-2013-04__20d_unicode_-linux-x86
(LOAD scriptl-util FAIL) ASDF/FIND-SYSTEM:LOAD-SYSTEM-DEFINITION-ERROR : Error while trying to load definition for system scriptl-util from pathname /home/testgrid/cl-test-grid/work-dir/agent/quicklisp/dists/quicklisp/software/scriptl-20151031-git/scriptl-util.asd: Error while trying to load definition for system bordeaux-threads from pathname /home/testgrid/cl-test-grid/work-dir/agent/quicklisp/dists/quicklisp/software/bordeaux-threads-v0.8.5/bordeaux-threads.asd: Error in function "Top-Level Form": You need ASDF >= 3.1 to load this system correctly.
(LOAD scriptl-examples FAIL) ASDF/FIND-SYSTEM:LOAD-SYSTEM-DEFINITION-ERROR : Error while trying to load definition for system scriptl-examples from pathname /home/testgrid/cl-test-grid/work-dir/agent/quicklisp/dists/quicklisp/software/scriptl-20151031-git/scriptl-examples.asd: Error while trying to load definition for system bordeaux-threads from pathname /home/testgrid/cl-test-grid/work-dir/agent/quicklisp/dists/quicklisp/software/bordeaux-threads-v0.8.5/bordeaux-threads.asd: Error in function "Top-Level Form": You need ASDF >= 3.1 to load this system correctly.
(LOAD scriptl FAIL) ASDF/FIND-SYSTEM:LOAD-SYSTEM-DEFINITION-ERROR : Error while trying to load definition for system bordeaux-threads from pathname /home/testgrid/cl-test-grid/work-dir/agent/quicklisp/dists/quicklisp/software/bordeaux-threads-v0.8.5/bordeaux-threads.asd: Error in function "Top-Level Form": You need ASDF >= 3.1 to load this system correctly.
(LOAD scriptl-util FAIL) ASDF/FIND-SYSTEM:LOAD-SYSTEM-DEFINITION-ERROR : Error while trying to load definition for system scriptl-util from pathname /home/testgrid/cl-test-grid/work-dir/agent/quicklisp/dists/quicklisp/software/scriptl-20151031-git/scriptl-util.asd: Error while trying to load definition for system iolib from pathname /home/testgrid/cl-test-grid/work-dir/agent/quicklisp/dists/quicklisp/software/iolib-20160208-git/iolib.asd: Error in function "Top-Level Form": You need ASDF >= 3.1 to load this system correctly.
(LOAD scriptl-examples FAIL) ASDF/FIND-SYSTEM:LOAD-SYSTEM-DEFINITION-ERROR : Error while trying to load definition for system scriptl-examples from pathname /home/testgrid/cl-test-grid/work-dir/agent/quicklisp/dists/quicklisp/software/scriptl-20151031-git/scriptl-examples.asd: Error while trying to load definition for system iolib from pathname /home/testgrid/cl-test-grid/work-dir/agent/quicklisp/dists/quicklisp/software/iolib-20160208-git/iolib.asd: Error in function "Top-Level Form": You need ASDF >= 3.1 to load this system correctly.
(LOAD scriptl FAIL) ASDF/FIND-SYSTEM:LOAD-SYSTEM-DEFINITION-ERROR : Error while trying to load definition for system iolib from pathname /home/testgrid/cl-test-grid/work-dir/agent/quicklisp/dists/quicklisp/software/iolib-20160208-git/iolib.asd: Error in function "Top-Level Form": You need ASDF >= 3.1 to load this system correctly.
cmu-snapshot-2014-01__20e_unicode_-linux-x86
(LOAD scriptl-util FAIL) ASDF/FIND-SYSTEM:LOAD-SYSTEM-DEFINITION-ERROR : Error while trying to load definition for system scriptl-util from pathname /home/testgrid/cl-test-grid/work-dir/agent/quicklisp/dists/quicklisp/software/scriptl-20151031-git/scriptl-util.asd: Error while trying to load definition for system bordeaux-threads from pathname /home/testgrid/cl-test-grid/work-dir/agent/quicklisp/dists/quicklisp/software/bordeaux-threads-v0.8.5/bordeaux-threads.asd: Error in function "Top-Level Form": You need ASDF >= 3.1 to load this system correctly.
(LOAD scriptl-examples FAIL) ASDF/FIND-SYSTEM:LOAD-SYSTEM-DEFINITION-ERROR : Error while trying to load definition for system scriptl-examples from pathname /home/testgrid/cl-test-grid/work-dir/agent/quicklisp/dists/quicklisp/software/scriptl-20151031-git/scriptl-examples.asd: Error while trying to load definition for system bordeaux-threads from pathname /home/testgrid/cl-test-grid/work-dir/agent/quicklisp/dists/quicklisp/software/bordeaux-threads-v0.8.5/bordeaux-threads.asd: Error in function "Top-Level Form": You need ASDF >= 3.1 to load this system correctly.
(LOAD scriptl FAIL) ASDF/FIND-SYSTEM:LOAD-SYSTEM-DEFINITION-ERROR : Error while trying to load definition for system bordeaux-threads from pathname /home/testgrid/cl-test-grid/work-dir/agent/quicklisp/dists/quicklisp/software/bordeaux-threads-v0.8.5/bordeaux-threads.asd: Error in function "Top-Level Form": You need ASDF >= 3.1 to load this system correctly.
(LOAD scriptl-util FAIL) ASDF/FIND-SYSTEM:LOAD-SYSTEM-DEFINITION-ERROR : Error while trying to load definition for system scriptl-util from pathname /home/testgrid/cl-test-grid/work-dir/agent/quicklisp/dists/quicklisp/software/scriptl-20151031-git/scriptl-util.asd: Error while trying to load definition for system iolib from pathname /home/testgrid/cl-test-grid/work-dir/agent/quicklisp/dists/quicklisp/software/iolib-20160208-git/iolib.asd: Error in function "Top-Level Form": You need ASDF >= 3.1 to load this system correctly.
(LOAD scriptl-examples FAIL) ASDF/FIND-SYSTEM:LOAD-SYSTEM-DEFINITION-ERROR : Error while trying to load definition for system scriptl-examples from pathname /home/testgrid/cl-test-grid/work-dir/agent/quicklisp/dists/quicklisp/software/scriptl-20151031-git/scriptl-examples.asd: Error while trying to load definition for system iolib from pathname /home/testgrid/cl-test-grid/work-dir/agent/quicklisp/dists/quicklisp/software/iolib-20160208-git/iolib.asd: Error in function "Top-Level Form": You need ASDF >= 3.1 to load this system correctly.
(LOAD scriptl FAIL) ASDF/FIND-SYSTEM:LOAD-SYSTEM-DEFINITION-ERROR : Error while trying to load definition for system iolib from pathname /home/testgrid/cl-test-grid/work-dir/agent/quicklisp/dists/quicklisp/software/iolib-20160208-git/iolib.asd: Error in function "Top-Level Form": You need ASDF >= 3.1 to load this system correctly.
cmu-snapshot-2014-05-dirty__20e_unicode_-linux-x86
(LOAD scriptl-util FAIL) ASDF/FIND-SYSTEM:LOAD-SYSTEM-DEFINITION-ERROR : Error while trying to load definition for system scriptl-util from pathname /home/testgrid/cl-test-grid/work-dir/agent/quicklisp/dists/quicklisp/software/scriptl-20151031-git/scriptl-util.asd: Error while trying to load definition for system bordeaux-threads from pathname /home/testgrid/cl-test-grid/work-dir/agent/quicklisp/dists/quicklisp/software/bordeaux-threads-v0.8.5/bordeaux-threads.asd: Error in function "Top-Level Form": You need ASDF >= 3.1 to load this system correctly.
(LOAD scriptl-examples FAIL) ASDF/FIND-SYSTEM:LOAD-SYSTEM-DEFINITION-ERROR : Error while trying to load definition for system scriptl-examples from pathname /home/testgrid/cl-test-grid/work-dir/agent/quicklisp/dists/quicklisp/software/scriptl-20151031-git/scriptl-examples.asd: Error while trying to load definition for system bordeaux-threads from pathname /home/testgrid/cl-test-grid/work-dir/agent/quicklisp/dists/quicklisp/software/bordeaux-threads-v0.8.5/bordeaux-threads.asd: Error in function "Top-Level Form": You need ASDF >= 3.1 to load this system correctly.
(LOAD scriptl FAIL) ASDF/FIND-SYSTEM:LOAD-SYSTEM-DEFINITION-ERROR : Error while trying to load definition for system bordeaux-threads from pathname /home/testgrid/cl-test-grid/work-dir/agent/quicklisp/dists/quicklisp/software/bordeaux-threads-v0.8.5/bordeaux-threads.asd: Error in function "Top-Level Form": You need ASDF >= 3.1 to load this system correctly.
(LOAD scriptl-util FAIL) ASDF/FIND-SYSTEM:LOAD-SYSTEM-DEFINITION-ERROR : Error while trying to load definition for system scriptl-util from pathname /home/testgrid/cl-test-grid/work-dir/agent/quicklisp/dists/quicklisp/software/scriptl-20151031-git/scriptl-util.asd: Error while trying to load definition for system iolib from pathname /home/testgrid/cl-test-grid/work-dir/agent/quicklisp/dists/quicklisp/software/iolib-20160208-git/iolib.asd: Error in function "Top-Level Form": You need ASDF >= 3.1 to load this system correctly.
(LOAD scriptl-examples FAIL) ASDF/FIND-SYSTEM:LOAD-SYSTEM-DEFINITION-ERROR : Error while trying to load definition for system scriptl-examples from pathname /home/testgrid/cl-test-grid/work-dir/agent/quicklisp/dists/quicklisp/software/scriptl-20151031-git/scriptl-examples.asd: Error while trying to load definition for system iolib from pathname /home/testgrid/cl-test-grid/work-dir/agent/quicklisp/dists/quicklisp/software/iolib-20160208-git/iolib.asd: Error in function "Top-Level Form": You need ASDF >= 3.1 to load this system correctly.
(LOAD scriptl FAIL) ASDF/FIND-SYSTEM:LOAD-SYSTEM-DEFINITION-ERROR : Error while trying to load definition for system iolib from pathname /home/testgrid/cl-test-grid/work-dir/agent/quicklisp/dists/quicklisp/software/iolib-20160208-git/iolib.asd: Error in function "Top-Level Form": You need ASDF >= 3.1 to load this system correctly.
cmu-snapshot-2014-12___20f_unicode_-linux-x86
(LOAD scriptl-util FAIL) ASDF/FIND-SYSTEM:LOAD-SYSTEM-DEFINITION-ERROR : Error while trying to load definition for system scriptl-util from pathname /home/testgrid/cl-test-grid/work-dir/agent/quicklisp/dists/quicklisp/software/scriptl-20151031-git/scriptl-util.asd: Error while trying to load definition for system osicat from pathname /home/testgrid/cl-test-grid/work-dir/agent/quicklisp/dists/quicklisp/software/osicat-20160318-git/osicat.asd: (during macroexpansion) Error in FDEFINITION: the function GATHER-TYPE is undefined.
(LOAD scriptl-examples FAIL) ASDF/FIND-SYSTEM:LOAD-SYSTEM-DEFINITION-ERROR : Error while trying to load definition for system scriptl-examples from pathname /home/testgrid/cl-test-grid/work-dir/agent/quicklisp/dists/quicklisp/software/scriptl-20151031-git/scriptl-examples.asd: Error while trying to load definition for system osicat from pathname /home/testgrid/cl-test-grid/work-dir/agent/quicklisp/dists/quicklisp/software/osicat-20160318-git/osicat.asd: (during macroexpansion) Error in FDEFINITION: the function GATHER-TYPE is undefined.
(LOAD scriptl FAIL) ASDF/FIND-SYSTEM:LOAD-SYSTEM-DEFINITION-ERROR : Error while trying to load definition for system osicat from pathname /home/testgrid/cl-test-grid/work-dir/agent/quicklisp/dists/quicklisp/software/osicat-20160318-git/osicat.asd: (during macroexpansion) Error in FDEFINITION: the function GATHER-TYPE is undefined.
ecl-13.5.1-unknown-linux-i686-bytecode
(LOAD scriptl-util FAIL) ASDF/FIND-SYSTEM:LOAD-SYSTEM-DEFINITION-ERROR : Error while trying to load definition for system scriptl-util from pathname /home/testgrid/cl-test-grid/work-dir/agent/quicklisp/dists/quicklisp/software/scriptl-20151031-git/scriptl-util.asd: Error while trying to load definition for system bordeaux-threads from pathname /home/testgrid/cl-test-grid/work-dir/agent/quicklisp/dists/quicklisp/software/bordeaux-threads-v0.8.5/bordeaux-threads.asd: You need ASDF >= 3.1 to load this system correctly.
(LOAD scriptl-examples FAIL) ASDF/FIND-SYSTEM:LOAD-SYSTEM-DEFINITION-ERROR : Error while trying to load definition for system scriptl-examples from pathname /home/testgrid/cl-test-grid/work-dir/agent/quicklisp/dists/quicklisp/software/scriptl-20151031-git/scriptl-examples.asd: Error while trying to load definition for system bordeaux-threads from pathname /home/testgrid/cl-test-grid/work-dir/agent/quicklisp/dists/quicklisp/software/bordeaux-threads-v0.8.5/bordeaux-threads.asd: You need ASDF >= 3.1 to load this system correctly.
(LOAD scriptl FAIL) ASDF/FIND-SYSTEM:LOAD-SYSTEM-DEFINITION-ERROR : Error while trying to load definition for system bordeaux-threads from pathname /home/testgrid/cl-test-grid/work-dir/agent/quicklisp/dists/quicklisp/software/bordeaux-threads-v0.8.5/bordeaux-threads.asd: You need ASDF >= 3.1 to load this system correctly.
ecl-13.5.1-unknown-linux-i686-lisp-to-c
(LOAD scriptl-util FAIL) ASDF/FIND-SYSTEM:LOAD-SYSTEM-DEFINITION-ERROR : Error while trying to load definition for system scriptl-util from pathname /home/testgrid/cl-test-grid/work-dir/agent/quicklisp/dists/quicklisp/software/scriptl-20151031-git/scriptl-util.asd: Error while trying to load definition for system bordeaux-threads from pathname /home/testgrid/cl-test-grid/work-dir/agent/quicklisp/dists/quicklisp/software/bordeaux-threads-v0.8.5/bordeaux-threads.asd: You need ASDF >= 3.1 to load this system correctly.
(LOAD scriptl-examples FAIL) ASDF/FIND-SYSTEM:LOAD-SYSTEM-DEFINITION-ERROR : Error while trying to load definition for system scriptl-examples from pathname /home/testgrid/cl-test-grid/work-dir/agent/quicklisp/dists/quicklisp/software/scriptl-20151031-git/scriptl-examples.asd: Error while trying to load definition for system bordeaux-threads from pathname /home/testgrid/cl-test-grid/work-dir/agent/quicklisp/dists/quicklisp/software/bordeaux-threads-v0.8.5/bordeaux-threads.asd: You need ASDF >= 3.1 to load this system correctly.
(LOAD scriptl FAIL) ASDF/FIND-SYSTEM:LOAD-SYSTEM-DEFINITION-ERROR : Error while trying to load definition for system bordeaux-threads from pathname /home/testgrid/cl-test-grid/work-dir/agent/quicklisp/dists/quicklisp/software/bordeaux-threads-v0.8.5/bordeaux-threads.asd: You need ASDF >= 3.1 to load this system correctly.
(LOAD scriptl-util FAIL) ASDF/FIND-SYSTEM:LOAD-SYSTEM-DEFINITION-ERROR : Error while trying to load definition for system scriptl-util from pathname /home/testgrid/cl-test-grid/work-dir/agent/quicklisp/dists/quicklisp/software/scriptl-20151031-git/scriptl-util.asd: Error while trying to load definition for system iolib from pathname /home/testgrid/cl-test-grid/work-dir/agent/quicklisp/dists/quicklisp/software/iolib-20160208-git/iolib.asd: You need ASDF >= 3.1 to load this system correctly.
(LOAD scriptl-examples FAIL) ASDF/FIND-SYSTEM:LOAD-SYSTEM-DEFINITION-ERROR : Error while trying to load definition for system scriptl-examples from pathname /home/testgrid/cl-test-grid/work-dir/agent/quicklisp/dists/quicklisp/software/scriptl-20151031-git/scriptl-examples.asd: Error while trying to load definition for system iolib from pathname /home/testgrid/cl-test-grid/work-dir/agent/quicklisp/dists/quicklisp/software/iolib-20160208-git/iolib.asd: You need ASDF >= 3.1 to load this system correctly.
(LOAD scriptl FAIL) ASDF/FIND-SYSTEM:LOAD-SYSTEM-DEFINITION-ERROR : Error while trying to load definition for system iolib from pathname /home/testgrid/cl-test-grid/work-dir/agent/quicklisp/dists/quicklisp/software/iolib-20160208-git/iolib.asd: You need ASDF >= 3.1 to load this system correctly.
ecl-15.2.21-ee989b97-linux-i686-bytecode
(LOAD scriptl-util FAIL) ASDF/FIND-SYSTEM:LOAD-SYSTEM-DEFINITION-ERROR : Error while trying to load definition for system scriptl-util from pathname /home/testgrid/cl-test-grid/work-dir/agent/quicklisp/dists/quicklisp/software/scriptl-20151031-git/scriptl-util.asd: Error while trying to load definition for system iolib from pathname /home/testgrid/cl-test-grid/work-dir/agent/quicklisp/dists/quicklisp/software/iolib-v0.8.1/iolib.asd: The variable C::*CC-FLAGS* is unbound.
(LOAD scriptl-examples FAIL) ASDF/FIND-SYSTEM:LOAD-SYSTEM-DEFINITION-ERROR : Error while trying to load definition for system scriptl-examples from pathname /home/testgrid/cl-test-grid/work-dir/agent/quicklisp/dists/quicklisp/software/scriptl-20151031-git/scriptl-examples.asd: Error while trying to load definition for system iolib from pathname /home/testgrid/cl-test-grid/work-dir/agent/quicklisp/dists/quicklisp/software/iolib-v0.8.1/iolib.asd: The variable C::*CC-FLAGS* is unbound.
(LOAD scriptl FAIL) ASDF/FIND-SYSTEM:LOAD-SYSTEM-DEFINITION-ERROR : Error while trying to load definition for system iolib from pathname /home/testgrid/cl-test-grid/work-dir/agent/quicklisp/dists/quicklisp/software/iolib-v0.8.1/iolib.asd: The variable C::*CC-FLAGS* is unbound.
(LOAD scriptl-util FAIL) ASDF/FIND-SYSTEM:LOAD-SYSTEM-DEFINITION-ERROR : Error while trying to load definition for system scriptl-util from pathname /home/testgrid/cl-test-grid/work-dir/agent/quicklisp/dists/quicklisp/software/scriptl-20151031-git/scriptl-util.asd: Error while trying to load definition for system iolib from pathname /home/testgrid/cl-test-grid/work-dir/agent/quicklisp/dists/quicklisp/software/iolib-20160208-git/iolib.asd: The variable C::*CC-FLAGS* is unbound.
(LOAD scriptl-examples FAIL) ASDF/FIND-SYSTEM:LOAD-SYSTEM-DEFINITION-ERROR : Error while trying to load definition for system scriptl-examples from pathname /home/testgrid/cl-test-grid/work-dir/agent/quicklisp/dists/quicklisp/software/scriptl-20151031-git/scriptl-examples.asd: Error while trying to load definition for system iolib from pathname /home/testgrid/cl-test-grid/work-dir/agent/quicklisp/dists/quicklisp/software/iolib-20160208-git/iolib.asd: The variable C::*CC-FLAGS* is unbound.
(LOAD scriptl FAIL) ASDF/FIND-SYSTEM:LOAD-SYSTEM-DEFINITION-ERROR : Error while trying to load definition for system iolib from pathname /home/testgrid/cl-test-grid/work-dir/agent/quicklisp/dists/quicklisp/software/iolib-20160208-git/iolib.asd: The variable C::*CC-FLAGS* is unbound.
ecl-15.2.21-ee989b97-linux-i686-lisp-to-c
ecl-15.2.21-ee989b97-linux-x64-bytecode
(LOAD scriptl-util FAIL) ASDF/FIND-SYSTEM:LOAD-SYSTEM-DEFINITION-ERROR : Error while trying to load definition for system scriptl-util from pathname /home/hijarian/systems/cl-test-grid/work-dir/agent/quicklisp/dists/quicklisp/software/scriptl-20151031-git/scriptl-util.asd: Error while trying to load definition for system iolib from pathname /home/hijarian/systems/cl-test-grid/work-dir/agent/quicklisp/dists/quicklisp/software/iolib-v0.8.1/iolib.asd: The variable C::*CC-FLAGS* is unbound.
(LOAD scriptl-examples FAIL) ASDF/FIND-SYSTEM:LOAD-SYSTEM-DEFINITION-ERROR : Error while trying to load definition for system scriptl-examples from pathname /home/hijarian/systems/cl-test-grid/work-dir/agent/quicklisp/dists/quicklisp/software/scriptl-20151031-git/scriptl-examples.asd: Error while trying to load definition for system iolib from pathname /home/hijarian/systems/cl-test-grid/work-dir/agent/quicklisp/dists/quicklisp/software/iolib-v0.8.1/iolib.asd: The variable C::*CC-FLAGS* is unbound.
(LOAD scriptl FAIL) ASDF/FIND-SYSTEM:LOAD-SYSTEM-DEFINITION-ERROR : Error while trying to load definition for system iolib from pathname /home/hijarian/systems/cl-test-grid/work-dir/agent/quicklisp/dists/quicklisp/software/iolib-v0.8.1/iolib.asd: The variable C::*CC-FLAGS* is unbound.
(LOAD scriptl-util FAIL) ASDF/FIND-SYSTEM:LOAD-SYSTEM-DEFINITION-ERROR : Error while trying to load definition for system scriptl-util from pathname /home/hijarian/systems/cl-test-grid/work-dir/agent/quicklisp/dists/quicklisp/software/scriptl-20151031-git/scriptl-util.asd: Error while trying to load definition for system iolib from pathname /home/hijarian/systems/cl-test-grid/work-dir/agent/quicklisp/dists/quicklisp/software/iolib-20160208-git/iolib.asd: The variable C::*CC-FLAGS* is unbound.
(LOAD scriptl-examples FAIL) ASDF/FIND-SYSTEM:LOAD-SYSTEM-DEFINITION-ERROR : Error while trying to load definition for system scriptl-examples from pathname /home/hijarian/systems/cl-test-grid/work-dir/agent/quicklisp/dists/quicklisp/software/scriptl-20151031-git/scriptl-examples.asd: Error while trying to load definition for system iolib from pathname /home/hijarian/systems/cl-test-grid/work-dir/agent/quicklisp/dists/quicklisp/software/iolib-20160208-git/iolib.asd: The variable C::*CC-FLAGS* is unbound.
(LOAD scriptl FAIL) ASDF/FIND-SYSTEM:LOAD-SYSTEM-DEFINITION-ERROR : Error while trying to load definition for system iolib from pathname /home/hijarian/systems/cl-test-grid/work-dir/agent/quicklisp/dists/quicklisp/software/iolib-20160208-git/iolib.asd: The variable C::*CC-FLAGS* is unbound.
(LOAD scriptl-util FAIL) ASDF/FIND-SYSTEM:LOAD-SYSTEM-DEFINITION-ERROR : Error while trying to load definition for system scriptl-util from pathname /home/hijarian/systems/cl-test-grid/work-dir/agent/quicklisp/dists/quicklisp/software/scriptl-20151031-git/scriptl-util.asd: Error while trying to load definition for system iolib from pathname /home/hijarian/systems/cl-test-grid/work-dir/agent/quicklisp/dists/quicklisp/software/iolib-20160208-git/iolib.asd: The variable C::*CC-FLAGS* is unbound.
(LOAD scriptl-examples FAIL) ASDF/FIND-SYSTEM:LOAD-SYSTEM-DEFINITION-ERROR : Error while trying to load definition for system scriptl-examples from pathname /home/hijarian/systems/cl-test-grid/work-dir/agent/quicklisp/dists/quicklisp/software/scriptl-20151031-git/scriptl-examples.asd: Error while trying to load definition for system iolib from pathname /home/hijarian/systems/cl-test-grid/work-dir/agent/quicklisp/dists/quicklisp/software/iolib-20160208-git/iolib.asd: The variable C::*CC-FLAGS* is unbound.
(LOAD scriptl FAIL) ASDF/FIND-SYSTEM:LOAD-SYSTEM-DEFINITION-ERROR : Error while trying to load definition for system iolib from pathname /home/hijarian/systems/cl-test-grid/work-dir/agent/quicklisp/dists/quicklisp/software/iolib-20160208-git/iolib.asd: The variable C::*CC-FLAGS* is unbound.
ecl-15.2.21-ee989b97-linux-x64-lisp-to-c
(LOAD scriptl-util FAIL) ASDF/FIND-SYSTEM:LOAD-SYSTEM-DEFINITION-ERROR : Error while trying to load definition for system scriptl-util from pathname /home/hijarian/systems/cl-test-grid/work-dir/agent/quicklisp/dists/quicklisp/software/scriptl-20151031-git/scriptl-util.asd: Error while trying to load definition for system osicat from pathname /home/hijarian/systems/cl-test-grid/work-dir/agent/quicklisp/dists/quicklisp/software/osicat-20160318-git/osicat.asd: COMPILE-FILE-ERROR while compiling #<cl-source-file "cffi-toolchain" "toolchain" "asdf-compat">
(LOAD scriptl-examples FAIL) ASDF/FIND-SYSTEM:LOAD-SYSTEM-DEFINITION-ERROR : Error while trying to load definition for system scriptl-examples from pathname /home/hijarian/systems/cl-test-grid/work-dir/agent/quicklisp/dists/quicklisp/software/scriptl-20151031-git/scriptl-examples.asd: Error while trying to load definition for system osicat from pathname /home/hijarian/systems/cl-test-grid/work-dir/agent/quicklisp/dists/quicklisp/software/osicat-20160318-git/osicat.asd: COMPILE-FILE-ERROR while compiling #<cl-source-file "cffi-toolchain" "toolchain" "asdf-compat">
(LOAD scriptl FAIL) ASDF/FIND-SYSTEM:LOAD-SYSTEM-DEFINITION-ERROR : Error while trying to load definition for system osicat from pathname /home/hijarian/systems/cl-test-grid/work-dir/agent/quicklisp/dists/quicklisp/software/osicat-20160318-git/osicat.asd: COMPILE-FILE-ERROR while compiling #<cl-source-file "cffi-toolchain" "toolchain" "asdf-compat">
(LOAD scriptl-util FAIL) ASDF/FIND-SYSTEM:LOAD-SYSTEM-DEFINITION-ERROR : Error while trying to load definition for system scriptl-util from pathname /home/hijarian/systems/cl-test-grid/work-dir/agent/quicklisp/dists/quicklisp/software/scriptl-20151031-git/scriptl-util.asd: External process exited with code 1. Command was: "g++" "-m64" "-Wno-write-strings" "-D_GNU_SOURCE" "-D_FILE_OFFSET_BITS=64" "-g" "-O2" "-fPIC" "-D_THREAD_SAFE" "-Dlinux" "-I/home/hijarian/systems/cl-test-grid/work-dir/agent/quicklisp/dists/quicklisp/software/iolib-20160208-git/src/grovel/" "-o" "/home/hijarian/systems/cl-test-grid/work-dir/agent/test-runs/20160309125026-ecl-15.2.21-ee989b97-linux-x64-lisp-to-c/fasl/ql/dists/quicklisp/software/iolib-20160208-git/src/syscalls/ffi-types-unix" "/home/hijarian/systems/cl-tes... Output was: Error output was: /home/hijarian/systems/cl-test... fatal error: lfp.h: Нет такого файла или каталога compilation terminated.
(LOAD scriptl-examples FAIL) ASDF/FIND-SYSTEM:LOAD-SYSTEM-DEFINITION-ERROR : Error while trying to load definition for system scriptl-examples from pathname /home/hijarian/systems/cl-test-grid/work-dir/agent/quicklisp/dists/quicklisp/software/scriptl-20151031-git/scriptl-examples.asd: External process exited with code 1. Command was: "g++" "-m64" "-Wno-write-strings" "-D_GNU_SOURCE" "-D_FILE_OFFSET_BITS=64" "-g" "-O2" "-fPIC" "-D_THREAD_SAFE" "-Dlinux" "-I/home/hijarian/systems/cl-test-grid/work-dir/agent/quicklisp/dists/quicklisp/software/iolib-20160208-git/src/grovel/" "-o" "/home/hijarian/systems/cl-test-grid/work-dir/agent/test-runs/20160309125026-ecl-15.2.21-ee989b97-linux-x64-lisp-to-c/fasl/ql/dists/quicklisp/software/iolib-20160208-git/src/syscalls/ffi-types-unix" "/home/hijarian/systems/cl-tes... Output was: Error output was: /home/hijarian/systems/cl-test... fatal error: lfp.h: Нет такого файла или каталога compilation terminated.
(LOAD scriptl FAIL) IOLIB/GROVEL::GROVEL-ERROR : External process exited with code 1. Command was: "g++" "-m64" "-Wno-write-strings" "-D_GNU_SOURCE" "-D_FILE_OFFSET_BITS=64" "-g" "-O2" "-fPIC" "-D_THREAD_SAFE" "-Dlinux" "-I/home/hijarian/systems/cl-test-grid/work-dir/agent/quicklisp/dists/quicklisp/software/iolib-20160208-git/src/grovel/" "-o" "/home/hijarian/systems/cl-test-grid/work-dir/agent/test-runs/20160309125026-ecl-15.2.21-ee989b97-linux-x64-lisp-to-c/fasl/ql/dists/quicklisp/software/iolib-20160208-git/src/syscalls/ffi-types-unix" "/home/hijarian/systems/cl-tes... Output was: Error output was: /home/hijarian/systems/cl-test... fatal error: lfp.h: Нет такого файла или каталога compilation terminated.
(LOAD scriptl-util FAIL) ASDF/FIND-SYSTEM:LOAD-SYSTEM-DEFINITION-ERROR : Error while trying to load definition for system scriptl-util from pathname /home/hijarian/systems/cl-test-grid/work-dir/agent/quicklisp/dists/quicklisp/software/scriptl-20151031-git/scriptl-util.asd: External process exited with code 1. Command was: "g++" "-m64" "-Wno-write-strings" "-D_GNU_SOURCE" "-D_FILE_OFFSET_BITS=64" "-g" "-O2" "-fPIC" "-D_THREAD_SAFE" "-Dlinux" "-I/home/hijarian/systems/cl-test-grid/work-dir/agent/quicklisp/dists/quicklisp/software/iolib-20160208-git/src/grovel/" "-o" "/home/hijarian/systems/cl-test-grid/work-dir/agent/test-runs/20160215113646-ecl-15.2.21-ee989b97-linux-x64-lisp-to-c/fasl/ql/dists/quicklisp/software/iolib-20160208-git/src/syscalls/ffi-types-unix" "/home/hijarian/systems/cl-tes... Output was: Error output was: /home/hijarian/systems/cl-test... fatal error: lfp.h: Нет такого файла или каталога #include <lfp.h> ^ compilation terminated.
(LOAD scriptl-examples FAIL) ASDF/FIND-SYSTEM:LOAD-SYSTEM-DEFINITION-ERROR : Error while trying to load definition for system scriptl-examples from pathname /home/hijarian/systems/cl-test-grid/work-dir/agent/quicklisp/dists/quicklisp/software/scriptl-20151031-git/scriptl-examples.asd: External process exited with code 1. Command was: "g++" "-m64" "-Wno-write-strings" "-D_GNU_SOURCE" "-D_FILE_OFFSET_BITS=64" "-g" "-O2" "-fPIC" "-D_THREAD_SAFE" "-Dlinux" "-I/home/hijarian/systems/cl-test-grid/work-dir/agent/quicklisp/dists/quicklisp/software/iolib-20160208-git/src/grovel/" "-o" "/home/hijarian/systems/cl-test-grid/work-dir/agent/test-runs/20160215113646-ecl-15.2.21-ee989b97-linux-x64-lisp-to-c/fasl/ql/dists/quicklisp/software/iolib-20160208-git/src/syscalls/ffi-types-unix" "/home/hijarian/systems/cl-tes... Output was: Error output was: /home/hijarian/systems/cl-test... fatal error: lfp.h: Нет такого файла или каталога #include <lfp.h> ^ compilation terminated.
(LOAD scriptl FAIL) IOLIB/GROVEL::GROVEL-ERROR : External process exited with code 1. Command was: "g++" "-m64" "-Wno-write-strings" "-D_GNU_SOURCE" "-D_FILE_OFFSET_BITS=64" "-g" "-O2" "-fPIC" "-D_THREAD_SAFE" "-Dlinux" "-I/home/hijarian/systems/cl-test-grid/work-dir/agent/quicklisp/dists/quicklisp/software/iolib-20160208-git/src/grovel/" "-o" "/home/hijarian/systems/cl-test-grid/work-dir/agent/test-runs/20160215113646-ecl-15.2.21-ee989b97-linux-x64-lisp-to-c/fasl/ql/dists/quicklisp/software/iolib-20160208-git/src/syscalls/ffi-types-unix" "/home/hijarian/systems/cl-tes... Output was: Error output was: /home/hijarian/systems/cl-test... fatal error: lfp.h: Нет такого файла или каталога #include <lfp.h> ^ compilation terminated.
ecl-16.0.0-98fc12d3-linux-i686-bytecode
(LOAD scriptl-util FAIL) ASDF/FIND-SYSTEM:LOAD-SYSTEM-DEFINITION-ERROR : Error while trying to load definition for system scriptl-util from pathname /home/testgrid/cl-test-grid/work-dir/agent/quicklisp/dists/quicklisp/software/scriptl-20151031-git/scriptl-util.asd: Error while trying to load definition for system iolib from pathname /home/testgrid/cl-test-grid/work-dir/agent/quicklisp/dists/quicklisp/software/iolib-v0.8.1/iolib.asd: The variable C::*CC-FLAGS* is unbound.
(LOAD scriptl-examples FAIL) ASDF/FIND-SYSTEM:LOAD-SYSTEM-DEFINITION-ERROR : Error while trying to load definition for system scriptl-examples from pathname /home/testgrid/cl-test-grid/work-dir/agent/quicklisp/dists/quicklisp/software/scriptl-20151031-git/scriptl-examples.asd: Error while trying to load definition for system iolib from pathname /home/testgrid/cl-test-grid/work-dir/agent/quicklisp/dists/quicklisp/software/iolib-v0.8.1/iolib.asd: The variable C::*CC-FLAGS* is unbound.
(LOAD scriptl FAIL) ASDF/FIND-SYSTEM:LOAD-SYSTEM-DEFINITION-ERROR : Error while trying to load definition for system iolib from pathname /home/testgrid/cl-test-grid/work-dir/agent/quicklisp/dists/quicklisp/software/iolib-v0.8.1/iolib.asd: The variable C::*CC-FLAGS* is unbound.
(LOAD scriptl-util FAIL) ASDF/FIND-SYSTEM:LOAD-SYSTEM-DEFINITION-ERROR : Error while trying to load definition for system scriptl-util from pathname /home/testgrid/cl-test-grid/work-dir/agent/quicklisp/dists/quicklisp/software/scriptl-20151031-git/scriptl-util.asd: Error while trying to load definition for system iolib from pathname /home/testgrid/cl-test-grid/work-dir/agent/quicklisp/dists/quicklisp/software/iolib-20160208-git/iolib.asd: The variable C::*CC-FLAGS* is unbound.
(LOAD scriptl-examples FAIL) ASDF/FIND-SYSTEM:LOAD-SYSTEM-DEFINITION-ERROR : Error while trying to load definition for system scriptl-examples from pathname /home/testgrid/cl-test-grid/work-dir/agent/quicklisp/dists/quicklisp/software/scriptl-20151031-git/scriptl-examples.asd: Error while trying to load definition for system iolib from pathname /home/testgrid/cl-test-grid/work-dir/agent/quicklisp/dists/quicklisp/software/iolib-20160208-git/iolib.asd: The variable C::*CC-FLAGS* is unbound.
(LOAD scriptl FAIL) ASDF/FIND-SYSTEM:LOAD-SYSTEM-DEFINITION-ERROR : Error while trying to load definition for system iolib from pathname /home/testgrid/cl-test-grid/work-dir/agent/quicklisp/dists/quicklisp/software/iolib-20160208-git/iolib.asd: The variable C::*CC-FLAGS* is unbound.
ecl-16.0.0-98fc12d3-linux-i686-lisp-to-c
ecl-16.0.0-b2661fd1-linux-x64-bytecode
(LOAD scriptl-util FAIL) ASDF/FIND-SYSTEM:LOAD-SYSTEM-DEFINITION-ERROR : Error while trying to load definition for system scriptl-util from pathname /home/jack/quicklisp/local-projects/cl-test-grid/work-dir/agent/quicklisp/dists/quicklisp/software/scriptl-20151031-git/scriptl-util.asd: Error while trying to load definition for system iolib from pathname /home/jack/quicklisp/local-projects/cl-test-grid/work-dir/agent/quicklisp/dists/quicklisp/software/iolib-20160208-git/iolib.asd: The variable C::*CC-FLAGS* is unbound.
(LOAD scriptl-examples FAIL) ASDF/FIND-SYSTEM:LOAD-SYSTEM-DEFINITION-ERROR : Error while trying to load definition for system scriptl-examples from pathname /home/jack/quicklisp/local-projects/cl-test-grid/work-dir/agent/quicklisp/dists/quicklisp/software/scriptl-20151031-git/scriptl-examples.asd: Error while trying to load definition for system iolib from pathname /home/jack/quicklisp/local-projects/cl-test-grid/work-dir/agent/quicklisp/dists/quicklisp/software/iolib-20160208-git/iolib.asd: The variable C::*CC-FLAGS* is unbound.
(LOAD scriptl FAIL) ASDF/FIND-SYSTEM:LOAD-SYSTEM-DEFINITION-ERROR : Error while trying to load definition for system iolib from pathname /home/jack/quicklisp/local-projects/cl-test-grid/work-dir/agent/quicklisp/dists/quicklisp/software/iolib-20160208-git/iolib.asd: The variable C::*CC-FLAGS* is unbound.
ecl-16.0.0-b2661fd1-linux-x64-lisp-to-c
(LOAD scriptl-util FAIL) ASDF/FIND-SYSTEM:LOAD-SYSTEM-DEFINITION-ERROR : Error while trying to load definition for system scriptl-util from pathname /home/jack/quicklisp/local-projects/cl-test-grid/work-dir/agent/quicklisp/dists/quicklisp/software/scriptl-20151031-git/scriptl-util.asd: Filesystem error with pathname #P"/tmp/tmpNHCTGW2L.tmp". Either 1) the file does not exist, or 2) we are not allowed to access the file, or 3) the pathname points to a broken symbolic link.
(LOAD scriptl-examples FAIL) ASDF/FIND-SYSTEM:LOAD-SYSTEM-DEFINITION-ERROR : Error while trying to load definition for system scriptl-examples from pathname /home/jack/quicklisp/local-projects/cl-test-grid/work-dir/agent/quicklisp/dists/quicklisp/software/scriptl-20151031-git/scriptl-examples.asd: Filesystem error with pathname #P"/tmp/tmpF1S9MWTS.tmp". Either 1) the file does not exist, or 2) we are not allowed to access the file, or 3) the pathname points to a broken symbolic link.
(LOAD scriptl FAIL) COMMON-LISP:FILE-ERROR : Filesystem error with pathname #P"/tmp/tmpOADC8KM5.tmp". Either 1) the file does not exist, or 2) we are not allowed to access the file, or 3) the pathname points to a broken symbolic link.
ecl-16.0.0-b2661fd1-macosx-x64-bytecode
(LOAD scriptl-util FAIL) ASDF/FIND-SYSTEM:LOAD-SYSTEM-DEFINITION-ERROR : Error while trying to load definition for system scriptl-util from pathname /Users/testgrid/cl-test-grid/work-dir/agent/quicklisp/dists/quicklisp/software/scriptl-20151031-git/scriptl-util.asd: Error while trying to load definition for system iolib from pathname /Users/testgrid/cl-test-grid/work-dir/agent/quicklisp/dists/quicklisp/software/iolib-20160208-git/iolib.asd: The variable C::*CC-FLAGS* is unbound.
(LOAD scriptl-examples FAIL) ASDF/FIND-SYSTEM:LOAD-SYSTEM-DEFINITION-ERROR : Error while trying to load definition for system scriptl-examples from pathname /Users/testgrid/cl-test-grid/work-dir/agent/quicklisp/dists/quicklisp/software/scriptl-20151031-git/scriptl-examples.asd: Error while trying to load definition for system iolib from pathname /Users/testgrid/cl-test-grid/work-dir/agent/quicklisp/dists/quicklisp/software/iolib-20160208-git/iolib.asd: The variable C::*CC-FLAGS* is unbound.
(LOAD scriptl FAIL) ASDF/FIND-SYSTEM:LOAD-SYSTEM-DEFINITION-ERROR : Error while trying to load definition for system iolib from pathname /Users/testgrid/cl-test-grid/work-dir/agent/quicklisp/dists/quicklisp/software/iolib-20160208-git/iolib.asd: The variable C::*CC-FLAGS* is unbound.
ecl-16.0.0-b2661fd1-macosx-x64-lisp-to-c
(LOAD scriptl-util FAIL) ASDF/FIND-SYSTEM:LOAD-SYSTEM-DEFINITION-ERROR : Error while trying to load definition for system scriptl-util from pathname /Users/testgrid/cl-test-grid/work-dir/agent/quicklisp/dists/quicklisp/software/scriptl-20151031-git/scriptl-util.asd: External process exited with code 1. Command was: "g++" "-m64" "-Wno-write-strings" "-g" "-O2" "-fPIC" "-fno-common" "-D_THREAD_SAFE" "-Ddarwin" "-I" "/opt/local/include/" "-I/Users/testgrid/cl-test-grid/work-dir/agent/quicklisp/dists/quicklisp/software/iolib-20160208-git/src/grovel/" "-o" "/Users/testgrid/cl-test-grid/work-dir/agent/test-runs/20160220134238-ecl-16.0.0-b2661fd1-macosx-x64-lisp-to-c/fasl/ql/dists/quicklisp/software/iolib-20160208-git/src/syscalls/ffi-types-unix" "/Users/testgrid/cl-test-grid/work-dir/agent/test-runs/20160220134238-ecl-16.0.0-b2661fd1-macosx-x64-lisp-to-c/fasl/ql/dists/quicklisp/software/iolib-20160208-git/src/syscalls/ffi-types-unix.c" Output was: Error output was: clang: warning: treating 'c' input as 'c++' when in C++ mode, this behavior is deprecated /Users/testgrid/cl-test-grid/work-dir/agent/test-runs/20160220134238-ecl-16.0.0-b2661fd1-macosx-x64-lisp-to-c/fasl/ql/dists/quicklisp/software/iolib-20160208-git/src/syscalls/ffi-types-unix.c:6:10: fatal error: 'lfp.h' file not found #include <lfp.h> ^ 1 error generated.
(LOAD scriptl-examples FAIL) ASDF/FIND-SYSTEM:LOAD-SYSTEM-DEFINITION-ERROR : Error while trying to load definition for system scriptl-examples from pathname /Users/testgrid/cl-test-grid/work-dir/agent/quicklisp/dists/quicklisp/software/scriptl-20151031-git/scriptl-examples.asd: External process exited with code 1. Command was: "g++" "-m64" "-Wno-write-strings" "-g" "-O2" "-fPIC" "-fno-common" "-D_THREAD_SAFE" "-Ddarwin" "-I" "/opt/local/include/" "-I/Users/testgrid/cl-test-grid/work-dir/agent/quicklisp/dists/quicklisp/software/iolib-20160208-git/src/grovel/" "-o" "/Users/testgrid/cl-test-grid/work-dir/agent/test-runs/20160220134238-ecl-16.0.0-b2661fd1-macosx-x64-lisp-to-c/fasl/ql/dists/quicklisp/software/iolib-20160208-git/src/syscalls/ffi-types-unix" "/Users/testgrid/cl-test-grid/work-dir/agent/test-runs/20160220134238-ecl-16.0.0-b2661fd1-macosx-x64-lisp-to-c/fasl/ql/dists/quicklisp/software/iolib-20160208-git/src/syscalls/ffi-types-unix.c" Output was: Error output was: clang: warning: treating 'c' input as 'c++' when in C++ mode, this behavior is deprecated /Users/testgrid/cl-test-grid/work-dir/agent/test-runs/20160220134238-ecl-16.0.0-b2661fd1-macosx-x64-lisp-to-c/fasl/ql/dists/quicklisp/software/iolib-20160208-git/src/syscalls/ffi-types-unix.c:6:10: fatal error: 'lfp.h' file not found #include <lfp.h> ^ 1 error generated.
(LOAD scriptl FAIL) IOLIB/GROVEL::GROVEL-ERROR : External process exited with code 1. Command was: "g++" "-m64" "-Wno-write-strings" "-g" "-O2" "-fPIC" "-fno-common" "-D_THREAD_SAFE" "-Ddarwin" "-I" "/opt/local/include/" "-I/Users/testgrid/cl-test-grid/work-dir/agent/quicklisp/dists/quicklisp/software/iolib-20160208-git/src/grovel/" "-o" "/Users/testgrid/cl-test-grid/work-dir/agent/test-runs/20160220134238-ecl-16.0.0-b2661fd1-macosx-x64-lisp-to-c/fasl/ql/dists/quicklisp/software/iolib-20160208-git/src/syscalls/ffi-types-unix" "/Users/testgrid/cl-test-grid/work-dir/agent/test-runs/20160220134238-ecl-16.0.0-b2661fd1-macosx-x64-lisp-to-c/fasl/ql/dists/quicklisp/software/iolib-20160208-git/src/syscalls/ffi-types-unix.c" Output was: Error output was: clang: warning: treating 'c' input as 'c++' when in C++ mode, this behavior is deprecated /Users/testgrid/cl-test-grid/work-dir/agent/test-runs/20160220134238-ecl-16.0.0-b2661fd1-macosx-x64-lisp-to-c/fasl/ql/dists/quicklisp/software/iolib-20160208-git/src/syscalls/ffi-types-unix.c:6:10: fatal error: 'lfp.h' file not found #include <lfp.h> ^ 1 error generated.
ecl-16.1.2-rc2-093ba0ab-linux-x64-bytecode
(LOAD scriptl-util FAIL) ASDF/FIND-SYSTEM:LOAD-SYSTEM-DEFINITION-ERROR : Error while trying to load definition for system scriptl-util from pathname /home/jack/quicklisp/local-projects/cl-test-grid/work-dir/agent/quicklisp/dists/quicklisp/software/scriptl-20151031-git/scriptl-util.asd: Error while trying to load definition for system iolib from pathname /home/jack/quicklisp/local-projects/cl-test-grid/work-dir/agent/quicklisp/dists/quicklisp/software/iolib-20160208-git/iolib.asd: The variable C::*CC-FLAGS* is unbound.
(LOAD scriptl-examples FAIL) ASDF/FIND-SYSTEM:LOAD-SYSTEM-DEFINITION-ERROR : Error while trying to load definition for system scriptl-examples from pathname /home/jack/quicklisp/local-projects/cl-test-grid/work-dir/agent/quicklisp/dists/quicklisp/software/scriptl-20151031-git/scriptl-examples.asd: Error while trying to load definition for system iolib from pathname /home/jack/quicklisp/local-projects/cl-test-grid/work-dir/agent/quicklisp/dists/quicklisp/software/iolib-20160208-git/iolib.asd: The variable C::*CC-FLAGS* is unbound.
(LOAD scriptl FAIL) ASDF/FIND-SYSTEM:LOAD-SYSTEM-DEFINITION-ERROR : Error while trying to load definition for system iolib from pathname /home/jack/quicklisp/local-projects/cl-test-grid/work-dir/agent/quicklisp/dists/quicklisp/software/iolib-20160208-git/iolib.asd: The variable C::*CC-FLAGS* is unbound.
ecl-16.1.2-rc2-093ba0ab-linux-x64-lisp-to-c
(LOAD scriptl-util FAIL) ASDF/FIND-SYSTEM:LOAD-SYSTEM-DEFINITION-ERROR : Error while trying to load definition for system scriptl-util from pathname /home/jack/quicklisp/local-projects/cl-test-grid/work-dir/agent/quicklisp/dists/quicklisp/software/scriptl-20151031-git/scriptl-util.asd: Filesystem error with pathname #P"/tmp/tmpM067IYRI.tmp". Either 1) the file does not exist, or 2) we are not allowed to access the file, or 3) the pathname points to a broken symbolic link.
(LOAD scriptl-examples FAIL) ASDF/FIND-SYSTEM:LOAD-SYSTEM-DEFINITION-ERROR : Error while trying to load definition for system scriptl-examples from pathname /home/jack/quicklisp/local-projects/cl-test-grid/work-dir/agent/quicklisp/dists/quicklisp/software/scriptl-20151031-git/scriptl-examples.asd: Filesystem error with pathname #P"/tmp/tmpNNKAPOFF.tmp". Either 1) the file does not exist, or 2) we are not allowed to access the file, or 3) the pathname points to a broken symbolic link.
(LOAD scriptl FAIL) COMMON-LISP:FILE-ERROR : Filesystem error with pathname #P"/tmp/tmpSSH9TLF9.tmp". Either 1) the file does not exist, or 2) we are not allowed to access the file, or 3) the pathname points to a broken symbolic link.
ecl-16.1.2-rc3-9e5a61f4-linux-x64-bytecode
(LOAD scriptl-util FAIL) ASDF/FIND-SYSTEM:LOAD-SYSTEM-DEFINITION-ERROR : Error while trying to load definition for system iolib from pathname /home/jack/Projekty/lisp-systems/cl-test-grid/work-dir/agent/quicklisp/dists/quicklisp/software/iolib-20160208-git/iolib.asd: The variable C::*CC-FLAGS* is unbound.
(LOAD scriptl-examples FAIL) ASDF/FIND-SYSTEM:LOAD-SYSTEM-DEFINITION-ERROR : Error while trying to load definition for system iolib from pathname /home/jack/Projekty/lisp-systems/cl-test-grid/work-dir/agent/quicklisp/dists/quicklisp/software/iolib-20160208-git/iolib.asd: The variable C::*CC-FLAGS* is unbound.
(LOAD scriptl FAIL) ASDF/FIND-SYSTEM:LOAD-SYSTEM-DEFINITION-ERROR : Error while trying to load definition for system iolib from pathname /home/jack/Projekty/lisp-systems/cl-test-grid/work-dir/agent/quicklisp/dists/quicklisp/software/iolib-20160208-git/iolib.asd: The variable C::*CC-FLAGS* is unbound.
ecl-16.1.2-rc3-9e5a61f4-linux-x64-lisp-to-c
(LOAD scriptl-util FAIL) ASDF/FIND-SYSTEM:LOAD-SYSTEM-DEFINITION-ERROR : Error while trying to load definition for system scriptl-util from pathname /home/jack/quicklisp/local-projects/cl-test-grid/work-dir/agent/quicklisp/dists/quicklisp/software/scriptl-20151031-git/scriptl-util.asd: Filesystem error with pathname #P"/tmp/tmpOKHR415D.tmp". Either 1) the file does not exist, or 2) we are not allowed to access the file, or 3) the pathname points to a broken symbolic link.
(LOAD scriptl-examples FAIL) ASDF/FIND-SYSTEM:LOAD-SYSTEM-DEFINITION-ERROR : Error while trying to load definition for system scriptl-examples from pathname /home/jack/quicklisp/local-projects/cl-test-grid/work-dir/agent/quicklisp/dists/quicklisp/software/scriptl-20151031-git/scriptl-examples.asd: Filesystem error with pathname #P"/tmp/tmpYC5A947D.tmp". Either 1) the file does not exist, or 2) we are not allowed to access the file, or 3) the pathname points to a broken symbolic link.
(LOAD scriptl FAIL) COMMON-LISP:FILE-ERROR : Filesystem error with pathname #P"/tmp/tmpBQVX9JEQ.tmp". Either 1) the file does not exist, or 2) we are not allowed to access the file, or 3) the pathname points to a broken symbolic link.
(LOAD scriptl-util FAIL) ASDF/FIND-SYSTEM:LOAD-SYSTEM-DEFINITION-ERROR : Error while trying to load definition for system scriptl-util from pathname /home/jack/Projekty/lisp-systems/cl-test-grid/work-dir/agent/quicklisp/dists/quicklisp/software/scriptl-20151031-git/scriptl-util.asd: Filesystem error with pathname #P"/tmp/tmp4AB0C05S.tmp". Either 1) the file does not exist, or 2) we are not allowed to access the file, or 3) the pathname points to a broken symbolic link.
(LOAD scriptl-examples FAIL) ASDF/FIND-SYSTEM:LOAD-SYSTEM-DEFINITION-ERROR : Error while trying to load definition for system scriptl-examples from pathname /home/jack/Projekty/lisp-systems/cl-test-grid/work-dir/agent/quicklisp/dists/quicklisp/software/scriptl-20151031-git/scriptl-examples.asd: Filesystem error with pathname #P"/tmp/tmpQ8XUQDUQ.tmp". Either 1) the file does not exist, or 2) we are not allowed to access the file, or 3) the pathname points to a broken symbolic link.
(LOAD scriptl FAIL) COMMON-LISP:FILE-ERROR : Filesystem error with pathname #P"/tmp/tmpPBSHP3UF.tmp". Either 1) the file does not exist, or 2) we are not allowed to access the file, or 3) the pathname points to a broken symbolic link.
sbcl-1.0.58-linux-x86
(LOAD scriptl-util FAIL) ASDF:LOAD-SYSTEM-DEFINITION-ERROR : Error while trying to load definition for system scriptl-util from pathname /home/testgrid/cl-test-grid/work-dir/agent/quicklisp/dists/quicklisp/software/scriptl-20151031-git/scriptl-util.asd: Error while trying to load definition for system osicat from pathname /home/testgrid/cl-test-grid/work-dir/agent/quicklisp/dists/quicklisp/software/osicat-20160318-git/osicat.asd: Error while trying to load definition for system cffi-toolchain from pathname /home/testgrid/cl-test-grid/work-dir/agent/quicklisp/dists/quicklisp/software/cffi_0.17.1/cffi-toolchain.asd: CFFI-toolchain requires ASDF 3.1!
(LOAD scriptl-examples FAIL) ASDF:LOAD-SYSTEM-DEFINITION-ERROR : Error while trying to load definition for system scriptl-examples from pathname /home/testgrid/cl-test-grid/work-dir/agent/quicklisp/dists/quicklisp/software/scriptl-20151031-git/scriptl-examples.asd: Error while trying to load definition for system osicat from pathname /home/testgrid/cl-test-grid/work-dir/agent/quicklisp/dists/quicklisp/software/osicat-20160318-git/osicat.asd: Error while trying to load definition for system cffi-toolchain from pathname /home/testgrid/cl-test-grid/work-dir/agent/quicklisp/dists/quicklisp/software/cffi_0.17.1/cffi-toolchain.asd: CFFI-toolchain requires ASDF 3.1!
(LOAD scriptl FAIL) ASDF:LOAD-SYSTEM-DEFINITION-ERROR : Error while trying to load definition for system osicat from pathname /home/testgrid/cl-test-grid/work-dir/agent/quicklisp/dists/quicklisp/software/osicat-20160318-git/osicat.asd: Error while trying to load definition for system cffi-toolchain from pathname /home/testgrid/cl-test-grid/work-dir/agent/quicklisp/dists/quicklisp/software/cffi_0.17.1/cffi-toolchain.asd: CFFI-toolchain requires ASDF 3.1!
(LOAD scriptl-util FAIL) ASDF:LOAD-SYSTEM-DEFINITION-ERROR : Error while trying to load definition for system scriptl-util from pathname /home/testgrid/cl-test-grid/work-dir/agent/quicklisp/dists/quicklisp/software/scriptl-20151031-git/scriptl-util.asd: Error while trying to load definition for system osicat from pathname /home/testgrid/cl-test-grid/work-dir/agent/quicklisp/dists/quicklisp/software/osicat-20160208-git/osicat.asd: Error while invoking #<COMPILE-OP NIL {B947EE1}> on #<CL-SOURCE-FILE "uiop" "image">
(LOAD scriptl-examples FAIL) ASDF:LOAD-SYSTEM-DEFINITION-ERROR : Error while trying to load definition for system scriptl-examples from pathname /home/testgrid/cl-test-grid/work-dir/agent/quicklisp/dists/quicklisp/software/scriptl-20151031-git/scriptl-examples.asd: Error while trying to load definition for system osicat from pathname /home/testgrid/cl-test-grid/work-dir/agent/quicklisp/dists/quicklisp/software/osicat-20160208-git/osicat.asd: Error while invoking #<COMPILE-OP NIL {B947EE1}> on #<CL-SOURCE-FILE "uiop" "image">
(LOAD scriptl FAIL) ASDF:LOAD-SYSTEM-DEFINITION-ERROR : Error while trying to load definition for system osicat from pathname /home/testgrid/cl-test-grid/work-dir/agent/quicklisp/dists/quicklisp/software/osicat-20160208-git/osicat.asd: Error while invoking #<COMPILE-OP NIL {B99FCB1}> on #<CL-SOURCE-FILE "uiop" "image">
sbcl-1.1.11-linux-x86
(LOAD scriptl-util FAIL) ASDF/FIND-SYSTEM:LOAD-SYSTEM-DEFINITION-ERROR : Error while trying to load definition for system scriptl-util from pathname /home/testgrid/cl-test-grid/work-dir/agent/quicklisp/dists/quicklisp/software/scriptl-20151031-git/scriptl-util.asd: Error while trying to load definition for system bordeaux-threads from pathname /home/testgrid/cl-test-grid/work-dir/agent/quicklisp/dists/quicklisp/software/bordeaux-threads-v0.8.5/bordeaux-threads.asd: READ error during COMPILE-FILE: You need ASDF >= 3.1 to load this system correctly.(in form starting at line: 1, column: 0, file-position: 0)
(LOAD scriptl-examples FAIL) ASDF/FIND-SYSTEM:LOAD-SYSTEM-DEFINITION-ERROR : Error while trying to load definition for system scriptl-examples from pathname /home/testgrid/cl-test-grid/work-dir/agent/quicklisp/dists/quicklisp/software/scriptl-20151031-git/scriptl-examples.asd: Error while trying to load definition for system bordeaux-threads from pathname /home/testgrid/cl-test-grid/work-dir/agent/quicklisp/dists/quicklisp/software/bordeaux-threads-v0.8.5/bordeaux-threads.asd: READ error during COMPILE-FILE: You need ASDF >= 3.1 to load this system correctly.(in form starting at line: 1, column: 0, file-position: 0)
(LOAD scriptl FAIL) ASDF/FIND-SYSTEM:LOAD-SYSTEM-DEFINITION-ERROR : Error while trying to load definition for system bordeaux-threads from pathname /home/testgrid/cl-test-grid/work-dir/agent/quicklisp/dists/quicklisp/software/bordeaux-threads-v0.8.5/bordeaux-threads.asd: READ error during COMPILE-FILE: You need ASDF >= 3.1 to load this system correctly.(in form starting at line: 1, column: 0, file-position: 0)
(LOAD scriptl-util FAIL) ASDF/FIND-SYSTEM:LOAD-SYSTEM-DEFINITION-ERROR : Error while trying to load definition for system scriptl-util from pathname /home/testgrid/cl-test-grid/work-dir/agent/quicklisp/dists/quicklisp/software/scriptl-20151031-git/scriptl-util.asd: Error while trying to load definition for system iolib from pathname /home/testgrid/cl-test-grid/work-dir/agent/quicklisp/dists/quicklisp/software/iolib-20160208-git/iolib.asd: READ error during COMPILE-FILE: You need ASDF >= 3.1 to load this system correctly.(in form starting at line: 1, column: 0, file-position: 0)
(LOAD scriptl-examples FAIL) ASDF/FIND-SYSTEM:LOAD-SYSTEM-DEFINITION-ERROR : Error while trying to load definition for system scriptl-examples from pathname /home/testgrid/cl-test-grid/work-dir/agent/quicklisp/dists/quicklisp/software/scriptl-20151031-git/scriptl-examples.asd: Error while trying to load definition for system iolib from pathname /home/testgrid/cl-test-grid/work-dir/agent/quicklisp/dists/quicklisp/software/iolib-20160208-git/iolib.asd: READ error during COMPILE-FILE: You need ASDF >= 3.1 to load this system correctly.(in form starting at line: 1, column: 0, file-position: 0)
(LOAD scriptl FAIL) ASDF/FIND-SYSTEM:LOAD-SYSTEM-DEFINITION-ERROR : Error while trying to load definition for system iolib from pathname /home/testgrid/cl-test-grid/work-dir/agent/quicklisp/dists/quicklisp/software/iolib-20160208-git/iolib.asd: READ error during COMPILE-FILE: You need ASDF >= 3.1 to load this system correctly.(in form starting at line: 1, column: 0, file-position: 0)
sbcl-1.1.16-linux-x86
(LOAD scriptl-util FAIL) ASDF/FIND-SYSTEM:LOAD-SYSTEM-DEFINITION-ERROR : Error while trying to load definition for system scriptl-util from pathname /home/testgrid/cl-test-grid/work-dir/agent/quicklisp/dists/quicklisp/software/scriptl-20151031-git/scriptl-util.asd: Error while trying to load definition for system bordeaux-threads from pathname /home/testgrid/cl-test-grid/work-dir/agent/quicklisp/dists/quicklisp/software/bordeaux-threads-v0.8.5/bordeaux-threads.asd: READ error during LOAD: You need ASDF >= 3.1 to load this system correctly.(in form starting at line: 1, column: 0, file-position: 0)
(LOAD scriptl-examples FAIL) ASDF/FIND-SYSTEM:LOAD-SYSTEM-DEFINITION-ERROR : Error while trying to load definition for system scriptl-examples from pathname /home/testgrid/cl-test-grid/work-dir/agent/quicklisp/dists/quicklisp/software/scriptl-20151031-git/scriptl-examples.asd: Error while trying to load definition for system bordeaux-threads from pathname /home/testgrid/cl-test-grid/work-dir/agent/quicklisp/dists/quicklisp/software/bordeaux-threads-v0.8.5/bordeaux-threads.asd: READ error during LOAD: You need ASDF >= 3.1 to load this system correctly.(in form starting at line: 1, column: 0, file-position: 0)
(LOAD scriptl FAIL) ASDF/FIND-SYSTEM:LOAD-SYSTEM-DEFINITION-ERROR : Error while trying to load definition for system bordeaux-threads from pathname /home/testgrid/cl-test-grid/work-dir/agent/quicklisp/dists/quicklisp/software/bordeaux-threads-v0.8.5/bordeaux-threads.asd: READ error during LOAD: You need ASDF >= 3.1 to load this system correctly.(in form starting at line: 1, column: 0, file-position: 0)
(LOAD scriptl-util FAIL) ASDF/FIND-SYSTEM:LOAD-SYSTEM-DEFINITION-ERROR : Error while trying to load definition for system scriptl-util from pathname /home/testgrid/cl-test-grid/work-dir/agent/quicklisp/dists/quicklisp/software/scriptl-20151031-git/scriptl-util.asd: Error while trying to load definition for system iolib from pathname /home/testgrid/cl-test-grid/work-dir/agent/quicklisp/dists/quicklisp/software/iolib-20160208-git/iolib.asd: READ error during LOAD: You need ASDF >= 3.1 to load this system correctly.(in form starting at line: 1, column: 0, file-position: 0)
(LOAD scriptl-examples FAIL) ASDF/FIND-SYSTEM:LOAD-SYSTEM-DEFINITION-ERROR : Error while trying to load definition for system scriptl-examples from pathname /home/testgrid/cl-test-grid/work-dir/agent/quicklisp/dists/quicklisp/software/scriptl-20151031-git/scriptl-examples.asd: Error while trying to load definition for system iolib from pathname /home/testgrid/cl-test-grid/work-dir/agent/quicklisp/dists/quicklisp/software/iolib-20160208-git/iolib.asd: READ error during LOAD: You need ASDF >= 3.1 to load this system correctly.(in form starting at line: 1, column: 0, file-position: 0)
(LOAD scriptl FAIL) ASDF/FIND-SYSTEM:LOAD-SYSTEM-DEFINITION-ERROR : Error while trying to load definition for system iolib from pathname /home/testgrid/cl-test-grid/work-dir/agent/quicklisp/dists/quicklisp/software/iolib-20160208-git/iolib.asd: READ error during LOAD: You need ASDF >= 3.1 to load this system correctly.(in form starting at line: 1, column: 0, file-position: 0)
sbcl-1.2.14-linux-arm
(LOAD scriptl-util FAIL) ASDF/FIND-SYSTEM:LOAD-SYSTEM-DEFINITION-ERROR : Error while trying to load definition for system scriptl-util from pathname /home/testgrid/cl-test-grid/work-dir/agent/quicklisp/dists/quicklisp/software/scriptl-20151031-git/scriptl-util.asd: Error while trying to load definition for system osicat from pathname /home/testgrid/cl-test-grid/work-dir/agent/quicklisp/dists/quicklisp/software/osicat-20160318-git/osicat.asd: COMPILE-FILE-ERROR while compiling #<CL-SOURCE-FILE "cffi-toolchain" "toolchain" "c-toolchain">
(LOAD scriptl-examples FAIL) ASDF/FIND-SYSTEM:LOAD-SYSTEM-DEFINITION-ERROR : Error while trying to load definition for system scriptl-examples from pathname /home/testgrid/cl-test-grid/work-dir/agent/quicklisp/dists/quicklisp/software/scriptl-20151031-git/scriptl-examples.asd: Error while trying to load definition for system osicat from pathname /home/testgrid/cl-test-grid/work-dir/agent/quicklisp/dists/quicklisp/software/osicat-20160318-git/osicat.asd: COMPILE-FILE-ERROR while compiling #<CL-SOURCE-FILE "cffi-toolchain" "toolchain" "c-toolchain">
(LOAD scriptl FAIL) ASDF/FIND-SYSTEM:LOAD-SYSTEM-DEFINITION-ERROR : Error while trying to load definition for system osicat from pathname /home/testgrid/cl-test-grid/work-dir/agent/quicklisp/dists/quicklisp/software/osicat-20160318-git/osicat.asd: COMPILE-FILE-ERROR while compiling #<CL-SOURCE-FILE "cffi-toolchain" "toolchain" "c-toolchain">
sbcl-1.2.3-linux-x64
(LOAD scriptl-util FAIL) ASDF/FIND-SYSTEM:LOAD-SYSTEM-DEFINITION-ERROR : Error while trying to load definition for system scriptl-util from pathname /home/hijarian/systems/cl-test-grid/work-dir/agent/quicklisp/dists/quicklisp/software/scriptl-20151031-git/scriptl-util.asd: Error while trying to load definition for system osicat from pathname /home/hijarian/systems/cl-test-grid/work-dir/agent/quicklisp/dists/quicklisp/software/osicat-20160318-git/osicat.asd: COMPILE-FILE-ERROR while compiling #<CL-SOURCE-FILE "cffi-toolchain" "toolchain" "asdf-compat">
(LOAD scriptl-examples FAIL) ASDF/FIND-SYSTEM:LOAD-SYSTEM-DEFINITION-ERROR : Error while trying to load definition for system scriptl-examples from pathname /home/hijarian/systems/cl-test-grid/work-dir/agent/quicklisp/dists/quicklisp/software/scriptl-20151031-git/scriptl-examples.asd: Error while trying to load definition for system osicat from pathname /home/hijarian/systems/cl-test-grid/work-dir/agent/quicklisp/dists/quicklisp/software/osicat-20160318-git/osicat.asd: COMPILE-FILE-ERROR while compiling #<CL-SOURCE-FILE "cffi-toolchain" "toolchain" "asdf-compat">
(LOAD scriptl FAIL) ASDF/FIND-SYSTEM:LOAD-SYSTEM-DEFINITION-ERROR : Error while trying to load definition for system osicat from pathname /home/hijarian/systems/cl-test-grid/work-dir/agent/quicklisp/dists/quicklisp/software/osicat-20160318-git/osicat.asd: COMPILE-FILE-ERROR while compiling #<CL-SOURCE-FILE "cffi-toolchain" "toolchain" "asdf-compat">
(LOAD scriptl-util FAIL) ASDF/FIND-SYSTEM:LOAD-SYSTEM-DEFINITION-ERROR : Error while trying to load definition for system scriptl-util from pathname /home/hijarian/systems/cl-test-grid/work-dir/agent/quicklisp/dists/quicklisp/software/scriptl-20151031-git/scriptl-util.asd: External process exited with code 1. Command was: "g++" "-m64" "-Wno-write-strings" "-I/home/hijarian/systems/cl-test-grid/work-dir/agent/quicklisp/dists/quicklisp/software/iolib-20160208-git/src/grovel/" "-o" "/home/hijarian/systems/cl-test-grid/work-dir/agent/test-runs/20160309091525-sbcl-1.2.3-linux-x64/fasl/ql/dists/quicklisp/software/iolib-20160208-git/src/syscalls/ffi-types-unix" "/home/hijarian/systems/cl-test-grid/work-dir/agent/test-runs/20160309091525-sbcl-1.2.3-linux-x64/fasl/ql/dists/quicklisp/software/iolib-20160208-git/src/syscalls/ffi-types-unix.c" Output was: Error output was: /home/hijarian/systems/cl-test-grid/work-dir/agent/test-runs/20160309091525-sbcl-1.2.3-linux-x64/fasl/ql/dists/quicklisp/software/iolib-20160208-git/src/syscalls/ffi-types-unix.c:14:17: fatal error: lfp.h: Нет такого файла или каталога compilation terminated.
(LOAD scriptl-examples FAIL) ASDF/FIND-SYSTEM:LOAD-SYSTEM-DEFINITION-ERROR : Error while trying to load definition for system scriptl-examples from pathname /home/hijarian/systems/cl-test-grid/work-dir/agent/quicklisp/dists/quicklisp/software/scriptl-20151031-git/scriptl-examples.asd: External process exited with code 1. Command was: "g++" "-m64" "-Wno-write-strings" "-I/home/hijarian/systems/cl-test-grid/work-dir/agent/quicklisp/dists/quicklisp/software/iolib-20160208-git/src/grovel/" "-o" "/home/hijarian/systems/cl-test-grid/work-dir/agent/test-runs/20160309091525-sbcl-1.2.3-linux-x64/fasl/ql/dists/quicklisp/software/iolib-20160208-git/src/syscalls/ffi-types-unix" "/home/hijarian/systems/cl-test-grid/work-dir/agent/test-runs/20160309091525-sbcl-1.2.3-linux-x64/fasl/ql/dists/quicklisp/software/iolib-20160208-git/src/syscalls/ffi-types-unix.c" Output was: Error output was: /home/hijarian/systems/cl-test-grid/work-dir/agent/test-runs/20160309091525-sbcl-1.2.3-linux-x64/fasl/ql/dists/quicklisp/software/iolib-20160208-git/src/syscalls/ffi-types-unix.c:14:17: fatal error: lfp.h: Нет такого файла или каталога compilation terminated.
(LOAD scriptl FAIL) IOLIB/GROVEL::GROVEL-ERROR : External process exited with code 1. Command was: "g++" "-m64" "-Wno-write-strings" "-I/home/hijarian/systems/cl-test-grid/work-dir/agent/quicklisp/dists/quicklisp/software/iolib-20160208-git/src/grovel/" "-o" "/home/hijarian/systems/cl-test-grid/work-dir/agent/test-runs/20160309091525-sbcl-1.2.3-linux-x64/fasl/ql/dists/quicklisp/software/iolib-20160208-git/src/syscalls/ffi-types-unix" "/home/hijarian/systems/cl-test-grid/work-dir/agent/test-runs/20160309091525-sbcl-1.2.3-linux-x64/fasl/ql/dists/quicklisp/software/iolib-20160208-git/src/syscalls/ffi-types-unix.c" Output was: Error output was: /home/hijarian/systems/cl-test-grid/work-dir/agent/test-runs/20160309091525-sbcl-1.2.3-linux-x64/fasl/ql/dists/quicklisp/software/iolib-20160208-git/src/syscalls/ffi-types-unix.c:14:17: fatal error: lfp.h: Нет такого файла или каталога compilation terminated.
(LOAD scriptl-util FAIL) ASDF/FIND-SYSTEM:LOAD-SYSTEM-DEFINITION-ERROR : Error while trying to load definition for system scriptl-util from pathname /home/hijarian/systems/cl-test-grid/work-dir/agent/quicklisp/dists/quicklisp/software/scriptl-20151031-git/scriptl-util.asd: External process exited with code 1. Command was: "g++" "-m64" "-Wno-write-strings" "-I/home/hijarian/systems/cl-test-grid/work-dir/agent/quicklisp/dists/quicklisp/software/iolib-20160208-git/src/grovel/" "-o" "/home/hijarian/systems/cl-test-grid/work-dir/agent/test-runs/20160306151126-sbcl-1.2.3-linux-x64/fasl/ql/dists/quicklisp/software/iolib-20160208-git/src/syscalls/ffi-types-unix" "/home/hijarian/systems/cl-test-grid/work-dir/agent/test-runs/20160306151126-sbcl-1.2.3-linux-x64/fasl/ql/dists/quicklisp/software/iolib-20160208-git/src/syscalls/ffi-types-unix.c" Output was: Error output was: /home/hijarian/systems/cl-test-grid/work-dir/agent/test-runs/20160306151126-sbcl-1.2.3-linux-x64/fasl/ql/dists/quicklisp/software/iolib-20160208-git/src/syscalls/ffi-types-unix.c:14:17: fatal error: lfp.h: Нет такого файла или каталога compilation terminated.
(LOAD scriptl-examples FAIL) ASDF/FIND-SYSTEM:LOAD-SYSTEM-DEFINITION-ERROR : Error while trying to load definition for system scriptl-examples from pathname /home/hijarian/systems/cl-test-grid/work-dir/agent/quicklisp/dists/quicklisp/software/scriptl-20151031-git/scriptl-examples.asd: External process exited with code 1. Command was: "g++" "-m64" "-Wno-write-strings" "-I/home/hijarian/systems/cl-test-grid/work-dir/agent/quicklisp/dists/quicklisp/software/iolib-20160208-git/src/grovel/" "-o" "/home/hijarian/systems/cl-test-grid/work-dir/agent/test-runs/20160306151126-sbcl-1.2.3-linux-x64/fasl/ql/dists/quicklisp/software/iolib-20160208-git/src/syscalls/ffi-types-unix" "/home/hijarian/systems/cl-test-grid/work-dir/agent/test-runs/20160306151126-sbcl-1.2.3-linux-x64/fasl/ql/dists/quicklisp/software/iolib-20160208-git/src/syscalls/ffi-types-unix.c" Output was: Error output was: /home/hijarian/systems/cl-test-grid/work-dir/agent/test-runs/20160306151126-sbcl-1.2.3-linux-x64/fasl/ql/dists/quicklisp/software/iolib-20160208-git/src/syscalls/ffi-types-unix.c:14:17: fatal error: lfp.h: Нет такого файла или каталога compilation terminated.
(LOAD scriptl FAIL) IOLIB/GROVEL::GROVEL-ERROR : External process exited with code 1. Command was: "g++" "-m64" "-Wno-write-strings" "-I/home/hijarian/systems/cl-test-grid/work-dir/agent/quicklisp/dists/quicklisp/software/iolib-20160208-git/src/grovel/" "-o" "/home/hijarian/systems/cl-test-grid/work-dir/agent/test-runs/20160306151126-sbcl-1.2.3-linux-x64/fasl/ql/dists/quicklisp/software/iolib-20160208-git/src/syscalls/ffi-types-unix" "/home/hijarian/systems/cl-test-grid/work-dir/agent/test-runs/20160306151126-sbcl-1.2.3-linux-x64/fasl/ql/dists/quicklisp/software/iolib-20160208-git/src/syscalls/ffi-types-unix.c" Output was: Error output was: /home/hijarian/systems/cl-test-grid/work-dir/agent/test-runs/20160306151126-sbcl-1.2.3-linux-x64/fasl/ql/dists/quicklisp/software/iolib-20160208-git/src/syscalls/ffi-types-unix.c:14:17: fatal error: lfp.h: Нет такого файла или каталога compilation terminated.
(LOAD scriptl-util FAIL) ASDF/FIND-SYSTEM:LOAD-SYSTEM-DEFINITION-ERROR : Error while trying to load definition for system scriptl-util from pathname /home/hijarian/systems/cl-test-grid/work-dir/agent/quicklisp/dists/quicklisp/software/scriptl-20151031-git/scriptl-util.asd: External process exited with code 1. Command was: "g++" "-m64" "-Wno-write-strings" "-I/home/hijarian/systems/cl-test-grid/work-dir/agent/quicklisp/dists/quicklisp/software/iolib-20160208-git/src/grovel/" "-o" "/home/hijarian/systems/cl-test-grid/work-dir/agent/test-runs/20160215081554-sbcl-1.2.3-linux-x64/fasl/ql/dists/quicklisp/software/iolib-20160208-git/src/syscalls/ffi-types-unix" "/home/hijarian/systems/cl-test-grid/work-dir/agent/test-runs/20160215081554-sbcl-1.2.3-linux-x64/fasl/ql/dists/quicklisp/software/iolib-20160208-git/src/syscalls/ffi-types-unix.c" Output was: Error output was: /home/hijarian/systems/cl-test-grid/work-dir/agent/test-runs/20160215081554-sbcl-1.2.3-linux-x64/fasl/ql/dists/quicklisp/software/iolib-20160208-git/src/syscalls/ffi-types-unix.c:14:17: fatal error: lfp.h: Нет такого файла или каталога #include <lfp.h> ^ compilation terminated.
(LOAD scriptl-examples FAIL) ASDF/FIND-SYSTEM:LOAD-SYSTEM-DEFINITION-ERROR : Error while trying to load definition for system scriptl-examples from pathname /home/hijarian/systems/cl-test-grid/work-dir/agent/quicklisp/dists/quicklisp/software/scriptl-20151031-git/scriptl-examples.asd: External process exited with code 1. Command was: "g++" "-m64" "-Wno-write-strings" "-I/home/hijarian/systems/cl-test-grid/work-dir/agent/quicklisp/dists/quicklisp/software/iolib-20160208-git/src/grovel/" "-o" "/home/hijarian/systems/cl-test-grid/work-dir/agent/test-runs/20160215081554-sbcl-1.2.3-linux-x64/fasl/ql/dists/quicklisp/software/iolib-20160208-git/src/syscalls/ffi-types-unix" "/home/hijarian/systems/cl-test-grid/work-dir/agent/test-runs/20160215081554-sbcl-1.2.3-linux-x64/fasl/ql/dists/quicklisp/software/iolib-20160208-git/src/syscalls/ffi-types-unix.c" Output was: Error output was: /home/hijarian/systems/cl-test-grid/work-dir/agent/test-runs/20160215081554-sbcl-1.2.3-linux-x64/fasl/ql/dists/quicklisp/software/iolib-20160208-git/src/syscalls/ffi-types-unix.c:14:17: fatal error: lfp.h: Нет такого файла или каталога #include <lfp.h> ^ compilation terminated.
(LOAD scriptl FAIL) IOLIB/GROVEL::GROVEL-ERROR : External process exited with code 1. Command was: "g++" "-m64" "-Wno-write-strings" "-I/home/hijarian/systems/cl-test-grid/work-dir/agent/quicklisp/dists/quicklisp/software/iolib-20160208-git/src/grovel/" "-o" "/home/hijarian/systems/cl-test-grid/work-dir/agent/test-runs/20160215081554-sbcl-1.2.3-linux-x64/fasl/ql/dists/quicklisp/software/iolib-20160208-git/src/syscalls/ffi-types-unix" "/home/hijarian/systems/cl-test-grid/work-dir/agent/test-runs/20160215081554-sbcl-1.2.3-linux-x64/fasl/ql/dists/quicklisp/software/iolib-20160208-git/src/syscalls/ffi-types-unix.c" Output was: Error output was: /home/hijarian/systems/cl-test-grid/work-dir/agent/test-runs/20160215081554-sbcl-1.2.3-linux-x64/fasl/ql/dists/quicklisp/software/iolib-20160208-git/src/syscalls/ffi-types-unix.c:14:17: fatal error: lfp.h: Нет такого файла или каталога #include <lfp.h> ^ compilation terminated.
sbcl-1.2.6-linux-x86
sbcl-1.3.2.92-4077405-macosx-x64
(LOAD scriptl-util FAIL) ASDF/FIND-SYSTEM:LOAD-SYSTEM-DEFINITION-ERROR : Error while trying to load definition for system scriptl-util from pathname /Users/testgrid/cl-test-grid/work-dir/agent/quicklisp/dists/quicklisp/software/scriptl-20151031-git/scriptl-util.asd: External process exited with code 1. Command was: "g++" "-m64" "-Wno-write-strings" "-I" "/opt/local/include/" "-I/Users/testgrid/cl-test-grid/work-dir/agent/quicklisp/dists/quicklisp/software/iolib-20160208-git/src/grovel/" "-o" "/Users/testgrid/cl-test-grid/work-dir/agent/test-runs/20160220052250-sbcl-1.3.2.92-4077405-macosx-x64/fasl/ql/dists/quicklisp/software/iolib-20160208-git/src/syscalls/ffi-types-unix" "/Users/testgrid/cl-test-grid/work-dir/agent/test-runs/20160220052250-sbcl-1.3.2.92-4077405-macosx-x64/fasl/ql/dists/quicklisp/software/iolib-20160208-git/src/syscalls/ffi-types-unix.c" Output was: Error output was: clang: warning: treating 'c' input as 'c++' when in C++ mode, this behavior is deprecated /Users/testgrid/cl-test-grid/work-dir/agent/test-runs/20160220052250-sbcl-1.3.2.92-4077405-macosx-x64/fasl/ql/dists/quicklisp/software/iolib-20160208-git/src/syscalls/ffi-types-unix.c:6:10: fatal error: 'lfp.h' file not found #include <lfp.h> ^ 1 error generated.
(LOAD scriptl-examples FAIL) ASDF/FIND-SYSTEM:LOAD-SYSTEM-DEFINITION-ERROR : Error while trying to load definition for system scriptl-examples from pathname /Users/testgrid/cl-test-grid/work-dir/agent/quicklisp/dists/quicklisp/software/scriptl-20151031-git/scriptl-examples.asd: External process exited with code 1. Command was: "g++" "-m64" "-Wno-write-strings" "-I" "/opt/local/include/" "-I/Users/testgrid/cl-test-grid/work-dir/agent/quicklisp/dists/quicklisp/software/iolib-20160208-git/src/grovel/" "-o" "/Users/testgrid/cl-test-grid/work-dir/agent/test-runs/20160220052250-sbcl-1.3.2.92-4077405-macosx-x64/fasl/ql/dists/quicklisp/software/iolib-20160208-git/src/syscalls/ffi-types-unix" "/Users/testgrid/cl-test-grid/work-dir/agent/test-runs/20160220052250-sbcl-1.3.2.92-4077405-macosx-x64/fasl/ql/dists/quicklisp/software/iolib-20160208-git/src/syscalls/ffi-types-unix.c" Output was: Error output was: clang: warning: treating 'c' input as 'c++' when in C++ mode, this behavior is deprecated /Users/testgrid/cl-test-grid/work-dir/agent/test-runs/20160220052250-sbcl-1.3.2.92-4077405-macosx-x64/fasl/ql/dists/quicklisp/software/iolib-20160208-git/src/syscalls/ffi-types-unix.c:6:10: fatal error: 'lfp.h' file not found #include <lfp.h> ^ 1 error generated.
(LOAD scriptl FAIL) IOLIB/GROVEL::GROVEL-ERROR : External process exited with code 1. Command was: "g++" "-m64" "-Wno-write-strings" "-I" "/opt/local/include/" "-I/Users/testgrid/cl-test-grid/work-dir/agent/quicklisp/dists/quicklisp/software/iolib-20160208-git/src/grovel/" "-o" "/Users/testgrid/cl-test-grid/work-dir/agent/test-runs/20160220052250-sbcl-1.3.2.92-4077405-macosx-x64/fasl/ql/dists/quicklisp/software/iolib-20160208-git/src/syscalls/ffi-types-unix" "/Users/testgrid/cl-test-grid/work-dir/agent/test-runs/20160220052250-sbcl-1.3.2.92-4077405-macosx-x64/fasl/ql/dists/quicklisp/software/iolib-20160208-git/src/syscalls/ffi-types-unix.c" Output was: Error output was: clang: warning: treating 'c' input as 'c++' when in C++ mode, this behavior is deprecated /Users/testgrid/cl-test-grid/work-dir/agent/test-runs/20160220052250-sbcl-1.3.2.92-4077405-macosx-x64/fasl/ql/dists/quicklisp/software/iolib-20160208-git/src/syscalls/ffi-types-unix.c:6:10: fatal error: 'lfp.h' file not found #include <lfp.h> ^ 1 error generated.

Breakdown by testcases: for every failed testcase the lisp implmentations it fails on

The library does not have a testsuite adapter for CL Test Grid.

To reports overview

Generated at: 2016-04-17 01:09:13 GMT.