rutils results collected by cl-test-grid

Results on the last two Quicklisp distributions

 quicklisp 2016-03-18quicklisp 2016-02-08
abcl-1.2.1-fasl42-linux-x86
(LOAD rutilsx FAIL) ASDF/FIND-SYSTEM:LOAD-SYSTEM-DEFINITION-ERROR : Error while trying to load definition for system rutilsx from pathname /home/testgrid/cl-test-grid/work-dir/agent/quicklisp/dists/quicklisp/software/rutils-20160208-git/rutilsx.asd: Unrecognized keyword argument :AT.
(LOAD rutils-test FAIL) ASDF/FIND-SYSTEM:LOAD-SYSTEM-DEFINITION-ERROR : Error while trying to load definition for system rutils from pathname /home/testgrid/cl-test-grid/work-dir/agent/quicklisp/dists/quicklisp/software/rutils-20160208-git/rutils.asd: Unrecognized keyword argument :AT.
(LOAD rutils FAIL) ASDF/FIND-SYSTEM:LOAD-SYSTEM-DEFINITION-ERROR : Error while trying to load definition for system rutils from pathname /home/testgrid/cl-test-grid/work-dir/agent/quicklisp/dists/quicklisp/software/rutils-20160208-git/rutils.asd: Unrecognized keyword argument :AT.
(LOAD rutilsx FAIL) ASDF/FIND-SYSTEM:LOAD-SYSTEM-DEFINITION-ERROR : Error while trying to load definition for system rutilsx from pathname /home/testgrid/cl-test-grid/work-dir/agent/quicklisp/dists/quicklisp/software/rutils-20160208-git/rutilsx.asd: Unrecognized keyword argument :AT.
(LOAD rutils-test FAIL) ASDF/FIND-SYSTEM:LOAD-SYSTEM-DEFINITION-ERROR : Error while trying to load definition for system rutils from pathname /home/testgrid/cl-test-grid/work-dir/agent/quicklisp/dists/quicklisp/software/rutils-20160208-git/rutils.asd: Unrecognized keyword argument :AT.
(LOAD rutils FAIL) ASDF/FIND-SYSTEM:LOAD-SYSTEM-DEFINITION-ERROR : Error while trying to load definition for system rutils from pathname /home/testgrid/cl-test-grid/work-dir/agent/quicklisp/dists/quicklisp/software/rutils-20160208-git/rutils.asd: Unrecognized keyword argument :AT.
abcl-1.3.0-fasl42-linux-x86
(LOAD rutils-test FAIL) ASDF/FIND-SYSTEM:LOAD-SYSTEM-DEFINITION-ERROR : Error while trying to load definition for system osicat from pathname /home/testgrid/cl-test-grid/work-dir/agent/quicklisp/dists/quicklisp/software/osicat-20160318-git/osicat.asd: Component "asdf" does not match version 3.1.2, required by #<ASDF/SYSTEM:SYSTEM "cffi-toolchain">
abcl-1.3.1-fasl42-linux-x86
(LOAD rutils-test FAIL) ASDF/FIND-SYSTEM:LOAD-SYSTEM-DEFINITION-ERROR : Error while trying to load definition for system osicat from pathname /home/testgrid/cl-test-grid/work-dir/agent/quicklisp/dists/quicklisp/software/osicat-20160318-git/osicat.asd: Component "asdf" does not match version 3.1.2, required by #<ASDF/SYSTEM:SYSTEM "cffi-toolchain">
abcl-1.3.2-fasl42-linux-x86
ccl-1.10-r16196-f101-linux-arm
ccl-1.10-r16196-f96-linux-x64
(LOAD rutils-test FAIL) CCL::SIMPLE-PROGRAM-ERROR : Invalid program: In the form ((OS-UNIX-P) NIL), (OS-UNIX-P) is not a symbol or lambda expression.
ccl-1.10-r16196-f96-linux-x86
ccl-1.11-r16635-f96-linux-x86
ccl-1.11-r16635-f96-macosx-x64
(LOAD rutils-test FAIL) ffi-grovel, CFFI-GROVEL:GROVEL-ERROR : External process exited with code 1. Command was: "cc" "-m64" "-I" "/opt/local/include/" "-I/Users/testgrid/cl-test-grid/work-dir/agent/quicklisp/dists/quicklisp/software/cffi_0.16.1/" "-bundle" "-fPIC" "-o" "/Users/testgrid/cl-test-grid/work-dir/agent/test-runs/20160220010916-ccl-1.11-r16635-f96-macosx-x64/fasl/ql/dists/quicklisp/software/osicat-20160208-git/posix/libosicat.dylib" "/Users/testgrid/cl-test-grid/work-dir/agent/test-runs/20160220010916-ccl-1.11-r16635-f96-macosx-x64/fasl/ql/dists/quicklisp/software/osicat-20160208-git/posix/wrappers.c" Output was: /Users/testgrid/cl-test-grid/work-dir/agent/test-runs/20160220010916-ccl-1.11-r16635-f96-macosx-x64/fasl/ql/dists/quicklisp/software/osicat-20160208-git/posix/wrappers.c:113:10: warning: implicit declaration of function 'posix_fallocate' is invalid in C99 [-Wimplicit-function-declaration] return posix_fallocate(fd, offset, length); ^ 1 warning generated. Undefined symbols for architecture x86_64: "_posix_fallocate", referenced from: _posix_fallocate_cffi_wrap in wrappers-c32f91.o (maybe you meant: _posix_fallocate_cffi_wrap) ld: symbol(s) not found for architecture x86_64 clang: error: linker command failed with exit code 1 (use -v to see invocation)
ccl-1.11-r16635-f96-macosx-x86
(LOAD rutils-test FAIL) ffi-grovel, CFFI-GROVEL:GROVEL-ERROR : External process exited with code 1. Command was: "cc" "-m32" "-I" "/opt/local/include/" "-I/Users/testgrid/cl-test-grid/work-dir/agent/quicklisp/dists/quicklisp/software/cffi_0.16.1/" "-bundle" "-fPIC" "-o" "/Users/testgrid/cl-test-grid/work-dir/agent/test-runs/20160219210452-ccl-1.11-r16635-f96-macosx-x86/fasl/ql/dists/quicklisp/software/osicat-20160208-git/posix/libosicat.dylib" "/Users/testgrid/cl-test-grid/work-dir/agent/test-runs/20160219210452-ccl-1.11-r16635-f96-macosx-x86/fasl/ql/dists/quicklisp/software/osicat-20160208-git/posix/wrappers.c" Output was: /Users/testgrid/cl-test-grid/work-dir/agent/test-runs/20160219210452-ccl-1.11-r16635-f96-macosx-x86/fasl/ql/dists/quicklisp/software/osicat-20160208-git/posix/wrappers.c:113:10: warning: implicit declaration of function 'posix_fallocate' is invalid in C99 [-Wimplicit-function-declaration] return posix_fallocate(fd, offset, length); ^ 1 warning generated. Undefined symbols for architecture i386: "_posix_fallocate", referenced from: _posix_fallocate_cffi_wrap in wrappers-e24f86.o (maybe you meant: _posix_fallocate_cffi_wrap) ld: symbol(s) not found for architecture i386 clang: error: linker command failed with exit code 1 (use -v to see invocation)
ccl-1.11-r16702m-f101-linux-arm
ccl-1.11-rc1-r16536-f101-linux-arm
ccl-1.11-rc1-r16536-f96-linux-x86
ccl-1.8-r15286m-f95-linux-x86
(LOAD rutilsx FAIL) needs newer ASDF, ASDF:LOAD-SYSTEM-DEFINITION-ERROR : Error while trying to load definition for system named-readtables from pathname /home/testgrid/cl-test-grid/work-dir/agent/quicklisp/dists/quicklisp/software/named-readtables-20150923-git/named-readtables.asd: :MAILTO is an invalid initarg to REINITIALIZE-INSTANCE for #<STANDARD-CLASS SYSTEM>. Valid initargs: (:NAME :VERSION :DESCRIPTION :LONG-DESCRIPTION :IN-ORDER-TO :DO-FIRST :PARENT :PATHNAME :AROUND-COMPILE :ENCODING :PROPERTIES :COMPONENTS :IF-COMPONENT-DEP-FAILS :DEFAULT-COMPONENT-CLASS :AUTHOR :MAINTAINER :LICENCE :LICENSE :SOURCE-FILE :DEFSYSTEM-DEPENDS-ON).
(LOAD rutils-test FAIL) ASDF:LOAD-SYSTEM-DEFINITION-ERROR : Error while trying to load definition for system osicat from pathname /home/testgrid/cl-test-grid/work-dir/agent/quicklisp/dists/quicklisp/software/osicat-20160318-git/osicat.asd: Error while trying to load definition for system cffi-toolchain from pathname /home/testgrid/cl-test-grid/work-dir/agent/quicklisp/dists/quicklisp/software/cffi_0.17.1/cffi-toolchain.asd: CFFI-toolchain requires ASDF 3.1!
(LOAD rutils FAIL) needs newer ASDF, ASDF:LOAD-SYSTEM-DEFINITION-ERROR : Error while trying to load definition for system named-readtables from pathname /home/testgrid/cl-test-grid/work-dir/agent/quicklisp/dists/quicklisp/software/named-readtables-20150923-git/named-readtables.asd: :MAILTO is an invalid initarg to REINITIALIZE-INSTANCE for #<STANDARD-CLASS SYSTEM>. Valid initargs: (:NAME :VERSION :DESCRIPTION :LONG-DESCRIPTION :IN-ORDER-TO :DO-FIRST :PARENT :PATHNAME :AROUND-COMPILE :ENCODING :PROPERTIES :COMPONENTS :IF-COMPONENT-DEP-FAILS :DEFAULT-COMPONENT-CLASS :AUTHOR :MAINTAINER :LICENCE :LICENSE :SOURCE-FILE :DEFSYSTEM-DEPENDS-ON).
(LOAD rutilsx FAIL) needs newer ASDF, ASDF:LOAD-SYSTEM-DEFINITION-ERROR : Error while trying to load definition for system named-readtables from pathname /home/testgrid/cl-test-grid/work-dir/agent/quicklisp/dists/quicklisp/software/named-readtables-20150923-git/named-readtables.asd: :MAILTO is an invalid initarg to REINITIALIZE-INSTANCE for #<STANDARD-CLASS SYSTEM>. Valid initargs: (:NAME :VERSION :DESCRIPTION :LONG-DESCRIPTION :IN-ORDER-TO :DO-FIRST :PARENT :PATHNAME :AROUND-COMPILE :ENCODING :PROPERTIES :COMPONENTS :IF-COMPONENT-DEP-FAILS :DEFAULT-COMPONENT-CLASS :AUTHOR :MAINTAINER :LICENCE :LICENSE :SOURCE-FILE :DEFSYSTEM-DEPENDS-ON).
(LOAD rutils-test FAIL) needs newer ASDF, ASDF:LOAD-SYSTEM-DEFINITION-ERROR : Error while trying to load definition for system named-readtables from pathname /home/testgrid/cl-test-grid/work-dir/agent/quicklisp/dists/quicklisp/software/named-readtables-20150923-git/named-readtables.asd: :MAILTO is an invalid initarg to REINITIALIZE-INSTANCE for #<STANDARD-CLASS SYSTEM>. Valid initargs: (:NAME :VERSION :DESCRIPTION :LONG-DESCRIPTION :IN-ORDER-TO :DO-FIRST :PARENT :PATHNAME :AROUND-COMPILE :ENCODING :PROPERTIES :COMPONENTS :IF-COMPONENT-DEP-FAILS :DEFAULT-COMPONENT-CLASS :AUTHOR :MAINTAINER :LICENCE :LICENSE :SOURCE-FILE :DEFSYSTEM-DEPENDS-ON).
(LOAD rutils FAIL) needs newer ASDF, ASDF:LOAD-SYSTEM-DEFINITION-ERROR : Error while trying to load definition for system named-readtables from pathname /home/testgrid/cl-test-grid/work-dir/agent/quicklisp/dists/quicklisp/software/named-readtables-20150923-git/named-readtables.asd: :MAILTO is an invalid initarg to REINITIALIZE-INSTANCE for #<STANDARD-CLASS SYSTEM>. Valid initargs: (:NAME :VERSION :DESCRIPTION :LONG-DESCRIPTION :IN-ORDER-TO :DO-FIRST :PARENT :PATHNAME :AROUND-COMPILE :ENCODING :PROPERTIES :COMPONENTS :IF-COMPONENT-DEP-FAILS :DEFAULT-COMPONENT-CLASS :AUTHOR :MAINTAINER :LICENCE :LICENSE :SOURCE-FILE :DEFSYSTEM-DEPENDS-ON).
ccl-1.8-r15286m-f97-linux-arm
(LOAD rutilsx FAIL) needs newer ASDF, ASDF:LOAD-SYSTEM-DEFINITION-ERROR : Error while trying to load definition for system named-readtables from pathname /home/testgrid/cl-test-grid/work-dir/agent/quicklisp/dists/quicklisp/software/named-readtables-20150923-git/named-readtables.asd: :MAILTO is an invalid initarg to REINITIALIZE-INSTANCE for #<STANDARD-CLASS SYSTEM>. Valid initargs: (:NAME :VERSION :DESCRIPTION :LONG-DESCRIPTION :IN-ORDER-TO :DO-FIRST :PARENT :PATHNAME :AROUND-COMPILE :ENCODING :PROPERTIES :COMPONENTS :IF-COMPONENT-DEP-FAILS :DEFAULT-COMPONENT-CLASS :AUTHOR :MAINTAINER :LICENCE :LICENSE :SOURCE-FILE :DEFSYSTEM-DEPENDS-ON).
(LOAD rutils-test FAIL) ASDF:LOAD-SYSTEM-DEFINITION-ERROR : Error while trying to load definition for system osicat from pathname /home/testgrid/cl-test-grid/work-dir/agent/quicklisp/dists/quicklisp/software/osicat-20160318-git/osicat.asd: Error while trying to load definition for system cffi-toolchain from pathname /home/testgrid/cl-test-grid/work-dir/agent/quicklisp/dists/quicklisp/software/cffi_0.17.1/cffi-toolchain.asd: CFFI-toolchain requires ASDF 3.1!
(LOAD rutils FAIL) needs newer ASDF, ASDF:LOAD-SYSTEM-DEFINITION-ERROR : Error while trying to load definition for system named-readtables from pathname /home/testgrid/cl-test-grid/work-dir/agent/quicklisp/dists/quicklisp/software/named-readtables-20150923-git/named-readtables.asd: :MAILTO is an invalid initarg to REINITIALIZE-INSTANCE for #<STANDARD-CLASS SYSTEM>. Valid initargs: (:NAME :VERSION :DESCRIPTION :LONG-DESCRIPTION :IN-ORDER-TO :DO-FIRST :PARENT :PATHNAME :AROUND-COMPILE :ENCODING :PROPERTIES :COMPONENTS :IF-COMPONENT-DEP-FAILS :DEFAULT-COMPONENT-CLASS :AUTHOR :MAINTAINER :LICENCE :LICENSE :SOURCE-FILE :DEFSYSTEM-DEPENDS-ON).
(LOAD rutilsx FAIL) needs newer ASDF, ASDF:LOAD-SYSTEM-DEFINITION-ERROR : Error while trying to load definition for system named-readtables from pathname /home/testgrid/cl-test-grid/work-dir/agent/quicklisp/dists/quicklisp/software/named-readtables-20150923-git/named-readtables.asd: :MAILTO is an invalid initarg to REINITIALIZE-INSTANCE for #<STANDARD-CLASS SYSTEM>. Valid initargs: (:NAME :VERSION :DESCRIPTION :LONG-DESCRIPTION :IN-ORDER-TO :DO-FIRST :PARENT :PATHNAME :AROUND-COMPILE :ENCODING :PROPERTIES :COMPONENTS :IF-COMPONENT-DEP-FAILS :DEFAULT-COMPONENT-CLASS :AUTHOR :MAINTAINER :LICENCE :LICENSE :SOURCE-FILE :DEFSYSTEM-DEPENDS-ON).
(LOAD rutils-test FAIL) needs newer ASDF, ASDF:LOAD-SYSTEM-DEFINITION-ERROR : Error while trying to load definition for system named-readtables from pathname /home/testgrid/cl-test-grid/work-dir/agent/quicklisp/dists/quicklisp/software/named-readtables-20150923-git/named-readtables.asd: :MAILTO is an invalid initarg to REINITIALIZE-INSTANCE for #<STANDARD-CLASS SYSTEM>. Valid initargs: (:NAME :VERSION :DESCRIPTION :LONG-DESCRIPTION :IN-ORDER-TO :DO-FIRST :PARENT :PATHNAME :AROUND-COMPILE :ENCODING :PROPERTIES :COMPONENTS :IF-COMPONENT-DEP-FAILS :DEFAULT-COMPONENT-CLASS :AUTHOR :MAINTAINER :LICENCE :LICENSE :SOURCE-FILE :DEFSYSTEM-DEPENDS-ON).
(LOAD rutils FAIL) needs newer ASDF, ASDF:LOAD-SYSTEM-DEFINITION-ERROR : Error while trying to load definition for system named-readtables from pathname /home/testgrid/cl-test-grid/work-dir/agent/quicklisp/dists/quicklisp/software/named-readtables-20150923-git/named-readtables.asd: :MAILTO is an invalid initarg to REINITIALIZE-INSTANCE for #<STANDARD-CLASS SYSTEM>. Valid initargs: (:NAME :VERSION :DESCRIPTION :LONG-DESCRIPTION :IN-ORDER-TO :DO-FIRST :PARENT :PATHNAME :AROUND-COMPILE :ENCODING :PROPERTIES :COMPONENTS :IF-COMPONENT-DEP-FAILS :DEFAULT-COMPONENT-CLASS :AUTHOR :MAINTAINER :LICENCE :LICENSE :SOURCE-FILE :DEFSYSTEM-DEPENDS-ON).
ccl-1.9-r15756-f96-linux-x86
(LOAD rutilsx FAIL) needs newer ASDF, ASDF/FIND-SYSTEM:LOAD-SYSTEM-DEFINITION-ERROR : Error while trying to load definition for system rutilsx from pathname /home/testgrid/cl-test-grid/work-dir/agent/quicklisp/dists/quicklisp/software/rutils-20160208-git/rutilsx.asd: Incorrect keyword arguments in (:AT 1) .
(LOAD rutils-test FAIL) needs newer ASDF, ASDF/FIND-SYSTEM:LOAD-SYSTEM-DEFINITION-ERROR : Error while trying to load definition for system rutils from pathname /home/testgrid/cl-test-grid/work-dir/agent/quicklisp/dists/quicklisp/software/rutils-20160208-git/rutils.asd: Incorrect keyword arguments in (:AT 0) .
(LOAD rutils FAIL) needs newer ASDF, ASDF/FIND-SYSTEM:LOAD-SYSTEM-DEFINITION-ERROR : Error while trying to load definition for system rutils from pathname /home/testgrid/cl-test-grid/work-dir/agent/quicklisp/dists/quicklisp/software/rutils-20160208-git/rutils.asd: Incorrect keyword arguments in (:AT 0) .
(LOAD rutilsx FAIL) needs newer ASDF, ASDF/FIND-SYSTEM:LOAD-SYSTEM-DEFINITION-ERROR : Error while trying to load definition for system rutilsx from pathname /home/testgrid/cl-test-grid/work-dir/agent/quicklisp/dists/quicklisp/software/rutils-20160208-git/rutilsx.asd: Incorrect keyword arguments in (:AT 1) .
(LOAD rutils-test FAIL) needs newer ASDF, ASDF/FIND-SYSTEM:LOAD-SYSTEM-DEFINITION-ERROR : Error while trying to load definition for system rutils from pathname /home/testgrid/cl-test-grid/work-dir/agent/quicklisp/dists/quicklisp/software/rutils-20160208-git/rutils.asd: Incorrect keyword arguments in (:AT 0) .
(LOAD rutils FAIL) needs newer ASDF, ASDF/FIND-SYSTEM:LOAD-SYSTEM-DEFINITION-ERROR : Error while trying to load definition for system rutils from pathname /home/testgrid/cl-test-grid/work-dir/agent/quicklisp/dists/quicklisp/software/rutils-20160208-git/rutils.asd: Incorrect keyword arguments in (:AT 0) .
ccl-1.9-r15767-f99-linux-arm
(LOAD rutilsx FAIL) needs newer ASDF, ASDF/FIND-SYSTEM:LOAD-SYSTEM-DEFINITION-ERROR : Error while trying to load definition for system rutilsx from pathname /home/testgrid/cl-test-grid/work-dir/agent/quicklisp/dists/quicklisp/software/rutils-20160208-git/rutilsx.asd: Incorrect keyword arguments in (:AT 1) .
(LOAD rutils-test FAIL) needs newer ASDF, ASDF/FIND-SYSTEM:LOAD-SYSTEM-DEFINITION-ERROR : Error while trying to load definition for system rutils from pathname /home/testgrid/cl-test-grid/work-dir/agent/quicklisp/dists/quicklisp/software/rutils-20160208-git/rutils.asd: Incorrect keyword arguments in (:AT 0) .
(LOAD rutils FAIL) needs newer ASDF, ASDF/FIND-SYSTEM:LOAD-SYSTEM-DEFINITION-ERROR : Error while trying to load definition for system rutils from pathname /home/testgrid/cl-test-grid/work-dir/agent/quicklisp/dists/quicklisp/software/rutils-20160208-git/rutils.asd: Incorrect keyword arguments in (:AT 0) .
(LOAD rutilsx FAIL) needs newer ASDF, ASDF/FIND-SYSTEM:LOAD-SYSTEM-DEFINITION-ERROR : Error while trying to load definition for system rutilsx from pathname /home/testgrid/cl-test-grid/work-dir/agent/quicklisp/dists/quicklisp/software/rutils-20160208-git/rutilsx.asd: Incorrect keyword arguments in (:AT 1) .
(LOAD rutils-test FAIL) needs newer ASDF, ASDF/FIND-SYSTEM:LOAD-SYSTEM-DEFINITION-ERROR : Error while trying to load definition for system rutils from pathname /home/testgrid/cl-test-grid/work-dir/agent/quicklisp/dists/quicklisp/software/rutils-20160208-git/rutils.asd: Incorrect keyword arguments in (:AT 0) .
(LOAD rutils FAIL) needs newer ASDF, ASDF/FIND-SYSTEM:LOAD-SYSTEM-DEFINITION-ERROR : Error while trying to load definition for system rutils from pathname /home/testgrid/cl-test-grid/work-dir/agent/quicklisp/dists/quicklisp/software/rutils-20160208-git/rutils.asd: Incorrect keyword arguments in (:AT 0) .
clisp-2.49-unix-armv7l
(LOAD rutilsx FAIL) needs newer ASDF, ASDF:LOAD-SYSTEM-DEFINITION-ERROR : Error while trying to load definition for system named-readtables from pathname /home/testgrid/cl-test-grid/work-dir/agent/quicklisp/dists/quicklisp/software/named-readtables-20150923-git/named-readtables.asd: REINITIALIZE-INSTANCE: illegal keyword/value pair :MAILTO, "mega@retes.hu" in argument list. The allowed keywords are (:NAME :VERSION :IN-ORDER-TO :DO-FIRST :PARENT :PATHNAME :AROUND-COMPILE :ENCODING :PROPERTIES :COMPONENTS :IF-COMPONENT-DEP-FAILS :DEFAULT-COMPONENT-CLASS :DESCRIPTION :LONG-DESCRIPTION :AUTHOR :MAINTAINER :LICENCE :LICENSE :SOURCE-FILE :DEFSYSTEM-DEPENDS-ON)
(LOAD rutils-test FAIL) ASDF:LOAD-SYSTEM-DEFINITION-ERROR : Error while trying to load definition for system osicat from pathname /home/testgrid/cl-test-grid/work-dir/agent/quicklisp/dists/quicklisp/software/osicat-20160318-git/osicat.asd: Error while trying to load definition for system cffi-toolchain from pathname /home/testgrid/cl-test-grid/work-dir/agent/quicklisp/dists/quicklisp/software/cffi_0.17.1/cffi-toolchain.asd: CFFI-toolchain requires ASDF 3.1!
(LOAD rutils FAIL) needs newer ASDF, ASDF:LOAD-SYSTEM-DEFINITION-ERROR : Error while trying to load definition for system named-readtables from pathname /home/testgrid/cl-test-grid/work-dir/agent/quicklisp/dists/quicklisp/software/named-readtables-20150923-git/named-readtables.asd: REINITIALIZE-INSTANCE: illegal keyword/value pair :MAILTO, "mega@retes.hu" in argument list. The allowed keywords are (:NAME :VERSION :IN-ORDER-TO :DO-FIRST :PARENT :PATHNAME :AROUND-COMPILE :ENCODING :PROPERTIES :COMPONENTS :IF-COMPONENT-DEP-FAILS :DEFAULT-COMPONENT-CLASS :DESCRIPTION :LONG-DESCRIPTION :AUTHOR :MAINTAINER :LICENCE :LICENSE :SOURCE-FILE :DEFSYSTEM-DEPENDS-ON)
(LOAD rutilsx FAIL) needs newer ASDF, ASDF:LOAD-SYSTEM-DEFINITION-ERROR : Error while trying to load definition for system named-readtables from pathname /home/testgrid/cl-test-grid/work-dir/agent/quicklisp/dists/quicklisp/software/named-readtables-20150923-git/named-readtables.asd: REINITIALIZE-INSTANCE: illegal keyword/value pair :MAILTO, "mega@retes.hu" in argument list. The allowed keywords are (:NAME :VERSION :IN-ORDER-TO :DO-FIRST :PARENT :PATHNAME :AROUND-COMPILE :ENCODING :PROPERTIES :COMPONENTS :IF-COMPONENT-DEP-FAILS :DEFAULT-COMPONENT-CLASS :DESCRIPTION :LONG-DESCRIPTION :AUTHOR :MAINTAINER :LICENCE :LICENSE :SOURCE-FILE :DEFSYSTEM-DEPENDS-ON)
(LOAD rutils-test FAIL) needs newer ASDF, ASDF:LOAD-SYSTEM-DEFINITION-ERROR : Error while trying to load definition for system named-readtables from pathname /home/testgrid/cl-test-grid/work-dir/agent/quicklisp/dists/quicklisp/software/named-readtables-20150923-git/named-readtables.asd: REINITIALIZE-INSTANCE: illegal keyword/value pair :MAILTO, "mega@retes.hu" in argument list. The allowed keywords are (:NAME :VERSION :IN-ORDER-TO :DO-FIRST :PARENT :PATHNAME :AROUND-COMPILE :ENCODING :PROPERTIES :COMPONENTS :IF-COMPONENT-DEP-FAILS :DEFAULT-COMPONENT-CLASS :DESCRIPTION :LONG-DESCRIPTION :AUTHOR :MAINTAINER :LICENCE :LICENSE :SOURCE-FILE :DEFSYSTEM-DEPENDS-ON)
(LOAD rutils FAIL) needs newer ASDF, ASDF:LOAD-SYSTEM-DEFINITION-ERROR : Error while trying to load definition for system named-readtables from pathname /home/testgrid/cl-test-grid/work-dir/agent/quicklisp/dists/quicklisp/software/named-readtables-20150923-git/named-readtables.asd: REINITIALIZE-INSTANCE: illegal keyword/value pair :MAILTO, "mega@retes.hu" in argument list. The allowed keywords are (:NAME :VERSION :IN-ORDER-TO :DO-FIRST :PARENT :PATHNAME :AROUND-COMPILE :ENCODING :PROPERTIES :COMPONENTS :IF-COMPONENT-DEP-FAILS :DEFAULT-COMPONENT-CLASS :DESCRIPTION :LONG-DESCRIPTION :AUTHOR :MAINTAINER :LICENCE :LICENSE :SOURCE-FILE :DEFSYSTEM-DEPENDS-ON)
clisp-2.49-unix-x86
(LOAD rutilsx FAIL) needs newer ASDF, ASDF:LOAD-SYSTEM-DEFINITION-ERROR : Error while trying to load definition for system named-readtables from pathname /home/testgrid/cl-test-grid/work-dir/agent/quicklisp/dists/quicklisp/software/named-readtables-20150923-git/named-readtables.asd: REINITIALIZE-INSTANCE: illegal keyword/value pair :MAILTO, "mega@retes.hu" in argument list. The allowed keywords are (:NAME :VERSION :IN-ORDER-TO :DO-FIRST :PARENT :PATHNAME :AROUND-COMPILE :ENCODING :PROPERTIES :COMPONENTS :IF-COMPONENT-DEP-FAILS :DEFAULT-COMPONENT-CLASS :DESCRIPTION :LONG-DESCRIPTION :AUTHOR :MAINTAINER :LICENCE :LICENSE :SOURCE-FILE :DEFSYSTEM-DEPENDS-ON)
(LOAD rutils-test FAIL) ASDF:LOAD-SYSTEM-DEFINITION-ERROR : Error while trying to load definition for system osicat from pathname /home/testgrid/cl-test-grid/work-dir/agent/quicklisp/dists/quicklisp/software/osicat-20160318-git/osicat.asd: Error while trying to load definition for system cffi-toolchain from pathname /home/testgrid/cl-test-grid/work-dir/agent/quicklisp/dists/quicklisp/software/cffi_0.17.1/cffi-toolchain.asd: CFFI-toolchain requires ASDF 3.1!
(LOAD rutils FAIL) needs newer ASDF, ASDF:LOAD-SYSTEM-DEFINITION-ERROR : Error while trying to load definition for system named-readtables from pathname /home/testgrid/cl-test-grid/work-dir/agent/quicklisp/dists/quicklisp/software/named-readtables-20150923-git/named-readtables.asd: REINITIALIZE-INSTANCE: illegal keyword/value pair :MAILTO, "mega@retes.hu" in argument list. The allowed keywords are (:NAME :VERSION :IN-ORDER-TO :DO-FIRST :PARENT :PATHNAME :AROUND-COMPILE :ENCODING :PROPERTIES :COMPONENTS :IF-COMPONENT-DEP-FAILS :DEFAULT-COMPONENT-CLASS :DESCRIPTION :LONG-DESCRIPTION :AUTHOR :MAINTAINER :LICENCE :LICENSE :SOURCE-FILE :DEFSYSTEM-DEPENDS-ON)
(LOAD rutilsx FAIL) needs newer ASDF, ASDF:LOAD-SYSTEM-DEFINITION-ERROR : Error while trying to load definition for system named-readtables from pathname /home/testgrid/cl-test-grid/work-dir/agent/quicklisp/dists/quicklisp/software/named-readtables-20150923-git/named-readtables.asd: REINITIALIZE-INSTANCE: illegal keyword/value pair :MAILTO, "mega@retes.hu" in argument list. The allowed keywords are (:NAME :VERSION :IN-ORDER-TO :DO-FIRST :PARENT :PATHNAME :AROUND-COMPILE :ENCODING :PROPERTIES :COMPONENTS :IF-COMPONENT-DEP-FAILS :DEFAULT-COMPONENT-CLASS :DESCRIPTION :LONG-DESCRIPTION :AUTHOR :MAINTAINER :LICENCE :LICENSE :SOURCE-FILE :DEFSYSTEM-DEPENDS-ON)
(LOAD rutils-test FAIL) needs newer ASDF, ASDF:LOAD-SYSTEM-DEFINITION-ERROR : Error while trying to load definition for system named-readtables from pathname /home/testgrid/cl-test-grid/work-dir/agent/quicklisp/dists/quicklisp/software/named-readtables-20150923-git/named-readtables.asd: REINITIALIZE-INSTANCE: illegal keyword/value pair :MAILTO, "mega@retes.hu" in argument list. The allowed keywords are (:NAME :VERSION :IN-ORDER-TO :DO-FIRST :PARENT :PATHNAME :AROUND-COMPILE :ENCODING :PROPERTIES :COMPONENTS :IF-COMPONENT-DEP-FAILS :DEFAULT-COMPONENT-CLASS :DESCRIPTION :LONG-DESCRIPTION :AUTHOR :MAINTAINER :LICENCE :LICENSE :SOURCE-FILE :DEFSYSTEM-DEPENDS-ON)
(LOAD rutils FAIL) needs newer ASDF, ASDF:LOAD-SYSTEM-DEFINITION-ERROR : Error while trying to load definition for system named-readtables from pathname /home/testgrid/cl-test-grid/work-dir/agent/quicklisp/dists/quicklisp/software/named-readtables-20150923-git/named-readtables.asd: REINITIALIZE-INSTANCE: illegal keyword/value pair :MAILTO, "mega@retes.hu" in argument list. The allowed keywords are (:NAME :VERSION :IN-ORDER-TO :DO-FIRST :PARENT :PATHNAME :AROUND-COMPILE :ENCODING :PROPERTIES :COMPONENTS :IF-COMPONENT-DEP-FAILS :DEFAULT-COMPONENT-CLASS :DESCRIPTION :LONG-DESCRIPTION :AUTHOR :MAINTAINER :LICENCE :LICENSE :SOURCE-FILE :DEFSYSTEM-DEPENDS-ON)
cmu-snapshot-2013-04__20d_unicode_-linux-x86
(LOAD rutilsx FAIL) ASDF/FIND-SYSTEM:LOAD-SYSTEM-DEFINITION-ERROR : Error while trying to load definition for system rutilsx from pathname /home/testgrid/cl-test-grid/work-dir/agent/quicklisp/dists/quicklisp/software/rutils-20160208-git/rutilsx.asd: Unknown keyword: :AT
(LOAD rutils-test FAIL) ASDF/FIND-SYSTEM:LOAD-SYSTEM-DEFINITION-ERROR : Error while trying to load definition for system rutils from pathname /home/testgrid/cl-test-grid/work-dir/agent/quicklisp/dists/quicklisp/software/rutils-20160208-git/rutils.asd: Unknown keyword: :AT
(LOAD rutils FAIL) ASDF/FIND-SYSTEM:LOAD-SYSTEM-DEFINITION-ERROR : Error while trying to load definition for system rutils from pathname /home/testgrid/cl-test-grid/work-dir/agent/quicklisp/dists/quicklisp/software/rutils-20160208-git/rutils.asd: Unknown keyword: :AT
(LOAD rutilsx FAIL) ASDF/FIND-SYSTEM:LOAD-SYSTEM-DEFINITION-ERROR : Error while trying to load definition for system rutilsx from pathname /home/testgrid/cl-test-grid/work-dir/agent/quicklisp/dists/quicklisp/software/rutils-20160208-git/rutilsx.asd: Unknown keyword: :AT
(LOAD rutils-test FAIL) ASDF/FIND-SYSTEM:LOAD-SYSTEM-DEFINITION-ERROR : Error while trying to load definition for system rutils from pathname /home/testgrid/cl-test-grid/work-dir/agent/quicklisp/dists/quicklisp/software/rutils-20160208-git/rutils.asd: Unknown keyword: :AT
(LOAD rutils FAIL) ASDF/FIND-SYSTEM:LOAD-SYSTEM-DEFINITION-ERROR : Error while trying to load definition for system rutils from pathname /home/testgrid/cl-test-grid/work-dir/agent/quicklisp/dists/quicklisp/software/rutils-20160208-git/rutils.asd: Unknown keyword: :AT
cmu-snapshot-2014-01__20e_unicode_-linux-x86
(LOAD rutilsx FAIL) C::COMPILER-ERROR : (during macroexpansion) Error in function LISP::ASSERT-ERROR: The assertion (OR (NULL OPTS) (EQ (POP TYPE-LIST) '&OPTIONAL)) failed.
(LOAD rutils-test FAIL) ASDF/FIND-SYSTEM:LOAD-SYSTEM-DEFINITION-ERROR : Error while trying to load definition for system osicat from pathname /home/testgrid/cl-test-grid/work-dir/agent/quicklisp/dists/quicklisp/software/osicat-20160318-git/osicat.asd: Error while trying to load definition for system cffi-toolchain from pathname /home/testgrid/cl-test-grid/work-dir/agent/quicklisp/dists/quicklisp/software/cffi_0.17.1/cffi-toolchain.asd: Error in function LISP::SLOLOAD: CFFI-toolchain requires ASDF 3.1!
(LOAD rutils FAIL) C::COMPILER-ERROR : (during macroexpansion) Error in function LISP::ASSERT-ERROR: The assertion (OR (NULL OPTS) (EQ (POP TYPE-LIST) '&OPTIONAL)) failed.
(LOAD rutilsx FAIL) C::COMPILER-ERROR : (during macroexpansion) Error in function LISP::ASSERT-ERROR: The assertion (OR (NULL OPTS) (EQ (POP TYPE-LIST) '&OPTIONAL)) failed.
(LOAD rutils-test FAIL) C::COMPILER-ERROR : (during macroexpansion) Error in function LISP::ASSERT-ERROR: The assertion (OR (NULL OPTS) (EQ (POP TYPE-LIST) '&OPTIONAL)) failed.
(LOAD rutils FAIL) C::COMPILER-ERROR : (during macroexpansion) Error in function LISP::ASSERT-ERROR: The assertion (OR (NULL OPTS) (EQ (POP TYPE-LIST) '&OPTIONAL)) failed.
cmu-snapshot-2014-05-dirty__20e_unicode_-linux-x86
(LOAD rutilsx FAIL) C::COMPILER-ERROR : (during macroexpansion) Error in function LISP::ASSERT-ERROR: The assertion (OR (NULL OPTS) (EQ (POP TYPE-LIST) '&OPTIONAL)) failed.
(LOAD rutils-test FAIL) ASDF/FIND-SYSTEM:LOAD-SYSTEM-DEFINITION-ERROR : Error while trying to load definition for system osicat from pathname /home/testgrid/cl-test-grid/work-dir/agent/quicklisp/dists/quicklisp/software/osicat-20160318-git/osicat.asd: Error while trying to load definition for system cffi-toolchain from pathname /home/testgrid/cl-test-grid/work-dir/agent/quicklisp/dists/quicklisp/software/cffi_0.17.1/cffi-toolchain.asd: Error in function LISP::SLOLOAD: CFFI-toolchain requires ASDF 3.1!
(LOAD rutils FAIL) C::COMPILER-ERROR : (during macroexpansion) Error in function LISP::ASSERT-ERROR: The assertion (OR (NULL OPTS) (EQ (POP TYPE-LIST) '&OPTIONAL)) failed.
(LOAD rutilsx FAIL) C::COMPILER-ERROR : (during macroexpansion) Error in function LISP::ASSERT-ERROR: The assertion (OR (NULL OPTS) (EQ (POP TYPE-LIST) '&OPTIONAL)) failed.
(LOAD rutils-test FAIL) C::COMPILER-ERROR : (during macroexpansion) Error in function LISP::ASSERT-ERROR: The assertion (OR (NULL OPTS) (EQ (POP TYPE-LIST) '&OPTIONAL)) failed.
(LOAD rutils FAIL) C::COMPILER-ERROR : (during macroexpansion) Error in function LISP::ASSERT-ERROR: The assertion (OR (NULL OPTS) (EQ (POP TYPE-LIST) '&OPTIONAL)) failed.
cmu-snapshot-2014-12___20f_unicode_-linux-x86
(LOAD rutilsx FAIL) C::COMPILER-ERROR : (during macroexpansion) Error in function LISP::ASSERT-ERROR: The assertion (OR (NULL OPTS) (EQ (POP TYPE-LIST) '&OPTIONAL)) failed.
(LOAD rutils-test FAIL) ASDF/FIND-SYSTEM:LOAD-SYSTEM-DEFINITION-ERROR : Error while trying to load definition for system osicat from pathname /home/testgrid/cl-test-grid/work-dir/agent/quicklisp/dists/quicklisp/software/osicat-20160318-git/osicat.asd: (during macroexpansion) Error in FDEFINITION: the function GATHER-TYPE is undefined.
(LOAD rutils FAIL) C::COMPILER-ERROR : (during macroexpansion) Error in function LISP::ASSERT-ERROR: The assertion (OR (NULL OPTS) (EQ (POP TYPE-LIST) '&OPTIONAL)) failed.
(LOAD rutilsx FAIL) C::COMPILER-ERROR : (during macroexpansion) Error in function LISP::ASSERT-ERROR: The assertion (OR (NULL OPTS) (EQ (POP TYPE-LIST) '&OPTIONAL)) failed.
(LOAD rutils-test FAIL) C::COMPILER-ERROR : (during macroexpansion) Error in function LISP::ASSERT-ERROR: The assertion (OR (NULL OPTS) (EQ (POP TYPE-LIST) '&OPTIONAL)) failed.
(LOAD rutils FAIL) C::COMPILER-ERROR : (during macroexpansion) Error in function LISP::ASSERT-ERROR: The assertion (OR (NULL OPTS) (EQ (POP TYPE-LIST) '&OPTIONAL)) failed.
ecl-13.5.1-unknown-linux-i686-bytecode
(LOAD rutilsx FAIL) needs newer ASDF, ASDF/FIND-SYSTEM:LOAD-SYSTEM-DEFINITION-ERROR : Error while trying to load definition for system rutilsx from pathname /home/testgrid/cl-test-grid/work-dir/agent/quicklisp/dists/quicklisp/software/rutils-20160208-git/rutilsx.asd: In form (PROGN (LOAD #P"/home/testgrid/cl-test-grid/work-dir/agent/quicklisp/setup.lisp") (LOAD #P"/home/testgrid/cl-test-grid/agent/proc-common.lisp") (LOAD #P"/home/testgrid/cl-test-grid/agent/proc-common-asdf.lisp") (LOAD #P"/home/testgrid/cl-test-grid/agent/proc-test-loading.lisp") (COMMON-LISP-USER::SET-RESPONSE #P"/home/testgrid/cl-test-grid/work-dir/agent/response9376117735572865441.lisp" (COMMON-LISP-USER::TEST-LOADING-MAIN #P"/home/testgrid/cl-test-grid/work-dir/agent/test-runs/20160324052213-ecl-13.5.1-unknown-linux-i686-bytecode/logs/rutilsx-load" "rutilsx" #P"/home/testgrid/cl-test-grid/work-dir/agent/quicklisp/" #P"/home/testgrid/cl-test-grid/work-dir/agent/test-runs/20160324052213-ecl-13.5.1-unknown-linux-i686-bytecode/fasl/"))) Unknown keyword :AT
(LOAD rutils-test FAIL) needs newer ASDF, ASDF/FIND-SYSTEM:LOAD-SYSTEM-DEFINITION-ERROR : Error while trying to load definition for system rutils from pathname /home/testgrid/cl-test-grid/work-dir/agent/quicklisp/dists/quicklisp/software/rutils-20160208-git/rutils.asd: In form (PROGN (LOAD #P"/home/testgrid/cl-test-grid/work-dir/agent/quicklisp/setup.lisp") (LOAD #P"/home/testgrid/cl-test-grid/agent/proc-common.lisp") (LOAD #P"/home/testgrid/cl-test-grid/agent/proc-common-asdf.lisp") (LOAD #P"/home/testgrid/cl-test-grid/agent/proc-test-loading.lisp") (COMMON-LISP-USER::SET-RESPONSE #P"/home/testgrid/cl-test-grid/work-dir/agent/response17398536287593853501.lisp" (COMMON-LISP-USER::TEST-LOADING-MAIN #P"/home/testgrid/cl-test-grid/work-dir/agent/test-runs/20160324052213-ecl-13.5.1-unknown-linux-i686-bytecode/logs/rutils-test-load" "rutils-test" #P"/home/testgrid/cl-test-grid/work-dir/agent/quicklisp/" #P"/home/testgrid/cl-test-grid/work-dir/agent/test-runs/20160324052213-ecl-13.5.1-unknown-linux-i686-bytecode/fasl/"))) Unknown keyword :AT
(LOAD rutils FAIL) needs newer ASDF, ASDF/FIND-SYSTEM:LOAD-SYSTEM-DEFINITION-ERROR : Error while trying to load definition for system rutils from pathname /home/testgrid/cl-test-grid/work-dir/agent/quicklisp/dists/quicklisp/software/rutils-20160208-git/rutils.asd: In form (PROGN (LOAD #P"/home/testgrid/cl-test-grid/work-dir/agent/quicklisp/setup.lisp") (LOAD #P"/home/testgrid/cl-test-grid/agent/proc-common.lisp") (LOAD #P"/home/testgrid/cl-test-grid/agent/proc-common-asdf.lisp") (LOAD #P"/home/testgrid/cl-test-grid/agent/proc-test-loading.lisp") (COMMON-LISP-USER::SET-RESPONSE #P"/home/testgrid/cl-test-grid/work-dir/agent/response17772844044886597320.lisp" (COMMON-LISP-USER::TEST-LOADING-MAIN #P"/home/testgrid/cl-test-grid/work-dir/agent/test-runs/20160324052213-ecl-13.5.1-unknown-linux-i686-bytecode/logs/rutils-load" "rutils" #P"/home/testgrid/cl-test-grid/work-dir/agent/quicklisp/" #P"/home/testgrid/cl-test-grid/work-dir/agent/test-runs/20160324052213-ecl-13.5.1-unknown-linux-i686-bytecode/fasl/"))) Unknown keyword :AT
ecl-13.5.1-unknown-linux-i686-lisp-to-c
(LOAD rutilsx FAIL) needs newer ASDF, ASDF/FIND-SYSTEM:LOAD-SYSTEM-DEFINITION-ERROR : Error while trying to load definition for system rutilsx from pathname /home/testgrid/cl-test-grid/work-dir/agent/quicklisp/dists/quicklisp/software/rutils-20160208-git/rutilsx.asd: In form (PROGN (LOAD #P"/home/testgrid/cl-test-grid/work-dir/agent/quicklisp/setup.lisp") (LOAD #P"/home/testgrid/cl-test-grid/agent/proc-common.lisp") (LOAD #P"/home/testgrid/cl-test-grid/agent/proc-common-asdf.lisp") (LOAD #P"/home/testgrid/cl-test-grid/agent/proc-test-loading.lisp") (COMMON-LISP-USER::SET-RESPONSE #P"/home/testgrid/cl-test-grid/work-dir/agent/response12383192426120679247.lisp" (COMMON-LISP-USER::TEST-LOADING-MAIN #P"/home/testgrid/cl-test-grid/work-dir/agent/test-runs/20160324084450-ecl-13.5.1-unknown-linux-i686-lisp-to-c/logs/rutilsx-load" "rutilsx" #P"/home/testgrid/cl-test-grid/work-dir/agent/quicklisp/" #P"/home/testgrid/cl-test-grid/work-dir/agent/test-runs/20160324084450-ecl-13.5.1-unknown-linux-i686-lisp-to-c/fasl/"))) Unknown keyword :AT
(LOAD rutils-test FAIL) needs newer ASDF, ASDF/FIND-SYSTEM:LOAD-SYSTEM-DEFINITION-ERROR : Error while trying to load definition for system rutils from pathname /home/testgrid/cl-test-grid/work-dir/agent/quicklisp/dists/quicklisp/software/rutils-20160208-git/rutils.asd: In form (PROGN (LOAD #P"/home/testgrid/cl-test-grid/work-dir/agent/quicklisp/setup.lisp") (LOAD #P"/home/testgrid/cl-test-grid/agent/proc-common.lisp") (LOAD #P"/home/testgrid/cl-test-grid/agent/proc-common-asdf.lisp") (LOAD #P"/home/testgrid/cl-test-grid/agent/proc-test-loading.lisp") (COMMON-LISP-USER::SET-RESPONSE #P"/home/testgrid/cl-test-grid/work-dir/agent/response9518960617986887549.lisp" (COMMON-LISP-USER::TEST-LOADING-MAIN #P"/home/testgrid/cl-test-grid/work-dir/agent/test-runs/20160324084450-ecl-13.5.1-unknown-linux-i686-lisp-to-c/logs/rutils-test-load" "rutils-test" #P"/home/testgrid/cl-test-grid/work-dir/agent/quicklisp/" #P"/home/testgrid/cl-test-grid/work-dir/agent/test-runs/20160324084450-ecl-13.5.1-unknown-linux-i686-lisp-to-c/fasl/"))) Unknown keyword :AT
(LOAD rutils FAIL) needs newer ASDF, ASDF/FIND-SYSTEM:LOAD-SYSTEM-DEFINITION-ERROR : Error while trying to load definition for system rutils from pathname /home/testgrid/cl-test-grid/work-dir/agent/quicklisp/dists/quicklisp/software/rutils-20160208-git/rutils.asd: In form (PROGN (LOAD #P"/home/testgrid/cl-test-grid/work-dir/agent/quicklisp/setup.lisp") (LOAD #P"/home/testgrid/cl-test-grid/agent/proc-common.lisp") (LOAD #P"/home/testgrid/cl-test-grid/agent/proc-common-asdf.lisp") (LOAD #P"/home/testgrid/cl-test-grid/agent/proc-test-loading.lisp") (COMMON-LISP-USER::SET-RESPONSE #P"/home/testgrid/cl-test-grid/work-dir/agent/response7652971083341440502.lisp" (COMMON-LISP-USER::TEST-LOADING-MAIN #P"/home/testgrid/cl-test-grid/work-dir/agent/test-runs/20160324084450-ecl-13.5.1-unknown-linux-i686-lisp-to-c/logs/rutils-load" "rutils" #P"/home/testgrid/cl-test-grid/work-dir/agent/quicklisp/" #P"/home/testgrid/cl-test-grid/work-dir/agent/test-runs/20160324084450-ecl-13.5.1-unknown-linux-i686-lisp-to-c/fasl/"))) Unknown keyword :AT
(LOAD rutilsx FAIL) needs newer ASDF, ASDF/FIND-SYSTEM:LOAD-SYSTEM-DEFINITION-ERROR : Error while trying to load definition for system rutilsx from pathname /home/testgrid/cl-test-grid/work-dir/agent/quicklisp/dists/quicklisp/software/rutils-20160208-git/rutilsx.asd: In form (PROGN (LOAD #P"/home/testgrid/cl-test-grid/work-dir/agent/quicklisp/setup.lisp") (LOAD #P"/home/testgrid/cl-test-grid/agent/proc-common.lisp") (LOAD #P"/home/testgrid/cl-test-grid/agent/proc-common-asdf.lisp") (LOAD #P"/home/testgrid/cl-test-grid/agent/proc-test-loading.lisp") (COMMON-LISP-USER::SET-RESPONSE #P"/home/testgrid/cl-test-grid/work-dir/agent/response11683609714665087692.lisp" (COMMON-LISP-USER::TEST-LOADING-MAIN #P"/home/testgrid/cl-test-grid/work-dir/agent/test-runs/20160215035056-ecl-13.5.1-unknown-linux-i686-lisp-to-c/logs/rutilsx-load" "rutilsx" #P"/home/testgrid/cl-test-grid/work-dir/agent/quicklisp/" #P"/home/testgrid/cl-test-grid/work-dir/agent/test-runs/20160215035056-ecl-13.5.1-unknown-linux-i686-lisp-to-c/fasl/"))) Unknown keyword :AT
(LOAD rutils-test FAIL) needs newer ASDF, ASDF/FIND-SYSTEM:LOAD-SYSTEM-DEFINITION-ERROR : Error while trying to load definition for system rutils from pathname /home/testgrid/cl-test-grid/work-dir/agent/quicklisp/dists/quicklisp/software/rutils-20160208-git/rutils.asd: In form (PROGN (LOAD #P"/home/testgrid/cl-test-grid/work-dir/agent/quicklisp/setup.lisp") (LOAD #P"/home/testgrid/cl-test-grid/agent/proc-common.lisp") (LOAD #P"/home/testgrid/cl-test-grid/agent/proc-common-asdf.lisp") (LOAD #P"/home/testgrid/cl-test-grid/agent/proc-test-loading.lisp") (COMMON-LISP-USER::SET-RESPONSE #P"/home/testgrid/cl-test-grid/work-dir/agent/response6452907606431021555.lisp" (COMMON-LISP-USER::TEST-LOADING-MAIN #P"/home/testgrid/cl-test-grid/work-dir/agent/test-runs/20160215035056-ecl-13.5.1-unknown-linux-i686-lisp-to-c/logs/rutils-test-load" "rutils-test" #P"/home/testgrid/cl-test-grid/work-dir/agent/quicklisp/" #P"/home/testgrid/cl-test-grid/work-dir/agent/test-runs/20160215035056-ecl-13.5.1-unknown-linux-i686-lisp-to-c/fasl/"))) Unknown keyword :AT
(LOAD rutils FAIL) needs newer ASDF, ASDF/FIND-SYSTEM:LOAD-SYSTEM-DEFINITION-ERROR : Error while trying to load definition for system rutils from pathname /home/testgrid/cl-test-grid/work-dir/agent/quicklisp/dists/quicklisp/software/rutils-20160208-git/rutils.asd: In form (PROGN (LOAD #P"/home/testgrid/cl-test-grid/work-dir/agent/quicklisp/setup.lisp") (LOAD #P"/home/testgrid/cl-test-grid/agent/proc-common.lisp") (LOAD #P"/home/testgrid/cl-test-grid/agent/proc-common-asdf.lisp") (LOAD #P"/home/testgrid/cl-test-grid/agent/proc-test-loading.lisp") (COMMON-LISP-USER::SET-RESPONSE #P"/home/testgrid/cl-test-grid/work-dir/agent/response17888098949799541750.lisp" (COMMON-LISP-USER::TEST-LOADING-MAIN #P"/home/testgrid/cl-test-grid/work-dir/agent/test-runs/20160215035056-ecl-13.5.1-unknown-linux-i686-lisp-to-c/logs/rutils-load" "rutils" #P"/home/testgrid/cl-test-grid/work-dir/agent/quicklisp/" #P"/home/testgrid/cl-test-grid/work-dir/agent/test-runs/20160215035056-ecl-13.5.1-unknown-linux-i686-lisp-to-c/fasl/"))) Unknown keyword :AT
ecl-15.2.21-ee989b97-linux-i686-bytecode
(LOAD rutils-test FAIL) ASDF/FIND-SYSTEM:LOAD-SYSTEM-DEFINITION-ERROR : Error while trying to load definition for system osicat from pathname /home/testgrid/cl-test-grid/work-dir/agent/quicklisp/dists/quicklisp/software/osicat-20160318-git/osicat.asd: The variable C::*CC-FLAGS* is unbound.
(LOAD rutils-test FAIL) ASDF/FIND-SYSTEM:LOAD-SYSTEM-DEFINITION-ERROR : Error while trying to load definition for system osicat from pathname /home/testgrid/cl-test-grid/work-dir/agent/quicklisp/dists/quicklisp/software/osicat-20160208-git/osicat.asd: The variable C::*CC-FLAGS* is unbound.
ecl-15.2.21-ee989b97-linux-i686-lisp-to-c
ecl-15.2.21-ee989b97-linux-x64-bytecode
(LOAD rutils-test FAIL) ASDF/FIND-SYSTEM:LOAD-SYSTEM-DEFINITION-ERROR : Error while trying to load definition for system osicat from pathname /home/hijarian/systems/cl-test-grid/work-dir/agent/quicklisp/dists/quicklisp/software/osicat-20160318-git/osicat.asd: In form ((OS-UNIX-P) "o") FUNCTION: Not a valid argument (OS-UNIX-P).
(LOAD rutils-test FAIL) ASDF/FIND-SYSTEM:LOAD-SYSTEM-DEFINITION-ERROR : Error while trying to load definition for system osicat from pathname /home/hijarian/systems/cl-test-grid/work-dir/agent/quicklisp/dists/quicklisp/software/osicat-20160208-git/osicat.asd: The variable C::*CC-FLAGS* is unbound.
(LOAD rutils-test FAIL) ASDF/FIND-SYSTEM:LOAD-SYSTEM-DEFINITION-ERROR : Error while trying to load definition for system osicat from pathname /home/hijarian/systems/cl-test-grid/work-dir/agent/quicklisp/dists/quicklisp/software/osicat-20160208-git/osicat.asd: The variable C::*CC-FLAGS* is unbound.
ecl-15.2.21-ee989b97-linux-x64-lisp-to-c
(LOAD rutils-test FAIL) ASDF/FIND-SYSTEM:LOAD-SYSTEM-DEFINITION-ERROR : Error while trying to load definition for system osicat from pathname /home/hijarian/systems/cl-test-grid/work-dir/agent/quicklisp/dists/quicklisp/software/osicat-20160318-git/osicat.asd: COMPILE-FILE-ERROR while compiling #<cl-source-file "cffi-toolchain" "toolchain" "asdf-compat">
ecl-16.0.0-98fc12d3-linux-i686-bytecode
(LOAD rutils-test FAIL) ASDF/FIND-SYSTEM:LOAD-SYSTEM-DEFINITION-ERROR : Error while trying to load definition for system osicat from pathname /home/testgrid/cl-test-grid/work-dir/agent/quicklisp/dists/quicklisp/software/osicat-20160318-git/osicat.asd: The variable C::*CC-FLAGS* is unbound.
(LOAD rutils-test FAIL) ASDF/FIND-SYSTEM:LOAD-SYSTEM-DEFINITION-ERROR : Error while trying to load definition for system osicat from pathname /home/testgrid/cl-test-grid/work-dir/agent/quicklisp/dists/quicklisp/software/osicat-20160208-git/osicat.asd: The variable C::*CC-FLAGS* is unbound.
ecl-16.0.0-98fc12d3-linux-i686-lisp-to-c
ecl-16.0.0-b2661fd1-linux-x64-bytecode
(LOAD rutils-test FAIL) ASDF/FIND-SYSTEM:LOAD-SYSTEM-DEFINITION-ERROR : Error while trying to load definition for system osicat from pathname /home/jack/quicklisp/local-projects/cl-test-grid/work-dir/agent/quicklisp/dists/quicklisp/software/osicat-20160208-git/osicat.asd: The variable C::*CC-FLAGS* is unbound.
ecl-16.0.0-b2661fd1-linux-x64-lisp-to-c
ecl-16.0.0-b2661fd1-macosx-x64-bytecode
(LOAD rutils-test FAIL) ASDF/FIND-SYSTEM:LOAD-SYSTEM-DEFINITION-ERROR : Error while trying to load definition for system osicat from pathname /Users/testgrid/cl-test-grid/work-dir/agent/quicklisp/dists/quicklisp/software/osicat-20160208-git/osicat.asd: The variable C::*CC-FLAGS* is unbound.
ecl-16.0.0-b2661fd1-macosx-x64-lisp-to-c
(LOAD rutils-test FAIL) ffi-grovel, CFFI-GROVEL:GROVEL-ERROR : External process exited with code 1. Command was: "cc" "-m64" "-I" "/opt/local/include/" " -g -O2 -fPIC -fno-common -D_THREAD_SAFE -Ddarwin" "-I/Users/testgrid/cl-test-grid/work-dir/agent/quicklisp/dists/quicklisp/software/cffi_0.16.1/" "-bundle" "-fPIC" "-o" "/Users/testgrid/cl-test-grid/work-dir/agent/test-runs/20160220134238-ecl-16.0.0-b2661fd1-macosx-x64-lisp-to-c/fasl/ql/dists/quicklisp/software/osicat-20160208-git/posix/libosicat.dylib" "/Users/testgrid/cl-test-grid/work-dir/agent/test-runs/20160220134238-ecl-16.0.0-b2661fd1-macosx-x64-lisp-to-c/fasl/ql/dists/quicklisp/software/osicat-20160208-git/posix/wrappers.c" Output was:
ecl-16.1.2-rc2-093ba0ab-linux-x64-bytecode
(LOAD rutils-test FAIL) ASDF/FIND-SYSTEM:LOAD-SYSTEM-DEFINITION-ERROR : Error while trying to load definition for system osicat from pathname /home/jack/quicklisp/local-projects/cl-test-grid/work-dir/agent/quicklisp/dists/quicklisp/software/osicat-20160208-git/osicat.asd: The variable C::*CC-FLAGS* is unbound.
ecl-16.1.2-rc2-093ba0ab-linux-x64-lisp-to-c
ecl-16.1.2-rc3-9e5a61f4-linux-x64-bytecode
(LOAD rutils-test FAIL) ASDF/FIND-SYSTEM:LOAD-SYSTEM-DEFINITION-ERROR : Error while trying to load definition for system osicat from pathname /home/jack/Projekty/lisp-systems/cl-test-grid/work-dir/agent/quicklisp/dists/quicklisp/software/osicat-20160208-git/osicat.asd: The variable C::*CC-FLAGS* is unbound.
ecl-16.1.2-rc3-9e5a61f4-linux-x64-lisp-to-c
sbcl-1.0.58-linux-x86
(LOAD rutilsx FAIL) ASDF:LOAD-SYSTEM-DEFINITION-ERROR : Error while trying to load definition for system named-readtables from pathname /home/testgrid/cl-test-grid/work-dir/agent/quicklisp/dists/quicklisp/software/named-readtables-20150923-git/named-readtables.asd: READ error during COMPILE-FILE: :ASCII stream decoding error on #<SB-SYS:FD-STREAM for "file /home/testgrid/cl-test-grid/work-dir/agent/quicklisp/dists/quicklisp/software/named-readtables-20150923-git/named-readtables.asd" {B1D42C1}>: the octet sequence #(195) cannot be decoded. (in form starting at line: 11, column: 25, file-position: 286)
(LOAD rutils-test FAIL) ASDF:LOAD-SYSTEM-DEFINITION-ERROR : Error while trying to load definition for system osicat from pathname /home/testgrid/cl-test-grid/work-dir/agent/quicklisp/dists/quicklisp/software/osicat-20160318-git/osicat.asd: Error while trying to load definition for system cffi-toolchain from pathname /home/testgrid/cl-test-grid/work-dir/agent/quicklisp/dists/quicklisp/software/cffi_0.17.1/cffi-toolchain.asd: CFFI-toolchain requires ASDF 3.1!
(LOAD rutils FAIL) ASDF:LOAD-SYSTEM-DEFINITION-ERROR : Error while trying to load definition for system named-readtables from pathname /home/testgrid/cl-test-grid/work-dir/agent/quicklisp/dists/quicklisp/software/named-readtables-20150923-git/named-readtables.asd: READ error during COMPILE-FILE: :ASCII stream decoding error on #<SB-SYS:FD-STREAM for "file /home/testgrid/cl-test-grid/work-dir/agent/quicklisp/dists/quicklisp/software/named-readtables-20150923-git/named-readtables.asd" {B174DA9}>: the octet sequence #(195) cannot be decoded. (in form starting at line: 11, column: 25, file-position: 286)
(LOAD rutilsx FAIL) ASDF:LOAD-SYSTEM-DEFINITION-ERROR : Error while trying to load definition for system named-readtables from pathname /home/testgrid/cl-test-grid/work-dir/agent/quicklisp/dists/quicklisp/software/named-readtables-20150923-git/named-readtables.asd: READ error during COMPILE-FILE: :ASCII stream decoding error on #<SB-SYS:FD-STREAM for "file /home/testgrid/cl-test-grid/work-dir/agent/quicklisp/dists/quicklisp/software/named-readtables-20150923-git/named-readtables.asd" {B1D42C1}>: the octet sequence #(195) cannot be decoded. (in form starting at line: 11, column: 25, file-position: 286)
(LOAD rutils-test FAIL) ASDF:LOAD-SYSTEM-DEFINITION-ERROR : Error while trying to load definition for system osicat from pathname /home/testgrid/cl-test-grid/work-dir/agent/quicklisp/dists/quicklisp/software/osicat-20160208-git/osicat.asd: Error while invoking #<COMPILE-OP NIL {B65AC71}> on #<CL-SOURCE-FILE "uiop" "image">
(LOAD rutils FAIL) ASDF:LOAD-SYSTEM-DEFINITION-ERROR : Error while trying to load definition for system named-readtables from pathname /home/testgrid/cl-test-grid/work-dir/agent/quicklisp/dists/quicklisp/software/named-readtables-20150923-git/named-readtables.asd: READ error during COMPILE-FILE: :ASCII stream decoding error on #<SB-SYS:FD-STREAM for "file /home/testgrid/cl-test-grid/work-dir/agent/quicklisp/dists/quicklisp/software/named-readtables-20150923-git/named-readtables.asd" {B174DA9}>: the octet sequence #(195) cannot be decoded. (in form starting at line: 11, column: 25, file-position: 286)
sbcl-1.1.11-linux-x86
(LOAD rutilsx FAIL) needs newer ASDF, ASDF/FIND-SYSTEM:LOAD-SYSTEM-DEFINITION-ERROR : Error while trying to load definition for system rutilsx from pathname /home/testgrid/cl-test-grid/work-dir/agent/quicklisp/dists/quicklisp/software/rutils-20160208-git/rutilsx.asd: unknown &KEY argument: :AT
(LOAD rutils-test FAIL) needs newer ASDF, ASDF/FIND-SYSTEM:LOAD-SYSTEM-DEFINITION-ERROR : Error while trying to load definition for system rutils from pathname /home/testgrid/cl-test-grid/work-dir/agent/quicklisp/dists/quicklisp/software/rutils-20160208-git/rutils.asd: unknown &KEY argument: :AT
(LOAD rutils FAIL) needs newer ASDF, ASDF/FIND-SYSTEM:LOAD-SYSTEM-DEFINITION-ERROR : Error while trying to load definition for system rutils from pathname /home/testgrid/cl-test-grid/work-dir/agent/quicklisp/dists/quicklisp/software/rutils-20160208-git/rutils.asd: unknown &KEY argument: :AT
(LOAD rutilsx FAIL) needs newer ASDF, ASDF/FIND-SYSTEM:LOAD-SYSTEM-DEFINITION-ERROR : Error while trying to load definition for system rutilsx from pathname /home/testgrid/cl-test-grid/work-dir/agent/quicklisp/dists/quicklisp/software/rutils-20160208-git/rutilsx.asd: unknown &KEY argument: :AT
(LOAD rutils-test FAIL) needs newer ASDF, ASDF/FIND-SYSTEM:LOAD-SYSTEM-DEFINITION-ERROR : Error while trying to load definition for system rutils from pathname /home/testgrid/cl-test-grid/work-dir/agent/quicklisp/dists/quicklisp/software/rutils-20160208-git/rutils.asd: unknown &KEY argument: :AT
(LOAD rutils FAIL) needs newer ASDF, ASDF/FIND-SYSTEM:LOAD-SYSTEM-DEFINITION-ERROR : Error while trying to load definition for system rutils from pathname /home/testgrid/cl-test-grid/work-dir/agent/quicklisp/dists/quicklisp/software/rutils-20160208-git/rutils.asd: unknown &KEY argument: :AT
sbcl-1.1.16-linux-x86
(LOAD rutilsx FAIL) needs newer ASDF, ASDF/FIND-SYSTEM:LOAD-SYSTEM-DEFINITION-ERROR : Error while trying to load definition for system rutilsx from pathname /home/testgrid/cl-test-grid/work-dir/agent/quicklisp/dists/quicklisp/software/rutils-20160208-git/rutilsx.asd: unknown &KEY argument: :AT
(LOAD rutils-test FAIL) needs newer ASDF, ASDF/FIND-SYSTEM:LOAD-SYSTEM-DEFINITION-ERROR : Error while trying to load definition for system rutils from pathname /home/testgrid/cl-test-grid/work-dir/agent/quicklisp/dists/quicklisp/software/rutils-20160208-git/rutils.asd: unknown &KEY argument: :AT
(LOAD rutils FAIL) needs newer ASDF, ASDF/FIND-SYSTEM:LOAD-SYSTEM-DEFINITION-ERROR : Error while trying to load definition for system rutils from pathname /home/testgrid/cl-test-grid/work-dir/agent/quicklisp/dists/quicklisp/software/rutils-20160208-git/rutils.asd: unknown &KEY argument: :AT
(LOAD rutilsx FAIL) needs newer ASDF, ASDF/FIND-SYSTEM:LOAD-SYSTEM-DEFINITION-ERROR : Error while trying to load definition for system rutilsx from pathname /home/testgrid/cl-test-grid/work-dir/agent/quicklisp/dists/quicklisp/software/rutils-20160208-git/rutilsx.asd: unknown &KEY argument: :AT
(LOAD rutils-test FAIL) needs newer ASDF, ASDF/FIND-SYSTEM:LOAD-SYSTEM-DEFINITION-ERROR : Error while trying to load definition for system rutils from pathname /home/testgrid/cl-test-grid/work-dir/agent/quicklisp/dists/quicklisp/software/rutils-20160208-git/rutils.asd: unknown &KEY argument: :AT
(LOAD rutils FAIL) needs newer ASDF, ASDF/FIND-SYSTEM:LOAD-SYSTEM-DEFINITION-ERROR : Error while trying to load definition for system rutils from pathname /home/testgrid/cl-test-grid/work-dir/agent/quicklisp/dists/quicklisp/software/rutils-20160208-git/rutils.asd: unknown &KEY argument: :AT
sbcl-1.2.14-linux-arm
(LOAD rutils-test FAIL) ASDF/FIND-SYSTEM:LOAD-SYSTEM-DEFINITION-ERROR : Error while trying to load definition for system osicat from pathname /home/testgrid/cl-test-grid/work-dir/agent/quicklisp/dists/quicklisp/software/osicat-20160318-git/osicat.asd: COMPILE-FILE-ERROR while compiling #<CL-SOURCE-FILE "cffi-toolchain" "toolchain" "c-toolchain">
sbcl-1.2.3-linux-x64
(LOAD rutils-test FAIL) ASDF/FIND-SYSTEM:LOAD-SYSTEM-DEFINITION-ERROR : Error while trying to load definition for system osicat from pathname /home/hijarian/systems/cl-test-grid/work-dir/agent/quicklisp/dists/quicklisp/software/osicat-20160318-git/osicat.asd: COMPILE-FILE-ERROR while compiling #<CL-SOURCE-FILE "cffi-toolchain" "toolchain" "asdf-compat">
sbcl-1.2.6-linux-x86
sbcl-1.3.2.92-4077405-macosx-x64
(LOAD rutils-test FAIL) ffi-grovel, CFFI-GROVEL:GROVEL-ERROR : External process exited with code 1. Command was: "cc" "-m64" "-I" "/opt/local/include/" "-I/Users/testgrid/cl-test-grid/work-dir/agent/quicklisp/dists/quicklisp/software/cffi_0.16.1/" "-bundle" "-fPIC" "-o" "/Users/testgrid/cl-test-grid/work-dir/agent/test-runs/20160220052250-sbcl-1.3.2.92-4077405-macosx-x64/fasl/ql/dists/quicklisp/software/osicat-20160208-git/posix/libosicat.dylib" "/Users/testgrid/cl-test-grid/work-dir/agent/test-runs/20160220052250-sbcl-1.3.2.92-4077405-macosx-x64/fasl/ql/dists/quicklisp/software/osicat-20160208-git/posix/wrappers.c" Output was: /Users/testgrid/cl-test-grid/work-dir/agent/test-runs/20160220052250-sbcl-1.3.2.92-4077405-macosx-x64/fasl/ql/dists/quicklisp/software/osicat-20160208-git/posix/wrappers.c:113:10: warning: implicit declaration of function 'posix_fallocate' is invalid in C99 [-Wimplicit-function-declaration] return posix_fallocate(fd, offset, length); ^ 1 warning generated. Undefined symbols for architecture x86_64: "_posix_fallocate", referenced from: _posix_fallocate_cffi_wrap in wrappers-f6f304.o (maybe you meant: _posix_fallocate_cffi_wrap) ld: symbol(s) not found for architecture x86_64 clang: error: linker command failed with exit code 1 (use -v to see invocation)

Breakdown by testcases: for every failed testcase the lisp implmentations it fails on

The library does not have a testsuite adapter for CL Test Grid.

To reports overview

Generated at: 2016-04-17 01:09:18 GMT.