query-fs results collected by cl-test-grid

Results on the last two Quicklisp distributions

 quicklisp 2015-07-10quicklisp 2015-06-08
abcl-1.2.1-fasl42-linux-x86
(LOAD query-fs FAIL) ASDF/FIND-SYSTEM:LOAD-SYSTEM-DEFINITION-ERROR : Error while trying to load definition for system cl-fuse from pathname /home/testgrid/cl-test-grid/work-dir/agent/quicklisp/dists/quicklisp/software/cl-fuse-20141217-git/cl-fuse.asd: External process exited with code 1. Command was: "cc" "-m32" "-I/home/testgrid/cl-test-grid/work-dir/agent/quicklisp/dists/quicklisp/software/cffi_0.15.0/" "-o" "/home/testgrid/cl-test-grid/work-dir/agent/quicklisp/dists/quicklisp/software/cl-fuse-20141217-git/fuse-grovel-result" "/home/testgrid/cl-test-grid/work-dir/agent/quicklisp/dists/quicklisp/software/cl-fuse-20141217-git/fuse-grovel-result.c" Output was: /home/testgrid/cl-test-grid/work-dir/agent/quicklisp/dists/quicklisp/software/cl-fuse-20141217-git/fuse-grovel-result.c:9:18: fatal error: fuse.h: No such file or directory compilation terminated.
(LOAD query-fs FAIL) ASDF/FIND-SYSTEM:LOAD-SYSTEM-DEFINITION-ERROR : Error while trying to load definition for system cl-fuse from pathname /home/testgrid/cl-test-grid/work-dir/agent/quicklisp/dists/quicklisp/software/cl-fuse-20141217-git/cl-fuse.asd: External process exited with code 1. Command was: "cc" "-m32" "-I/home/testgrid/cl-test-grid/work-dir/agent/quicklisp/dists/quicklisp/software/cffi_0.15.0/" "-o" "/home/testgrid/cl-test-grid/work-dir/agent/quicklisp/dists/quicklisp/software/cl-fuse-20141217-git/fuse-grovel-result" "/home/testgrid/cl-test-grid/work-dir/agent/quicklisp/dists/quicklisp/software/cl-fuse-20141217-git/fuse-grovel-result.c" Output was: /home/testgrid/cl-test-grid/work-dir/agent/quicklisp/dists/quicklisp/software/cl-fuse-20141217-git/fuse-grovel-result.c:9:18: fatal error: fuse.h: No such file or directory compilation terminated.
abcl-1.3.0-fasl42-linux-x86
(LOAD query-fs FAIL) ASDF/FIND-SYSTEM:LOAD-SYSTEM-DEFINITION-ERROR : Error while trying to load definition for system cl-fuse from pathname /home/testgrid/cl-test-grid/work-dir/agent/quicklisp/dists/quicklisp/software/cl-fuse-20141217-git/cl-fuse.asd: External process exited with code 1. Command was: "cc" "-m32" "-I/home/testgrid/cl-test-grid/work-dir/agent/quicklisp/dists/quicklisp/software/cffi_0.15.0/" "-o" "/home/testgrid/cl-test-grid/work-dir/agent/quicklisp/dists/quicklisp/software/cl-fuse-20141217-git/fuse-grovel-result" "/home/testgrid/cl-test-grid/work-dir/agent/quicklisp/dists/quicklisp/software/cl-fuse-20141217-git/fuse-grovel-result.c" Output was: /home/testgrid/cl-test-grid/work-dir/agent/quicklisp/dists/quicklisp/software/cl-fuse-20141217-git/fuse-grovel-result.c:9:18: fatal error: fuse.h: No such file or directory compilation terminated.
(LOAD query-fs FAIL) ASDF/FIND-SYSTEM:LOAD-SYSTEM-DEFINITION-ERROR : Error while trying to load definition for system cl-fuse from pathname /home/testgrid/cl-test-grid/work-dir/agent/quicklisp/dists/quicklisp/software/cl-fuse-20141217-git/cl-fuse.asd: External process exited with code 1. Command was: "cc" "-m32" "-I/home/testgrid/cl-test-grid/work-dir/agent/quicklisp/dists/quicklisp/software/cffi_0.15.0/" "-o" "/home/testgrid/cl-test-grid/work-dir/agent/quicklisp/dists/quicklisp/software/cl-fuse-20141217-git/fuse-grovel-result" "/home/testgrid/cl-test-grid/work-dir/agent/quicklisp/dists/quicklisp/software/cl-fuse-20141217-git/fuse-grovel-result.c" Output was: /home/testgrid/cl-test-grid/work-dir/agent/quicklisp/dists/quicklisp/software/cl-fuse-20141217-git/fuse-grovel-result.c:9:18: fatal error: fuse.h: No such file or directory compilation terminated.
abcl-1.3.1-fasl42-linux-x86
(LOAD query-fs FAIL) ASDF/FIND-SYSTEM:LOAD-SYSTEM-DEFINITION-ERROR : Error while trying to load definition for system cl-fuse from pathname /home/testgrid/cl-test-grid/work-dir/agent/quicklisp/dists/quicklisp/software/cl-fuse-20141217-git/cl-fuse.asd: External process exited with code 1. Command was: "cc" "-m32" "-I/home/testgrid/cl-test-grid/work-dir/agent/quicklisp/dists/quicklisp/software/cffi_0.15.0/" "-o" "/home/testgrid/cl-test-grid/work-dir/agent/quicklisp/dists/quicklisp/software/cl-fuse-20141217-git/fuse-grovel-result" "/home/testgrid/cl-test-grid/work-dir/agent/quicklisp/dists/quicklisp/software/cl-fuse-20141217-git/fuse-grovel-result.c" Output was: /home/testgrid/cl-test-grid/work-dir/agent/quicklisp/dists/quicklisp/software/cl-fuse-20141217-git/fuse-grovel-result.c:9:18: fatal error: fuse.h: No such file or directory compilation terminated.
(LOAD query-fs FAIL) ASDF/FIND-SYSTEM:LOAD-SYSTEM-DEFINITION-ERROR : Error while trying to load definition for system cl-fuse from pathname /home/testgrid/cl-test-grid/work-dir/agent/quicklisp/dists/quicklisp/software/cl-fuse-20141217-git/cl-fuse.asd: External process exited with code 1. Command was: "cc" "-m32" "-I/home/testgrid/cl-test-grid/work-dir/agent/quicklisp/dists/quicklisp/software/cffi_0.15.0/" "-o" "/home/testgrid/cl-test-grid/work-dir/agent/quicklisp/dists/quicklisp/software/cl-fuse-20141217-git/fuse-grovel-result" "/home/testgrid/cl-test-grid/work-dir/agent/quicklisp/dists/quicklisp/software/cl-fuse-20141217-git/fuse-grovel-result.c" Output was: /home/testgrid/cl-test-grid/work-dir/agent/quicklisp/dists/quicklisp/software/cl-fuse-20141217-git/fuse-grovel-result.c:9:18: fatal error: fuse.h: No such file or directory compilation terminated.
abcl-1.3.2-fasl42-linux-x86
(LOAD query-fs FAIL) ASDF/FIND-SYSTEM:LOAD-SYSTEM-DEFINITION-ERROR : Error while trying to load definition for system cl-fuse from pathname /home/testgrid/cl-test-grid/work-dir/agent/quicklisp/dists/quicklisp/software/cl-fuse-20141217-git/cl-fuse.asd: External process exited with code 1. Command was: "cc" "-m32" "-I/home/testgrid/cl-test-grid/work-dir/agent/quicklisp/dists/quicklisp/software/cffi_0.15.0/" "-o" "/home/testgrid/cl-test-grid/work-dir/agent/quicklisp/dists/quicklisp/software/cl-fuse-20141217-git/fuse-grovel-result" "/home/testgrid/cl-test-grid/work-dir/agent/quicklisp/dists/quicklisp/software/cl-fuse-20141217-git/fuse-grovel-result.c" Output was: /home/testgrid/cl-test-grid/work-dir/agent/quicklisp/dists/quicklisp/software/cl-fuse-20141217-git/fuse-grovel-result.c:9:18: fatal error: fuse.h: No such file or directory compilation terminated.
(LOAD query-fs FAIL) ASDF/FIND-SYSTEM:LOAD-SYSTEM-DEFINITION-ERROR : Error while trying to load definition for system cl-fuse from pathname /home/testgrid/cl-test-grid/work-dir/agent/quicklisp/dists/quicklisp/software/cl-fuse-20141217-git/cl-fuse.asd: External process exited with code 1. Command was: "cc" "-m32" "-I/home/testgrid/cl-test-grid/work-dir/agent/quicklisp/dists/quicklisp/software/cffi_0.15.0/" "-o" "/home/testgrid/cl-test-grid/work-dir/agent/quicklisp/dists/quicklisp/software/cl-fuse-20141217-git/fuse-grovel-result" "/home/testgrid/cl-test-grid/work-dir/agent/quicklisp/dists/quicklisp/software/cl-fuse-20141217-git/fuse-grovel-result.c" Output was: /home/testgrid/cl-test-grid/work-dir/agent/quicklisp/dists/quicklisp/software/cl-fuse-20141217-git/fuse-grovel-result.c:9:18: fatal error: fuse.h: No such file or directory compilation terminated.
ccl-1.10-r16196-f96-linux-x64
(LOAD query-fs FAIL) ASDF/FIND-SYSTEM:LOAD-SYSTEM-DEFINITION-ERROR : Error while trying to load definition for system cl-fuse from pathname /home/hijarian/systems/cl-test-grid/work-dir/agent/quicklisp/dists/quicklisp/software/cl-fuse-20141217-git/cl-fuse.asd: Incorrect keyword arguments in (:SEARCH T :OUTPUT T) .
ccl-1.10-r16196-f96-linux-x86
(LOAD query-fs FAIL) ASDF/FIND-SYSTEM:LOAD-SYSTEM-DEFINITION-ERROR : Error while trying to load definition for system cl-fuse from pathname /home/testgrid/cl-test-grid/work-dir/agent/quicklisp/dists/quicklisp/software/cl-fuse-20141217-git/cl-fuse.asd: Incorrect keyword arguments in (:SEARCH T :OUTPUT T) .
(LOAD query-fs FAIL) ASDF/FIND-SYSTEM:LOAD-SYSTEM-DEFINITION-ERROR : Error while trying to load definition for system cl-fuse from pathname /home/testgrid/cl-test-grid/work-dir/agent/quicklisp/dists/quicklisp/software/cl-fuse-20141217-git/cl-fuse.asd: Incorrect keyword arguments in (:SEARCH T :OUTPUT T) .
ccl-1.8-r15286m-f95-linux-x86
(LOAD query-fs FAIL) ASDF:LOAD-SYSTEM-DEFINITION-ERROR : Error while trying to load definition for system cl-fuse from pathname /home/testgrid/cl-test-grid/work-dir/agent/quicklisp/dists/quicklisp/software/cl-fuse-20141217-git/cl-fuse.asd: Incorrect keyword arguments in (:SEARCH T :OUTPUT T) .
(LOAD query-fs FAIL) ASDF:LOAD-SYSTEM-DEFINITION-ERROR : Error while trying to load definition for system cl-fuse from pathname /home/testgrid/cl-test-grid/work-dir/agent/quicklisp/dists/quicklisp/software/cl-fuse-20141217-git/cl-fuse.asd: Incorrect keyword arguments in (:SEARCH T :OUTPUT T) .
ccl-1.9-r15756-f96-linux-x86
(LOAD query-fs FAIL) ASDF/FIND-SYSTEM:LOAD-SYSTEM-DEFINITION-ERROR : Error while trying to load definition for system cl-fuse from pathname /home/testgrid/cl-test-grid/work-dir/agent/quicklisp/dists/quicklisp/software/cl-fuse-20141217-git/cl-fuse.asd: Incorrect keyword arguments in (:SEARCH T :OUTPUT T) .
(LOAD query-fs FAIL) ASDF/FIND-SYSTEM:LOAD-SYSTEM-DEFINITION-ERROR : Error while trying to load definition for system cl-fuse from pathname /home/testgrid/cl-test-grid/work-dir/agent/quicklisp/dists/quicklisp/software/cl-fuse-20141217-git/cl-fuse.asd: Incorrect keyword arguments in (:SEARCH T :OUTPUT T) .
clisp-2.49-unix-x64
(LOAD query-fs FAIL) ASDF:LOAD-SYSTEM-DEFINITION-ERROR : Error while trying to load definition for system cl-fuse from pathname /home/hijarian/systems/cl-test-grid/work-dir/agent/quicklisp/dists/quicklisp/software/cl-fuse-20141217-git/cl-fuse.asd: External process exited with code 1. Command was: "cc" "-m64" "-I/home/hijarian/systems/cl-test-grid/work-dir/agent/quicklisp/dists/quicklisp/software/cffi_0.15.0/" "-o" "/home/hijarian/systems/cl-test-grid/work-dir/agent/quicklisp/dists/quicklisp/software/cl-fuse-20141217-git/fuse-grovel-result" "/home/hijarian/systems/cl-test-grid/work-dir/agent/quicklisp/dists/quicklisp/software/cl-fuse-20141217-git/fuse-grovel-result.c" Output was: <see above>
clisp-2.49-unix-x86
(LOAD query-fs FAIL) ASDF:LOAD-SYSTEM-DEFINITION-ERROR : Error while trying to load definition for system cl-fuse from pathname /home/testgrid/cl-test-grid/work-dir/agent/quicklisp/dists/quicklisp/software/cl-fuse-20141217-git/cl-fuse.asd: External process exited with code 1. Command was: "cc" "-m32" "-I/home/testgrid/cl-test-grid/work-dir/agent/quicklisp/dists/quicklisp/software/cffi_0.15.0/" "-o" "/home/testgrid/cl-test-grid/work-dir/agent/quicklisp/dists/quicklisp/software/cl-fuse-20141217-git/fuse-grovel-result" "/home/testgrid/cl-test-grid/work-dir/agent/quicklisp/dists/quicklisp/software/cl-fuse-20141217-git/fuse-grovel-result.c" Output was: <see above>
(LOAD query-fs FAIL) ASDF:LOAD-SYSTEM-DEFINITION-ERROR : Error while trying to load definition for system cl-fuse from pathname /home/testgrid/cl-test-grid/work-dir/agent/quicklisp/dists/quicklisp/software/cl-fuse-20141217-git/cl-fuse.asd: External process exited with code 1. Command was: "cc" "-m32" "-I/home/testgrid/cl-test-grid/work-dir/agent/quicklisp/dists/quicklisp/software/cffi_0.15.0/" "-o" "/home/testgrid/cl-test-grid/work-dir/agent/quicklisp/dists/quicklisp/software/cl-fuse-20141217-git/fuse-grovel-result" "/home/testgrid/cl-test-grid/work-dir/agent/quicklisp/dists/quicklisp/software/cl-fuse-20141217-git/fuse-grovel-result.c" Output was: <see above>
cmu-snapshot-2013-04__20d_unicode_-linux-x86
(LOAD query-fs FAIL) ASDF/FIND-SYSTEM:LOAD-SYSTEM-DEFINITION-ERROR : Error while trying to load definition for system cl-fuse from pathname /home/testgrid/cl-test-grid/work-dir/agent/quicklisp/dists/quicklisp/software/cl-fuse-20141217-git/cl-fuse.asd: Error in function CFFI-GROVEL:GROVEL-ERROR: External process exited with code 1. Command was: "cc" "-m32" "-I/home/testgrid/cl-test-grid/work-dir/agent/quicklisp/dists/quicklisp/software/cffi_0.15.0/" "-o" "/home/testgrid/cl-test-grid/work-dir/agent/quicklisp/dists/quicklisp/software/cl-fuse-20141217-git/fuse-grovel-result" "/home/testgrid/cl-test-grid/work-dir/agent/quicklisp/dists/quicklisp/software/cl-fuse-20141217-git/fuse-grovel-result.c" Output was: /home/testgrid/cl-test-grid/work-dir/agent/quicklisp/dists/quicklisp/software/cl-fuse-20141217-git/fuse-grovel-result.c:9:18: fatal error: fuse.h: No such file or directory compilation terminated.
(LOAD query-fs FAIL) ASDF/FIND-SYSTEM:LOAD-SYSTEM-DEFINITION-ERROR : Error while trying to load definition for system cl-fuse from pathname /home/testgrid/cl-test-grid/work-dir/agent/quicklisp/dists/quicklisp/software/cl-fuse-20141217-git/cl-fuse.asd: Error in function CFFI-GROVEL:GROVEL-ERROR: External process exited with code 1. Command was: "cc" "-m32" "-I/home/testgrid/cl-test-grid/work-dir/agent/quicklisp/dists/quicklisp/software/cffi_0.15.0/" "-o" "/home/testgrid/cl-test-grid/work-dir/agent/quicklisp/dists/quicklisp/software/cl-fuse-20141217-git/fuse-grovel-result" "/home/testgrid/cl-test-grid/work-dir/agent/quicklisp/dists/quicklisp/software/cl-fuse-20141217-git/fuse-grovel-result.c" Output was: /home/testgrid/cl-test-grid/work-dir/agent/quicklisp/dists/quicklisp/software/cl-fuse-20141217-git/fuse-grovel-result.c:9:18: fatal error: fuse.h: No such file or directory compilation terminated.
cmu-snapshot-2014-01__20e_unicode_-linux-x86
(LOAD query-fs FAIL) ASDF/FIND-SYSTEM:LOAD-SYSTEM-DEFINITION-ERROR : Error while trying to load definition for system cl-fuse from pathname /home/testgrid/cl-test-grid/work-dir/agent/quicklisp/dists/quicklisp/software/cl-fuse-20141217-git/cl-fuse.asd: Error in function CFFI-GROVEL:GROVEL-ERROR: External process exited with code 1. Command was: "cc" "-m32" "-I/home/testgrid/cl-test-grid/work-dir/agent/quicklisp/dists/quicklisp/software/cffi_0.15.0/" "-o" "/home/testgrid/cl-test-grid/work-dir/agent/quicklisp/dists/quicklisp/software/cl-fuse-20141217-git/fuse-grovel-result" "/home/testgrid/cl-test-grid/work-dir/agent/quicklisp/dists/quicklisp/software/cl-fuse-20141217-git/fuse-grovel-result.c" Output was: /home/testgrid/cl-test-grid/work-dir/agent/quicklisp/dists/quicklisp/software/cl-fuse-20141217-git/fuse-grovel-result.c:9:18: fatal error: fuse.h: No such file or directory compilation terminated.
(LOAD query-fs FAIL) ASDF/FIND-SYSTEM:LOAD-SYSTEM-DEFINITION-ERROR : Error while trying to load definition for system cl-fuse from pathname /home/testgrid/cl-test-grid/work-dir/agent/quicklisp/dists/quicklisp/software/cl-fuse-20141217-git/cl-fuse.asd: Error in function CFFI-GROVEL:GROVEL-ERROR: External process exited with code 1. Command was: "cc" "-m32" "-I/home/testgrid/cl-test-grid/work-dir/agent/quicklisp/dists/quicklisp/software/cffi_0.15.0/" "-o" "/home/testgrid/cl-test-grid/work-dir/agent/quicklisp/dists/quicklisp/software/cl-fuse-20141217-git/fuse-grovel-result" "/home/testgrid/cl-test-grid/work-dir/agent/quicklisp/dists/quicklisp/software/cl-fuse-20141217-git/fuse-grovel-result.c" Output was: /home/testgrid/cl-test-grid/work-dir/agent/quicklisp/dists/quicklisp/software/cl-fuse-20141217-git/fuse-grovel-result.c:9:18: fatal error: fuse.h: No such file or directory compilation terminated.
cmu-snapshot-2014-05-dirty__20e_unicode_-linux-x86
(LOAD query-fs FAIL) ASDF/FIND-SYSTEM:LOAD-SYSTEM-DEFINITION-ERROR : Error while trying to load definition for system cl-fuse from pathname /home/testgrid/cl-test-grid/work-dir/agent/quicklisp/dists/quicklisp/software/cl-fuse-20141217-git/cl-fuse.asd: Error in function CFFI-GROVEL:GROVEL-ERROR: External process exited with code 1. Command was: "cc" "-m32" "-I/home/testgrid/cl-test-grid/work-dir/agent/quicklisp/dists/quicklisp/software/cffi_0.15.0/" "-o" "/home/testgrid/cl-test-grid/work-dir/agent/quicklisp/dists/quicklisp/software/cl-fuse-20141217-git/fuse-grovel-result" "/home/testgrid/cl-test-grid/work-dir/agent/quicklisp/dists/quicklisp/software/cl-fuse-20141217-git/fuse-grovel-result.c" Output was: /home/testgrid/cl-test-grid/work-dir/agent/quicklisp/dists/quicklisp/software/cl-fuse-20141217-git/fuse-grovel-result.c:9:18: fatal error: fuse.h: No such file or directory compilation terminated.
(LOAD query-fs FAIL) ASDF/FIND-SYSTEM:LOAD-SYSTEM-DEFINITION-ERROR : Error while trying to load definition for system cl-fuse from pathname /home/testgrid/cl-test-grid/work-dir/agent/quicklisp/dists/quicklisp/software/cl-fuse-20141217-git/cl-fuse.asd: Error in function CFFI-GROVEL:GROVEL-ERROR: External process exited with code 1. Command was: "cc" "-m32" "-I/home/testgrid/cl-test-grid/work-dir/agent/quicklisp/dists/quicklisp/software/cffi_0.15.0/" "-o" "/home/testgrid/cl-test-grid/work-dir/agent/quicklisp/dists/quicklisp/software/cl-fuse-20141217-git/fuse-grovel-result" "/home/testgrid/cl-test-grid/work-dir/agent/quicklisp/dists/quicklisp/software/cl-fuse-20141217-git/fuse-grovel-result.c" Output was: /home/testgrid/cl-test-grid/work-dir/agent/quicklisp/dists/quicklisp/software/cl-fuse-20141217-git/fuse-grovel-result.c:9:18: fatal error: fuse.h: No such file or directory compilation terminated.
cmu-snapshot-2014-12___20f_unicode_-linux-x86
(LOAD query-fs FAIL) ASDF/FIND-SYSTEM:LOAD-SYSTEM-DEFINITION-ERROR : Error while trying to load definition for system cl-fuse from pathname /home/testgrid/cl-test-grid/work-dir/agent/quicklisp/dists/quicklisp/software/cl-fuse-20141217-git/cl-fuse.asd: Error in function CFFI-GROVEL:GROVEL-ERROR: External process exited with code 1. Command was: "cc" "-m32" "-I/home/testgrid/cl-test-grid/work-dir/agent/quicklisp/dists/quicklisp/software/cffi_0.15.0/" "-o" "/home/testgrid/cl-test-grid/work-dir/agent/quicklisp/dists/quicklisp/software/cl-fuse-20141217-git/fuse-grovel-result" "/home/testgrid/cl-test-grid/work-dir/agent/quicklisp/dists/quicklisp/software/cl-fuse-20141217-git/fuse-grovel-result.c" Output was: /home/testgrid/cl-test-grid/work-dir/agent/quicklisp/dists/quicklisp/software/cl-fuse-20141217-git/fuse-grovel-result.c:9:18: fatal error: fuse.h: No such file or directory compilation terminated.
(LOAD query-fs FAIL) ASDF/FIND-SYSTEM:LOAD-SYSTEM-DEFINITION-ERROR : Error while trying to load definition for system cl-fuse from pathname /home/testgrid/cl-test-grid/work-dir/agent/quicklisp/dists/quicklisp/software/cl-fuse-20141217-git/cl-fuse.asd: Error in function CFFI-GROVEL:GROVEL-ERROR: External process exited with code 1. Command was: "cc" "-m32" "-I/home/testgrid/cl-test-grid/work-dir/agent/quicklisp/dists/quicklisp/software/cffi_0.15.0/" "-o" "/home/testgrid/cl-test-grid/work-dir/agent/quicklisp/dists/quicklisp/software/cl-fuse-20141217-git/fuse-grovel-result" "/home/testgrid/cl-test-grid/work-dir/agent/quicklisp/dists/quicklisp/software/cl-fuse-20141217-git/fuse-grovel-result.c" Output was: /home/testgrid/cl-test-grid/work-dir/agent/quicklisp/dists/quicklisp/software/cl-fuse-20141217-git/fuse-grovel-result.c:9:18: fatal error: fuse.h: No such file or directory compilation terminated.
ecl-13.5.1-unknown-linux-i686-bytecode
(LOAD query-fs FAIL) ASDF/FIND-SYSTEM:LOAD-SYSTEM-DEFINITION-ERROR : Error while trying to load definition for system cl-fuse from pathname /home/testgrid/cl-test-grid/work-dir/agent/quicklisp/dists/quicklisp/software/cl-fuse-20141217-git/cl-fuse.asd: The variable C::*CC-FLAGS* is unbound.
(LOAD query-fs FAIL) ASDF/FIND-SYSTEM:LOAD-SYSTEM-DEFINITION-ERROR : Error while trying to load definition for system cl-fuse from pathname /home/testgrid/cl-test-grid/work-dir/agent/quicklisp/dists/quicklisp/software/cl-fuse-20141217-git/cl-fuse.asd: The variable C::*CC-FLAGS* is unbound.
ecl-13.5.1-unknown-linux-i686-lisp-to-c
(LOAD query-fs FAIL) ASDF/FIND-SYSTEM:LOAD-SYSTEM-DEFINITION-ERROR : Error while trying to load definition for system cl-fuse from pathname /home/testgrid/cl-test-grid/work-dir/agent/quicklisp/dists/quicklisp/software/cl-fuse-20141217-git/cl-fuse.asd: COMPILE-FILE-ERROR while compiling #<cl-source-file "alexandria" "macros">
(LOAD query-fs FAIL) ASDF/FIND-SYSTEM:LOAD-SYSTEM-DEFINITION-ERROR : Error while trying to load definition for system cl-fuse from pathname /home/testgrid/cl-test-grid/work-dir/agent/quicklisp/dists/quicklisp/software/cl-fuse-20141217-git/cl-fuse.asd: COMPILE-FILE-ERROR while compiling #<cl-source-file "alexandria" "macros">
ecl-15.2.21-ee989b97-linux-i686-bytecode
(LOAD query-fs FAIL) ASDF/FIND-SYSTEM:LOAD-SYSTEM-DEFINITION-ERROR : Error while trying to load definition for system cl-fuse from pathname /home/testgrid/cl-test-grid/work-dir/agent/quicklisp/dists/quicklisp/software/cl-fuse-20141217-git/cl-fuse.asd: The variable C::*CC-FLAGS* is unbound.
(LOAD query-fs FAIL) ASDF/FIND-SYSTEM:LOAD-SYSTEM-DEFINITION-ERROR : Error while trying to load definition for system cl-fuse from pathname /home/testgrid/cl-test-grid/work-dir/agent/quicklisp/dists/quicklisp/software/cl-fuse-20141217-git/cl-fuse.asd: The variable C::*CC-FLAGS* is unbound.
ecl-15.2.21-ee989b97-linux-i686-lisp-to-c
(LOAD query-fs FAIL) ASDF/FIND-SYSTEM:LOAD-SYSTEM-DEFINITION-ERROR : Error while trying to load definition for system cl-fuse from pathname /home/testgrid/cl-test-grid/work-dir/agent/quicklisp/dists/quicklisp/software/cl-fuse-20141217-git/cl-fuse.asd: COMPILE-FILE-ERROR while compiling #<cl-source-file "alexandria" "macros">
(LOAD query-fs FAIL) ASDF/FIND-SYSTEM:LOAD-SYSTEM-DEFINITION-ERROR : Error while trying to load definition for system cl-fuse from pathname /home/testgrid/cl-test-grid/work-dir/agent/quicklisp/dists/quicklisp/software/cl-fuse-20141217-git/cl-fuse.asd: COMPILE-FILE-ERROR while compiling #<cl-source-file "alexandria" "macros">
ecl-15.2.21-ee989b97-linux-x64-bytecode
(LOAD query-fs FAIL) ASDF/FIND-SYSTEM:LOAD-SYSTEM-DEFINITION-ERROR : Error while trying to load definition for system cl-fuse from pathname /home/hijarian/systems/cl-test-grid/work-dir/agent/quicklisp/dists/quicklisp/software/cl-fuse-20141217-git/cl-fuse.asd: The variable C::*CC-FLAGS* is unbound.
ecl-15.2.21-ee989b97-linux-x64-lisp-to-c
(LOAD query-fs FAIL) ASDF/FIND-SYSTEM:LOAD-SYSTEM-DEFINITION-ERROR : Error while trying to load definition for system cl-fuse from pathname /home/hijarian/systems/cl-test-grid/work-dir/agent/quicklisp/dists/quicklisp/software/cl-fuse-20141217-git/cl-fuse.asd: COMPILE-FILE-ERROR while compiling #<cl-source-file "alexandria" "macros">
sbcl-1.0.58-linux-x86
(LOAD query-fs FAIL) ASDF:LOAD-SYSTEM-DEFINITION-ERROR : Error while trying to load definition for system cl-fuse from pathname /home/testgrid/cl-test-grid/work-dir/agent/quicklisp/dists/quicklisp/software/cl-fuse-20141217-git/cl-fuse.asd: External process exited with code 1. Command was: "cc" "-m32" "-I/home/testgrid/cl-test-grid/work-dir/agent/quicklisp/dists/quicklisp/software/cffi_0.15.0/" "-o" "/home/testgrid/cl-test-grid/work-dir/agent/quicklisp/dists/quicklisp/software/cl-fuse-20141217-git/fuse-grovel-result" "/home/testgrid/cl-test-grid/work-dir/agent/quicklisp/dists/quicklisp/software/cl-fuse-20141217-git/fuse-grovel-result.c" Output was: /home/testgrid/cl-test-grid/work-dir/agent/quicklisp/dists/quicklisp/software/cl-fuse-20141217-git/fuse-grovel-result.c:9:18: fatal error: fuse.h: No such file or directory compilation terminated.
(LOAD query-fs FAIL) ASDF:LOAD-SYSTEM-DEFINITION-ERROR : Error while trying to load definition for system cl-fuse from pathname /home/testgrid/cl-test-grid/work-dir/agent/quicklisp/dists/quicklisp/software/cl-fuse-20141217-git/cl-fuse.asd: External process exited with code 1. Command was: "cc" "-m32" "-I/home/testgrid/cl-test-grid/work-dir/agent/quicklisp/dists/quicklisp/software/cffi_0.15.0/" "-o" "/home/testgrid/cl-test-grid/work-dir/agent/quicklisp/dists/quicklisp/software/cl-fuse-20141217-git/fuse-grovel-result" "/home/testgrid/cl-test-grid/work-dir/agent/quicklisp/dists/quicklisp/software/cl-fuse-20141217-git/fuse-grovel-result.c" Output was: /home/testgrid/cl-test-grid/work-dir/agent/quicklisp/dists/quicklisp/software/cl-fuse-20141217-git/fuse-grovel-result.c:9:18: fatal error: fuse.h: No such file or directory compilation terminated.
sbcl-1.1.11-linux-x86
(LOAD query-fs FAIL) ASDF/FIND-SYSTEM:LOAD-SYSTEM-DEFINITION-ERROR : Error while trying to load definition for system cl-fuse from pathname /home/testgrid/cl-test-grid/work-dir/agent/quicklisp/dists/quicklisp/software/cl-fuse-20141217-git/cl-fuse.asd: External process exited with code 1. Command was: "cc" "-m32" "-I/home/testgrid/cl-test-grid/work-dir/agent/quicklisp/dists/quicklisp/software/cffi_0.15.0/" "-o" "/home/testgrid/cl-test-grid/work-dir/agent/quicklisp/dists/quicklisp/software/cl-fuse-20141217-git/fuse-grovel-result" "/home/testgrid/cl-test-grid/work-dir/agent/quicklisp/dists/quicklisp/software/cl-fuse-20141217-git/fuse-grovel-result.c" Output was: /home/testgrid/cl-test-grid/work-dir/agent/quicklisp/dists/quicklisp/software/cl-fuse-20141217-git/fuse-grovel-result.c:9:18: fatal error: fuse.h: No such file or directory compilation terminated.
(LOAD query-fs FAIL) ASDF/FIND-SYSTEM:LOAD-SYSTEM-DEFINITION-ERROR : Error while trying to load definition for system cl-fuse from pathname /home/testgrid/cl-test-grid/work-dir/agent/quicklisp/dists/quicklisp/software/cl-fuse-20141217-git/cl-fuse.asd: External process exited with code 1. Command was: "cc" "-m32" "-I/home/testgrid/cl-test-grid/work-dir/agent/quicklisp/dists/quicklisp/software/cffi_0.15.0/" "-o" "/home/testgrid/cl-test-grid/work-dir/agent/quicklisp/dists/quicklisp/software/cl-fuse-20141217-git/fuse-grovel-result" "/home/testgrid/cl-test-grid/work-dir/agent/quicklisp/dists/quicklisp/software/cl-fuse-20141217-git/fuse-grovel-result.c" Output was: /home/testgrid/cl-test-grid/work-dir/agent/quicklisp/dists/quicklisp/software/cl-fuse-20141217-git/fuse-grovel-result.c:9:18: fatal error: fuse.h: No such file or directory compilation terminated.
sbcl-1.1.16-linux-x86
(LOAD query-fs FAIL) ASDF/FIND-SYSTEM:LOAD-SYSTEM-DEFINITION-ERROR : Error while trying to load definition for system cl-fuse from pathname /home/testgrid/cl-test-grid/work-dir/agent/quicklisp/dists/quicklisp/software/cl-fuse-20141217-git/cl-fuse.asd: External process exited with code 1. Command was: "cc" "-m32" "-I/home/testgrid/cl-test-grid/work-dir/agent/quicklisp/dists/quicklisp/software/cffi_0.15.0/" "-o" "/home/testgrid/cl-test-grid/work-dir/agent/quicklisp/dists/quicklisp/software/cl-fuse-20141217-git/fuse-grovel-result" "/home/testgrid/cl-test-grid/work-dir/agent/quicklisp/dists/quicklisp/software/cl-fuse-20141217-git/fuse-grovel-result.c" Output was: /home/testgrid/cl-test-grid/work-dir/agent/quicklisp/dists/quicklisp/software/cl-fuse-20141217-git/fuse-grovel-result.c:9:18: fatal error: fuse.h: No such file or directory compilation terminated.
(LOAD query-fs FAIL) ASDF/FIND-SYSTEM:LOAD-SYSTEM-DEFINITION-ERROR : Error while trying to load definition for system cl-fuse from pathname /home/testgrid/cl-test-grid/work-dir/agent/quicklisp/dists/quicklisp/software/cl-fuse-20141217-git/cl-fuse.asd: External process exited with code 1. Command was: "cc" "-m32" "-I/home/testgrid/cl-test-grid/work-dir/agent/quicklisp/dists/quicklisp/software/cffi_0.15.0/" "-o" "/home/testgrid/cl-test-grid/work-dir/agent/quicklisp/dists/quicklisp/software/cl-fuse-20141217-git/fuse-grovel-result" "/home/testgrid/cl-test-grid/work-dir/agent/quicklisp/dists/quicklisp/software/cl-fuse-20141217-git/fuse-grovel-result.c" Output was: /home/testgrid/cl-test-grid/work-dir/agent/quicklisp/dists/quicklisp/software/cl-fuse-20141217-git/fuse-grovel-result.c:9:18: fatal error: fuse.h: No such file or directory compilation terminated.
sbcl-1.2.3-linux-x64
(LOAD query-fs FAIL) ASDF/FIND-SYSTEM:LOAD-SYSTEM-DEFINITION-ERROR : Error while trying to load definition for system cl-fuse from pathname /home/hijarian/systems/cl-test-grid/work-dir/agent/quicklisp/dists/quicklisp/software/cl-fuse-20141217-git/cl-fuse.asd: External process exited with code 1. Command was: "cc" "-m64" "-I/home/hijarian/systems/cl-test-grid/work-dir/agent/quicklisp/dists/quicklisp/software/cffi_0.15.0/" "-o" "/home/hijarian/systems/cl-test-grid/work-dir/agent/quicklisp/dists/quicklisp/software/cl-fuse-20141217-git/fuse-grovel-result" "/home/hijarian/systems/cl-test-grid/work-dir/agent/quicklisp/dists/quicklisp/software/cl-fuse-20141217-git/fuse-grovel-result.c" Output was: /home/hijarian/systems/cl-test-grid/work-dir/agent/quicklisp/dists/quicklisp/software/cl-fuse-20141217-git/fuse-grovel-result.c:9:18: fatal error: fuse.h: Нет такого файла или каталога #include <fuse.h> ^ compilation terminated.
sbcl-1.2.6-linux-x86
(LOAD query-fs FAIL) ASDF/FIND-SYSTEM:LOAD-SYSTEM-DEFINITION-ERROR : Error while trying to load definition for system cl-fuse from pathname /home/testgrid/cl-test-grid/work-dir/agent/quicklisp/dists/quicklisp/software/cl-fuse-20141217-git/cl-fuse.asd: External process exited with code 1. Command was: "cc" "-m32" "-I/home/testgrid/cl-test-grid/work-dir/agent/quicklisp/dists/quicklisp/software/cffi_0.15.0/" "-o" "/home/testgrid/cl-test-grid/work-dir/agent/quicklisp/dists/quicklisp/software/cl-fuse-20141217-git/fuse-grovel-result" "/home/testgrid/cl-test-grid/work-dir/agent/quicklisp/dists/quicklisp/software/cl-fuse-20141217-git/fuse-grovel-result.c" Output was: /home/testgrid/cl-test-grid/work-dir/agent/quicklisp/dists/quicklisp/software/cl-fuse-20141217-git/fuse-grovel-result.c:9:18: fatal error: fuse.h: No such file or directory compilation terminated.
(LOAD query-fs FAIL) ASDF/FIND-SYSTEM:LOAD-SYSTEM-DEFINITION-ERROR : Error while trying to load definition for system cl-fuse from pathname /home/testgrid/cl-test-grid/work-dir/agent/quicklisp/dists/quicklisp/software/cl-fuse-20141217-git/cl-fuse.asd: External process exited with code 1. Command was: "cc" "-m32" "-I/home/testgrid/cl-test-grid/work-dir/agent/quicklisp/dists/quicklisp/software/cffi_0.15.0/" "-o" "/home/testgrid/cl-test-grid/work-dir/agent/quicklisp/dists/quicklisp/software/cl-fuse-20141217-git/fuse-grovel-result" "/home/testgrid/cl-test-grid/work-dir/agent/quicklisp/dists/quicklisp/software/cl-fuse-20141217-git/fuse-grovel-result.c" Output was: /home/testgrid/cl-test-grid/work-dir/agent/quicklisp/dists/quicklisp/software/cl-fuse-20141217-git/fuse-grovel-result.c:9:18: fatal error: fuse.h: No such file or directory compilation terminated.

Breakdown by testcases: for every failed testcase the lisp implmentations it fails on

The library does not have a testsuite adapter for CL Test Grid.

To reports overview

Generated at: 2015-07-23 12:59:49 GMT.