osicat results collected by cl-test-grid

Results on the last two Quicklisp distributions

 quicklisp 2016-03-18quicklisp 2016-02-08
abcl-1.2.1-fasl42-linux-x86
(LOAD osicat-tests FAIL) ASDF/FIND-SYSTEM:LOAD-SYSTEM-DEFINITION-ERROR : Error while trying to load definition for system osicat from pathname /home/testgrid/cl-test-grid/work-dir/agent/quicklisp/dists/quicklisp/software/osicat-20160318-git/osicat.asd: Error while trying to load definition for system cffi-toolchain from pathname /home/testgrid/cl-test-grid/work-dir/agent/quicklisp/dists/quicklisp/software/cffi_0.17.1/cffi-toolchain.asd: CFFI-toolchain requires ASDF 3.1!
(LOAD osicat FAIL) ASDF/FIND-SYSTEM:LOAD-SYSTEM-DEFINITION-ERROR : Error while trying to load definition for system osicat from pathname /home/testgrid/cl-test-grid/work-dir/agent/quicklisp/dists/quicklisp/software/osicat-20160318-git/osicat.asd: Error while trying to load definition for system cffi-toolchain from pathname /home/testgrid/cl-test-grid/work-dir/agent/quicklisp/dists/quicklisp/software/cffi_0.17.1/cffi-toolchain.asd: CFFI-toolchain requires ASDF 3.1!
abcl-1.3.0-fasl42-linux-x86
(LOAD osicat-tests FAIL) ASDF/FIND-SYSTEM:LOAD-SYSTEM-DEFINITION-ERROR : Error while trying to load definition for system osicat from pathname /home/testgrid/cl-test-grid/work-dir/agent/quicklisp/dists/quicklisp/software/osicat-20160318-git/osicat.asd: Component "asdf" does not match version 3.1.2, required by #<ASDF/SYSTEM:SYSTEM "cffi-toolchain">
(LOAD osicat FAIL) ASDF/FIND-SYSTEM:LOAD-SYSTEM-DEFINITION-ERROR : Error while trying to load definition for system osicat from pathname /home/testgrid/cl-test-grid/work-dir/agent/quicklisp/dists/quicklisp/software/osicat-20160318-git/osicat.asd: Component "asdf" does not match version 3.1.2, required by #<ASDF/SYSTEM:SYSTEM "cffi-toolchain">
abcl-1.3.1-fasl42-linux-x86
(LOAD osicat-tests FAIL) ASDF/FIND-SYSTEM:LOAD-SYSTEM-DEFINITION-ERROR : Error while trying to load definition for system osicat from pathname /home/testgrid/cl-test-grid/work-dir/agent/quicklisp/dists/quicklisp/software/osicat-20160318-git/osicat.asd: Component "asdf" does not match version 3.1.2, required by #<ASDF/SYSTEM:SYSTEM "cffi-toolchain">
(LOAD osicat FAIL) ASDF/FIND-SYSTEM:LOAD-SYSTEM-DEFINITION-ERROR : Error while trying to load definition for system osicat from pathname /home/testgrid/cl-test-grid/work-dir/agent/quicklisp/dists/quicklisp/software/osicat-20160318-git/osicat.asd: Component "asdf" does not match version 3.1.2, required by #<ASDF/SYSTEM:SYSTEM "cffi-toolchain">
abcl-1.3.2-fasl42-linux-x86
ccl-1.10-r16196-f101-linux-arm
ccl-1.10-r16196-f96-linux-x64
(LOAD osicat-tests FAIL) CCL::SIMPLE-PROGRAM-ERROR : Invalid program: In the form ((OS-UNIX-P) NIL), (OS-UNIX-P) is not a symbol or lambda expression.
(LOAD osicat FAIL) CCL::SIMPLE-PROGRAM-ERROR : Invalid program: In the form ((OS-UNIX-P) NIL), (OS-UNIX-P) is not a symbol or lambda expression.
ccl-1.10-r16196-f96-linux-x86
ccl-1.11-r16635-f96-linux-x86
ccl-1.11-r16635-f96-macosx-x64
(LOAD osicat-tests FAIL) ffi-grovel, CFFI-GROVEL:GROVEL-ERROR : External process exited with code 1. Command was: "cc" "-m64" "-I" "/opt/local/include/" "-I/Users/testgrid/cl-test-grid/work-dir/agent/quicklisp/dists/quicklisp/software/cffi_0.16.1/" "-bundle" "-fPIC" "-o" "/Users/testgrid/cl-test-grid/work-dir/agent/test-runs/20160220010916-ccl-1.11-r16635-f96-macosx-x64/fasl/ql/dists/quicklisp/software/osicat-20160208-git/posix/libosicat.dylib" "/Users/testgrid/cl-test-grid/work-dir/agent/test-runs/20160220010916-ccl-1.11-r16635-f96-macosx-x64/fasl/ql/dists/quicklisp/software/osicat-20160208-git/posix/wrappers.c" Output was: /Users/testgrid/cl-test-grid/work-dir/agent/test-runs/20160220010916-ccl-1.11-r16635-f96-macosx-x64/fasl/ql/dists/quicklisp/software/osicat-20160208-git/posix/wrappers.c:113:10: warning: implicit declaration of function 'posix_fallocate' is invalid in C99 [-Wimplicit-function-declaration] return posix_fallocate(fd, offset, length); ^ 1 warning generated. Undefined symbols for architecture x86_64: "_posix_fallocate", referenced from: _posix_fallocate_cffi_wrap in wrappers-6222f2.o (maybe you meant: _posix_fallocate_cffi_wrap) ld: symbol(s) not found for architecture x86_64 clang: error: linker command failed with exit code 1 (use -v to see invocation)
(LOAD osicat FAIL) ffi-grovel, CFFI-GROVEL:GROVEL-ERROR : External process exited with code 1. Command was: "cc" "-m64" "-I" "/opt/local/include/" "-I/Users/testgrid/cl-test-grid/work-dir/agent/quicklisp/dists/quicklisp/software/cffi_0.16.1/" "-bundle" "-fPIC" "-o" "/Users/testgrid/cl-test-grid/work-dir/agent/test-runs/20160220010916-ccl-1.11-r16635-f96-macosx-x64/fasl/ql/dists/quicklisp/software/osicat-20160208-git/posix/libosicat.dylib" "/Users/testgrid/cl-test-grid/work-dir/agent/test-runs/20160220010916-ccl-1.11-r16635-f96-macosx-x64/fasl/ql/dists/quicklisp/software/osicat-20160208-git/posix/wrappers.c" Output was: /Users/testgrid/cl-test-grid/work-dir/agent/test-runs/20160220010916-ccl-1.11-r16635-f96-macosx-x64/fasl/ql/dists/quicklisp/software/osicat-20160208-git/posix/wrappers.c:113:10: warning: implicit declaration of function 'posix_fallocate' is invalid in C99 [-Wimplicit-function-declaration] return posix_fallocate(fd, offset, length); ^ 1 warning generated. Undefined symbols for architecture x86_64: "_posix_fallocate", referenced from: _posix_fallocate_cffi_wrap in wrappers-e8b3cf.o (maybe you meant: _posix_fallocate_cffi_wrap) ld: symbol(s) not found for architecture x86_64 clang: error: linker command failed with exit code 1 (use -v to see invocation)
ccl-1.11-r16635-f96-macosx-x86
(LOAD osicat-tests FAIL) ffi-grovel, CFFI-GROVEL:GROVEL-ERROR : External process exited with code 1. Command was: "cc" "-m32" "-I" "/opt/local/include/" "-I/Users/testgrid/cl-test-grid/work-dir/agent/quicklisp/dists/quicklisp/software/cffi_0.16.1/" "-bundle" "-fPIC" "-o" "/Users/testgrid/cl-test-grid/work-dir/agent/test-runs/20160219210452-ccl-1.11-r16635-f96-macosx-x86/fasl/ql/dists/quicklisp/software/osicat-20160208-git/posix/libosicat.dylib" "/Users/testgrid/cl-test-grid/work-dir/agent/test-runs/20160219210452-ccl-1.11-r16635-f96-macosx-x86/fasl/ql/dists/quicklisp/software/osicat-20160208-git/posix/wrappers.c" Output was: /Users/testgrid/cl-test-grid/work-dir/agent/test-runs/20160219210452-ccl-1.11-r16635-f96-macosx-x86/fasl/ql/dists/quicklisp/software/osicat-20160208-git/posix/wrappers.c:113:10: warning: implicit declaration of function 'posix_fallocate' is invalid in C99 [-Wimplicit-function-declaration] return posix_fallocate(fd, offset, length); ^ 1 warning generated. Undefined symbols for architecture i386: "_posix_fallocate", referenced from: _posix_fallocate_cffi_wrap in wrappers-f3da7a.o (maybe you meant: _posix_fallocate_cffi_wrap) ld: symbol(s) not found for architecture i386 clang: error: linker command failed with exit code 1 (use -v to see invocation)
(LOAD osicat FAIL) ffi-grovel, CFFI-GROVEL:GROVEL-ERROR : External process exited with code 1. Command was: "cc" "-m32" "-I" "/opt/local/include/" "-I/Users/testgrid/cl-test-grid/work-dir/agent/quicklisp/dists/quicklisp/software/cffi_0.16.1/" "-bundle" "-fPIC" "-o" "/Users/testgrid/cl-test-grid/work-dir/agent/test-runs/20160219210452-ccl-1.11-r16635-f96-macosx-x86/fasl/ql/dists/quicklisp/software/osicat-20160208-git/posix/libosicat.dylib" "/Users/testgrid/cl-test-grid/work-dir/agent/test-runs/20160219210452-ccl-1.11-r16635-f96-macosx-x86/fasl/ql/dists/quicklisp/software/osicat-20160208-git/posix/wrappers.c" Output was: /Users/testgrid/cl-test-grid/work-dir/agent/test-runs/20160219210452-ccl-1.11-r16635-f96-macosx-x86/fasl/ql/dists/quicklisp/software/osicat-20160208-git/posix/wrappers.c:113:10: warning: implicit declaration of function 'posix_fallocate' is invalid in C99 [-Wimplicit-function-declaration] return posix_fallocate(fd, offset, length); ^ 1 warning generated. Undefined symbols for architecture i386: "_posix_fallocate", referenced from: _posix_fallocate_cffi_wrap in wrappers-b47dac.o (maybe you meant: _posix_fallocate_cffi_wrap) ld: symbol(s) not found for architecture i386 clang: error: linker command failed with exit code 1 (use -v to see invocation)
ccl-1.11-r16702m-f101-linux-arm
ccl-1.11-rc1-r16536-f101-linux-arm
ccl-1.11-rc1-r16536-f96-linux-x86
ccl-1.8-r15286m-f95-linux-x86
(LOAD osicat-tests FAIL) ASDF:LOAD-SYSTEM-DEFINITION-ERROR : Error while trying to load definition for system osicat from pathname /home/testgrid/cl-test-grid/work-dir/agent/quicklisp/dists/quicklisp/software/osicat-20160318-git/osicat.asd: Error while trying to load definition for system cffi-toolchain from pathname /home/testgrid/cl-test-grid/work-dir/agent/quicklisp/dists/quicklisp/software/cffi_0.17.1/cffi-toolchain.asd: CFFI-toolchain requires ASDF 3.1!
(LOAD osicat FAIL) ASDF:LOAD-SYSTEM-DEFINITION-ERROR : Error while trying to load definition for system osicat from pathname /home/testgrid/cl-test-grid/work-dir/agent/quicklisp/dists/quicklisp/software/osicat-20160318-git/osicat.asd: Error while trying to load definition for system cffi-toolchain from pathname /home/testgrid/cl-test-grid/work-dir/agent/quicklisp/dists/quicklisp/software/cffi_0.17.1/cffi-toolchain.asd: CFFI-toolchain requires ASDF 3.1!
ccl-1.8-r15286m-f97-linux-arm
(LOAD osicat-tests FAIL) ASDF:LOAD-SYSTEM-DEFINITION-ERROR : Error while trying to load definition for system osicat from pathname /home/testgrid/cl-test-grid/work-dir/agent/quicklisp/dists/quicklisp/software/osicat-20160318-git/osicat.asd: Error while trying to load definition for system cffi-toolchain from pathname /home/testgrid/cl-test-grid/work-dir/agent/quicklisp/dists/quicklisp/software/cffi_0.17.1/cffi-toolchain.asd: CFFI-toolchain requires ASDF 3.1!
(LOAD osicat FAIL) ASDF:LOAD-SYSTEM-DEFINITION-ERROR : Error while trying to load definition for system osicat from pathname /home/testgrid/cl-test-grid/work-dir/agent/quicklisp/dists/quicklisp/software/osicat-20160318-git/osicat.asd: Error while trying to load definition for system cffi-toolchain from pathname /home/testgrid/cl-test-grid/work-dir/agent/quicklisp/dists/quicklisp/software/cffi_0.17.1/cffi-toolchain.asd: CFFI-toolchain requires ASDF 3.1!
ccl-1.9-r15756-f96-linux-x86
(LOAD osicat-tests FAIL) ASDF/FIND-SYSTEM:LOAD-SYSTEM-DEFINITION-ERROR : Error while trying to load definition for system osicat from pathname /home/testgrid/cl-test-grid/work-dir/agent/quicklisp/dists/quicklisp/software/osicat-20160318-git/osicat.asd: Error while trying to load definition for system cffi-toolchain from pathname /home/testgrid/cl-test-grid/work-dir/agent/quicklisp/dists/quicklisp/software/cffi_0.17.1/cffi-toolchain.asd: CFFI-toolchain requires ASDF 3.1!
(LOAD osicat FAIL) ASDF/FIND-SYSTEM:LOAD-SYSTEM-DEFINITION-ERROR : Error while trying to load definition for system osicat from pathname /home/testgrid/cl-test-grid/work-dir/agent/quicklisp/dists/quicklisp/software/osicat-20160318-git/osicat.asd: Error while trying to load definition for system cffi-toolchain from pathname /home/testgrid/cl-test-grid/work-dir/agent/quicklisp/dists/quicklisp/software/cffi_0.17.1/cffi-toolchain.asd: CFFI-toolchain requires ASDF 3.1!
ccl-1.9-r15767-f99-linux-arm
(LOAD osicat-tests FAIL) ASDF/FIND-SYSTEM:LOAD-SYSTEM-DEFINITION-ERROR : Error while trying to load definition for system osicat from pathname /home/testgrid/cl-test-grid/work-dir/agent/quicklisp/dists/quicklisp/software/osicat-20160318-git/osicat.asd: Error while trying to load definition for system cffi-toolchain from pathname /home/testgrid/cl-test-grid/work-dir/agent/quicklisp/dists/quicklisp/software/cffi_0.17.1/cffi-toolchain.asd: CFFI-toolchain requires ASDF 3.1!
(LOAD osicat FAIL) ASDF/FIND-SYSTEM:LOAD-SYSTEM-DEFINITION-ERROR : Error while trying to load definition for system osicat from pathname /home/testgrid/cl-test-grid/work-dir/agent/quicklisp/dists/quicklisp/software/osicat-20160318-git/osicat.asd: Error while trying to load definition for system cffi-toolchain from pathname /home/testgrid/cl-test-grid/work-dir/agent/quicklisp/dists/quicklisp/software/cffi_0.17.1/cffi-toolchain.asd: CFFI-toolchain requires ASDF 3.1!
clisp-2.49-unix-armv7l
(LOAD osicat-tests FAIL) ASDF:LOAD-SYSTEM-DEFINITION-ERROR : Error while trying to load definition for system osicat from pathname /home/testgrid/cl-test-grid/work-dir/agent/quicklisp/dists/quicklisp/software/osicat-20160318-git/osicat.asd: Error while trying to load definition for system cffi-toolchain from pathname /home/testgrid/cl-test-grid/work-dir/agent/quicklisp/dists/quicklisp/software/cffi_0.17.1/cffi-toolchain.asd: CFFI-toolchain requires ASDF 3.1!
(LOAD osicat FAIL) ASDF:LOAD-SYSTEM-DEFINITION-ERROR : Error while trying to load definition for system osicat from pathname /home/testgrid/cl-test-grid/work-dir/agent/quicklisp/dists/quicklisp/software/osicat-20160318-git/osicat.asd: Error while trying to load definition for system cffi-toolchain from pathname /home/testgrid/cl-test-grid/work-dir/agent/quicklisp/dists/quicklisp/software/cffi_0.17.1/cffi-toolchain.asd: CFFI-toolchain requires ASDF 3.1!
(LOAD osicat-tests FAIL) ffi-grovel, CFFI-GROVEL:GROVEL-ERROR : External process exited with code 1. Command was: "cc" "-m32" "-I/home/testgrid/cl-test-grid/work-dir/agent/quicklisp/dists/quicklisp/software/cffi_0.16.1/" "-o" "/home/testgrid/cl-test-grid/work-dir/agent/test-runs/20160217083144-clisp-2.49-unix-armv7l/fasl/ql/dists/quicklisp/software/osicat-20160208-git/posix/basic-unixint" "/home/testgrid/cl-test-grid/work-dir/agent/test-runs/20160217083144-clisp-2.49-unix-armv7l/fasl/ql/dists/quicklisp/software/osicat-20160208-git/posix/basic-unixint.c" Output was:
(LOAD osicat FAIL) ffi-grovel, CFFI-GROVEL:GROVEL-ERROR : External process exited with code 1. Command was: "cc" "-m32" "-I/home/testgrid/cl-test-grid/work-dir/agent/quicklisp/dists/quicklisp/software/cffi_0.16.1/" "-o" "/home/testgrid/cl-test-grid/work-dir/agent/test-runs/20160217083144-clisp-2.49-unix-armv7l/fasl/ql/dists/quicklisp/software/osicat-20160208-git/posix/basic-unixint" "/home/testgrid/cl-test-grid/work-dir/agent/test-runs/20160217083144-clisp-2.49-unix-armv7l/fasl/ql/dists/quicklisp/software/osicat-20160208-git/posix/basic-unixint.c" Output was:
clisp-2.49-unix-x86
(LOAD osicat-tests FAIL) ASDF:LOAD-SYSTEM-DEFINITION-ERROR : Error while trying to load definition for system osicat from pathname /home/testgrid/cl-test-grid/work-dir/agent/quicklisp/dists/quicklisp/software/osicat-20160318-git/osicat.asd: Error while trying to load definition for system cffi-toolchain from pathname /home/testgrid/cl-test-grid/work-dir/agent/quicklisp/dists/quicklisp/software/cffi_0.17.1/cffi-toolchain.asd: CFFI-toolchain requires ASDF 3.1!
(LOAD osicat FAIL) ASDF:LOAD-SYSTEM-DEFINITION-ERROR : Error while trying to load definition for system osicat from pathname /home/testgrid/cl-test-grid/work-dir/agent/quicklisp/dists/quicklisp/software/osicat-20160318-git/osicat.asd: Error while trying to load definition for system cffi-toolchain from pathname /home/testgrid/cl-test-grid/work-dir/agent/quicklisp/dists/quicklisp/software/cffi_0.17.1/cffi-toolchain.asd: CFFI-toolchain requires ASDF 3.1!
cmu-snapshot-2013-04__20d_unicode_-linux-x86
(LOAD osicat-tests FAIL) ASDF/FIND-SYSTEM:LOAD-SYSTEM-DEFINITION-ERROR : Error while trying to load definition for system osicat from pathname /home/testgrid/cl-test-grid/work-dir/agent/quicklisp/dists/quicklisp/software/osicat-20160318-git/osicat.asd: Error while trying to load definition for system cffi-toolchain from pathname /home/testgrid/cl-test-grid/work-dir/agent/quicklisp/dists/quicklisp/software/cffi_0.17.1/cffi-toolchain.asd: Error in function LISP::SLOLOAD: CFFI-toolchain requires ASDF 3.1!
(LOAD osicat FAIL) ASDF/FIND-SYSTEM:LOAD-SYSTEM-DEFINITION-ERROR : Error while trying to load definition for system osicat from pathname /home/testgrid/cl-test-grid/work-dir/agent/quicklisp/dists/quicklisp/software/osicat-20160318-git/osicat.asd: Error while trying to load definition for system cffi-toolchain from pathname /home/testgrid/cl-test-grid/work-dir/agent/quicklisp/dists/quicklisp/software/cffi_0.17.1/cffi-toolchain.asd: Error in function LISP::SLOLOAD: CFFI-toolchain requires ASDF 3.1!
cmu-snapshot-2014-01__20e_unicode_-linux-x86
(LOAD osicat-tests FAIL) ASDF/FIND-SYSTEM:LOAD-SYSTEM-DEFINITION-ERROR : Error while trying to load definition for system osicat from pathname /home/testgrid/cl-test-grid/work-dir/agent/quicklisp/dists/quicklisp/software/osicat-20160318-git/osicat.asd: Error while trying to load definition for system cffi-toolchain from pathname /home/testgrid/cl-test-grid/work-dir/agent/quicklisp/dists/quicklisp/software/cffi_0.17.1/cffi-toolchain.asd: Error in function LISP::SLOLOAD: CFFI-toolchain requires ASDF 3.1!
(LOAD osicat FAIL) ASDF/FIND-SYSTEM:LOAD-SYSTEM-DEFINITION-ERROR : Error while trying to load definition for system osicat from pathname /home/testgrid/cl-test-grid/work-dir/agent/quicklisp/dists/quicklisp/software/osicat-20160318-git/osicat.asd: Error while trying to load definition for system cffi-toolchain from pathname /home/testgrid/cl-test-grid/work-dir/agent/quicklisp/dists/quicklisp/software/cffi_0.17.1/cffi-toolchain.asd: Error in function LISP::SLOLOAD: CFFI-toolchain requires ASDF 3.1!
cmu-snapshot-2014-05-dirty__20e_unicode_-linux-x86
(LOAD osicat-tests FAIL) ASDF/FIND-SYSTEM:LOAD-SYSTEM-DEFINITION-ERROR : Error while trying to load definition for system osicat from pathname /home/testgrid/cl-test-grid/work-dir/agent/quicklisp/dists/quicklisp/software/osicat-20160318-git/osicat.asd: Error while trying to load definition for system cffi-toolchain from pathname /home/testgrid/cl-test-grid/work-dir/agent/quicklisp/dists/quicklisp/software/cffi_0.17.1/cffi-toolchain.asd: Error in function LISP::SLOLOAD: CFFI-toolchain requires ASDF 3.1!
(LOAD osicat FAIL) ASDF/FIND-SYSTEM:LOAD-SYSTEM-DEFINITION-ERROR : Error while trying to load definition for system osicat from pathname /home/testgrid/cl-test-grid/work-dir/agent/quicklisp/dists/quicklisp/software/osicat-20160318-git/osicat.asd: Error while trying to load definition for system cffi-toolchain from pathname /home/testgrid/cl-test-grid/work-dir/agent/quicklisp/dists/quicklisp/software/cffi_0.17.1/cffi-toolchain.asd: Error in function LISP::SLOLOAD: CFFI-toolchain requires ASDF 3.1!
cmu-snapshot-2014-12___20f_unicode_-linux-x86
(LOAD osicat-tests FAIL) ASDF/FIND-SYSTEM:LOAD-SYSTEM-DEFINITION-ERROR : Error while trying to load definition for system osicat from pathname /home/testgrid/cl-test-grid/work-dir/agent/quicklisp/dists/quicklisp/software/osicat-20160318-git/osicat.asd: (during macroexpansion) Error in FDEFINITION: the function GATHER-TYPE is undefined.
(LOAD osicat FAIL) ASDF/FIND-SYSTEM:LOAD-SYSTEM-DEFINITION-ERROR : Error while trying to load definition for system osicat from pathname /home/testgrid/cl-test-grid/work-dir/agent/quicklisp/dists/quicklisp/software/osicat-20160318-git/osicat.asd: (during macroexpansion) Error in FDEFINITION: the function GATHER-TYPE is undefined.
ecl-13.5.1-unknown-linux-i686-bytecode
(LOAD osicat-tests FAIL) ASDF/FIND-SYSTEM:LOAD-SYSTEM-DEFINITION-ERROR : Error while trying to load definition for system osicat from pathname /home/testgrid/cl-test-grid/work-dir/agent/quicklisp/dists/quicklisp/software/osicat-20160318-git/osicat.asd: Error while trying to load definition for system cffi-toolchain from pathname /home/testgrid/cl-test-grid/work-dir/agent/quicklisp/dists/quicklisp/software/cffi_0.17.1/cffi-toolchain.asd: CFFI-toolchain requires ASDF 3.1!
(LOAD osicat FAIL) ASDF/FIND-SYSTEM:LOAD-SYSTEM-DEFINITION-ERROR : Error while trying to load definition for system osicat from pathname /home/testgrid/cl-test-grid/work-dir/agent/quicklisp/dists/quicklisp/software/osicat-20160318-git/osicat.asd: Error while trying to load definition for system cffi-toolchain from pathname /home/testgrid/cl-test-grid/work-dir/agent/quicklisp/dists/quicklisp/software/cffi_0.17.1/cffi-toolchain.asd: CFFI-toolchain requires ASDF 3.1!
ecl-13.5.1-unknown-linux-i686-lisp-to-c
(LOAD osicat-tests FAIL) ASDF/FIND-SYSTEM:LOAD-SYSTEM-DEFINITION-ERROR : Error while trying to load definition for system osicat from pathname /home/testgrid/cl-test-grid/work-dir/agent/quicklisp/dists/quicklisp/software/osicat-20160318-git/osicat.asd: Error while trying to load definition for system cffi-toolchain from pathname /home/testgrid/cl-test-grid/work-dir/agent/quicklisp/dists/quicklisp/software/cffi_0.17.1/cffi-toolchain.asd: CFFI-toolchain requires ASDF 3.1!
(LOAD osicat FAIL) ASDF/FIND-SYSTEM:LOAD-SYSTEM-DEFINITION-ERROR : Error while trying to load definition for system osicat from pathname /home/testgrid/cl-test-grid/work-dir/agent/quicklisp/dists/quicklisp/software/osicat-20160318-git/osicat.asd: Error while trying to load definition for system cffi-toolchain from pathname /home/testgrid/cl-test-grid/work-dir/agent/quicklisp/dists/quicklisp/software/cffi_0.17.1/cffi-toolchain.asd: CFFI-toolchain requires ASDF 3.1!
ecl-15.2.21-ee989b97-linux-i686-bytecode
(LOAD osicat-tests FAIL) ASDF/FIND-SYSTEM:LOAD-SYSTEM-DEFINITION-ERROR : Error while trying to load definition for system osicat from pathname /home/testgrid/cl-test-grid/work-dir/agent/quicklisp/dists/quicklisp/software/osicat-20160318-git/osicat.asd: The variable C::*CC-FLAGS* is unbound.
(LOAD osicat FAIL) ASDF/FIND-SYSTEM:LOAD-SYSTEM-DEFINITION-ERROR : Error while trying to load definition for system osicat from pathname /home/testgrid/cl-test-grid/work-dir/agent/quicklisp/dists/quicklisp/software/osicat-20160318-git/osicat.asd: The variable C::*CC-FLAGS* is unbound.
(LOAD osicat-tests FAIL) ASDF/FIND-SYSTEM:LOAD-SYSTEM-DEFINITION-ERROR : Error while trying to load definition for system osicat from pathname /home/testgrid/cl-test-grid/work-dir/agent/quicklisp/dists/quicklisp/software/osicat-20160208-git/osicat.asd: The variable C::*CC-FLAGS* is unbound.
(LOAD osicat FAIL) ASDF/FIND-SYSTEM:LOAD-SYSTEM-DEFINITION-ERROR : Error while trying to load definition for system osicat from pathname /home/testgrid/cl-test-grid/work-dir/agent/quicklisp/dists/quicklisp/software/osicat-20160208-git/osicat.asd: The variable C::*CC-FLAGS* is unbound.
ecl-15.2.21-ee989b97-linux-i686-lisp-to-c
ecl-15.2.21-ee989b97-linux-x64-bytecode
(LOAD osicat-tests FAIL) ASDF/FIND-SYSTEM:LOAD-SYSTEM-DEFINITION-ERROR : Error while trying to load definition for system osicat from pathname /home/hijarian/systems/cl-test-grid/work-dir/agent/quicklisp/dists/quicklisp/software/osicat-20160318-git/osicat.asd: In form ((OS-UNIX-P) "o") FUNCTION: Not a valid argument (OS-UNIX-P).
(LOAD osicat FAIL) ASDF/FIND-SYSTEM:LOAD-SYSTEM-DEFINITION-ERROR : Error while trying to load definition for system osicat from pathname /home/hijarian/systems/cl-test-grid/work-dir/agent/quicklisp/dists/quicklisp/software/osicat-20160318-git/osicat.asd: In form ((OS-UNIX-P) "o") FUNCTION: Not a valid argument (OS-UNIX-P).
(LOAD osicat-tests FAIL) ASDF/FIND-SYSTEM:LOAD-SYSTEM-DEFINITION-ERROR : Error while trying to load definition for system osicat from pathname /home/hijarian/systems/cl-test-grid/work-dir/agent/quicklisp/dists/quicklisp/software/osicat-20160208-git/osicat.asd: The variable C::*CC-FLAGS* is unbound.
(LOAD osicat FAIL) ASDF/FIND-SYSTEM:LOAD-SYSTEM-DEFINITION-ERROR : Error while trying to load definition for system osicat from pathname /home/hijarian/systems/cl-test-grid/work-dir/agent/quicklisp/dists/quicklisp/software/osicat-20160208-git/osicat.asd: The variable C::*CC-FLAGS* is unbound.
(LOAD osicat-tests FAIL) ASDF/FIND-SYSTEM:LOAD-SYSTEM-DEFINITION-ERROR : Error while trying to load definition for system osicat from pathname /home/hijarian/systems/cl-test-grid/work-dir/agent/quicklisp/dists/quicklisp/software/osicat-20160208-git/osicat.asd: The variable C::*CC-FLAGS* is unbound.
(LOAD osicat FAIL) ASDF/FIND-SYSTEM:LOAD-SYSTEM-DEFINITION-ERROR : Error while trying to load definition for system osicat from pathname /home/hijarian/systems/cl-test-grid/work-dir/agent/quicklisp/dists/quicklisp/software/osicat-20160208-git/osicat.asd: The variable C::*CC-FLAGS* is unbound.
ecl-15.2.21-ee989b97-linux-x64-lisp-to-c
(LOAD osicat-tests FAIL) ASDF/FIND-SYSTEM:LOAD-SYSTEM-DEFINITION-ERROR : Error while trying to load definition for system osicat from pathname /home/hijarian/systems/cl-test-grid/work-dir/agent/quicklisp/dists/quicklisp/software/osicat-20160318-git/osicat.asd: COMPILE-FILE-ERROR while compiling #<cl-source-file "cffi-toolchain" "toolchain" "asdf-compat">
(LOAD osicat FAIL) ASDF/FIND-SYSTEM:LOAD-SYSTEM-DEFINITION-ERROR : Error while trying to load definition for system osicat from pathname /home/hijarian/systems/cl-test-grid/work-dir/agent/quicklisp/dists/quicklisp/software/osicat-20160318-git/osicat.asd: COMPILE-FILE-ERROR while compiling #<cl-source-file "cffi-toolchain" "toolchain" "asdf-compat">
ecl-16.0.0-98fc12d3-linux-i686-bytecode
(LOAD osicat-tests FAIL) ASDF/FIND-SYSTEM:LOAD-SYSTEM-DEFINITION-ERROR : Error while trying to load definition for system osicat from pathname /home/testgrid/cl-test-grid/work-dir/agent/quicklisp/dists/quicklisp/software/osicat-20160318-git/osicat.asd: The variable C::*CC-FLAGS* is unbound.
(LOAD osicat FAIL) ASDF/FIND-SYSTEM:LOAD-SYSTEM-DEFINITION-ERROR : Error while trying to load definition for system osicat from pathname /home/testgrid/cl-test-grid/work-dir/agent/quicklisp/dists/quicklisp/software/osicat-20160318-git/osicat.asd: The variable C::*CC-FLAGS* is unbound.
(LOAD osicat-tests FAIL) ASDF/FIND-SYSTEM:LOAD-SYSTEM-DEFINITION-ERROR : Error while trying to load definition for system osicat from pathname /home/testgrid/cl-test-grid/work-dir/agent/quicklisp/dists/quicklisp/software/osicat-20160208-git/osicat.asd: The variable C::*CC-FLAGS* is unbound.
(LOAD osicat FAIL) ASDF/FIND-SYSTEM:LOAD-SYSTEM-DEFINITION-ERROR : Error while trying to load definition for system osicat from pathname /home/testgrid/cl-test-grid/work-dir/agent/quicklisp/dists/quicklisp/software/osicat-20160208-git/osicat.asd: The variable C::*CC-FLAGS* is unbound.
ecl-16.0.0-98fc12d3-linux-i686-lisp-to-c
ecl-16.0.0-b2661fd1-linux-x64-bytecode
(LOAD osicat-tests FAIL) ASDF/FIND-SYSTEM:LOAD-SYSTEM-DEFINITION-ERROR : Error while trying to load definition for system osicat from pathname /home/jack/quicklisp/local-projects/cl-test-grid/work-dir/agent/quicklisp/dists/quicklisp/software/osicat-20160208-git/osicat.asd: The variable C::*CC-FLAGS* is unbound.
(LOAD osicat FAIL) ASDF/FIND-SYSTEM:LOAD-SYSTEM-DEFINITION-ERROR : Error while trying to load definition for system osicat from pathname /home/jack/quicklisp/local-projects/cl-test-grid/work-dir/agent/quicklisp/dists/quicklisp/software/osicat-20160208-git/osicat.asd: The variable C::*CC-FLAGS* is unbound.
ecl-16.0.0-b2661fd1-linux-x64-lisp-to-c
ecl-16.0.0-b2661fd1-macosx-x64-bytecode
(LOAD osicat-tests FAIL) ASDF/FIND-SYSTEM:LOAD-SYSTEM-DEFINITION-ERROR : Error while trying to load definition for system osicat from pathname /Users/testgrid/cl-test-grid/work-dir/agent/quicklisp/dists/quicklisp/software/osicat-20160208-git/osicat.asd: The variable C::*CC-FLAGS* is unbound.
(LOAD osicat FAIL) ASDF/FIND-SYSTEM:LOAD-SYSTEM-DEFINITION-ERROR : Error while trying to load definition for system osicat from pathname /Users/testgrid/cl-test-grid/work-dir/agent/quicklisp/dists/quicklisp/software/osicat-20160208-git/osicat.asd: The variable C::*CC-FLAGS* is unbound.
ecl-16.0.0-b2661fd1-macosx-x64-lisp-to-c
(LOAD osicat-tests FAIL) ffi-grovel, CFFI-GROVEL:GROVEL-ERROR : External process exited with code 1. Command was: "cc" "-m64" "-I" "/opt/local/include/" " -g -O2 -fPIC -fno-common -D_THREAD_SAFE -Ddarwin" "-I/Users/testgrid/cl-test-grid/work-dir/agent/quicklisp/dists/quicklisp/software/cffi_0.16.1/" "-bundle" "-fPIC" "-o" "/Users/testgrid/cl-test-grid/work-dir/agent/test-runs/20160220134238-ecl-16.0.0-b2661fd1-macosx-x64-lisp-to-c/fasl/ql/dists/quicklisp/software/osicat-20160208-git/posix/libosicat.dylib" "/Users/testgrid/cl-test-grid/work-dir/agent/test-runs/20160220134238-ecl-16.0.0-b2661fd1-macosx-x64-lisp-to-c/fasl/ql/dists/quicklisp/software/osicat-20160208-git/posix/wrappers.c" Output was:
(LOAD osicat FAIL) ffi-grovel, CFFI-GROVEL:GROVEL-ERROR : External process exited with code 1. Command was: "cc" "-m64" "-I" "/opt/local/include/" " -g -O2 -fPIC -fno-common -D_THREAD_SAFE -Ddarwin" "-I/Users/testgrid/cl-test-grid/work-dir/agent/quicklisp/dists/quicklisp/software/cffi_0.16.1/" "-bundle" "-fPIC" "-o" "/Users/testgrid/cl-test-grid/work-dir/agent/test-runs/20160220134238-ecl-16.0.0-b2661fd1-macosx-x64-lisp-to-c/fasl/ql/dists/quicklisp/software/osicat-20160208-git/posix/libosicat.dylib" "/Users/testgrid/cl-test-grid/work-dir/agent/test-runs/20160220134238-ecl-16.0.0-b2661fd1-macosx-x64-lisp-to-c/fasl/ql/dists/quicklisp/software/osicat-20160208-git/posix/wrappers.c" Output was:
ecl-16.1.2-rc2-093ba0ab-linux-x64-bytecode
(LOAD osicat-tests FAIL) ASDF/FIND-SYSTEM:LOAD-SYSTEM-DEFINITION-ERROR : Error while trying to load definition for system osicat from pathname /home/jack/quicklisp/local-projects/cl-test-grid/work-dir/agent/quicklisp/dists/quicklisp/software/osicat-20160208-git/osicat.asd: The variable C::*CC-FLAGS* is unbound.
(LOAD osicat FAIL) ASDF/FIND-SYSTEM:LOAD-SYSTEM-DEFINITION-ERROR : Error while trying to load definition for system osicat from pathname /home/jack/quicklisp/local-projects/cl-test-grid/work-dir/agent/quicklisp/dists/quicklisp/software/osicat-20160208-git/osicat.asd: The variable C::*CC-FLAGS* is unbound.
ecl-16.1.2-rc2-093ba0ab-linux-x64-lisp-to-c
ecl-16.1.2-rc3-9e5a61f4-linux-x64-bytecode
(LOAD osicat-tests FAIL) ASDF/FIND-SYSTEM:LOAD-SYSTEM-DEFINITION-ERROR : Error while trying to load definition for system osicat from pathname /home/jack/Projekty/lisp-systems/cl-test-grid/work-dir/agent/quicklisp/dists/quicklisp/software/osicat-20160208-git/osicat.asd: The variable C::*CC-FLAGS* is unbound.
(LOAD osicat FAIL) ASDF/FIND-SYSTEM:LOAD-SYSTEM-DEFINITION-ERROR : Error while trying to load definition for system osicat from pathname /home/jack/Projekty/lisp-systems/cl-test-grid/work-dir/agent/quicklisp/dists/quicklisp/software/osicat-20160208-git/osicat.asd: The variable C::*CC-FLAGS* is unbound.
ecl-16.1.2-rc3-9e5a61f4-linux-x64-lisp-to-c
sbcl-1.0.58-linux-x86
(LOAD osicat-tests FAIL) ASDF:LOAD-SYSTEM-DEFINITION-ERROR : Error while trying to load definition for system osicat from pathname /home/testgrid/cl-test-grid/work-dir/agent/quicklisp/dists/quicklisp/software/osicat-20160318-git/osicat.asd: Error while trying to load definition for system cffi-toolchain from pathname /home/testgrid/cl-test-grid/work-dir/agent/quicklisp/dists/quicklisp/software/cffi_0.17.1/cffi-toolchain.asd: CFFI-toolchain requires ASDF 3.1!
(LOAD osicat FAIL) ASDF:LOAD-SYSTEM-DEFINITION-ERROR : Error while trying to load definition for system osicat from pathname /home/testgrid/cl-test-grid/work-dir/agent/quicklisp/dists/quicklisp/software/osicat-20160318-git/osicat.asd: Error while trying to load definition for system cffi-toolchain from pathname /home/testgrid/cl-test-grid/work-dir/agent/quicklisp/dists/quicklisp/software/cffi_0.17.1/cffi-toolchain.asd: CFFI-toolchain requires ASDF 3.1!
(LOAD osicat-tests FAIL) ASDF:LOAD-SYSTEM-DEFINITION-ERROR : Error while trying to load definition for system osicat from pathname /home/testgrid/cl-test-grid/work-dir/agent/quicklisp/dists/quicklisp/software/osicat-20160208-git/osicat.asd: Error while invoking #<COMPILE-OP NIL {B5D1EB1}> on #<CL-SOURCE-FILE "uiop" "image">
(LOAD osicat FAIL) ASDF:LOAD-SYSTEM-DEFINITION-ERROR : Error while trying to load definition for system osicat from pathname /home/testgrid/cl-test-grid/work-dir/agent/quicklisp/dists/quicklisp/software/osicat-20160208-git/osicat.asd: Error while invoking #<COMPILE-OP NIL {B462C71}> on #<CL-SOURCE-FILE "uiop" "image">
sbcl-1.1.11-linux-x86
(LOAD osicat-tests FAIL) ASDF/FIND-SYSTEM:LOAD-SYSTEM-DEFINITION-ERROR : Error while trying to load definition for system osicat from pathname /home/testgrid/cl-test-grid/work-dir/agent/quicklisp/dists/quicklisp/software/osicat-20160318-git/osicat.asd: Error while trying to load definition for system cffi-toolchain from pathname /home/testgrid/cl-test-grid/work-dir/agent/quicklisp/dists/quicklisp/software/cffi_0.17.1/cffi-toolchain.asd: CFFI-toolchain requires ASDF 3.1!
(LOAD osicat FAIL) ASDF/FIND-SYSTEM:LOAD-SYSTEM-DEFINITION-ERROR : Error while trying to load definition for system osicat from pathname /home/testgrid/cl-test-grid/work-dir/agent/quicklisp/dists/quicklisp/software/osicat-20160318-git/osicat.asd: Error while trying to load definition for system cffi-toolchain from pathname /home/testgrid/cl-test-grid/work-dir/agent/quicklisp/dists/quicklisp/software/cffi_0.17.1/cffi-toolchain.asd: CFFI-toolchain requires ASDF 3.1!
sbcl-1.1.16-linux-x86
(LOAD osicat-tests FAIL) ASDF/FIND-SYSTEM:LOAD-SYSTEM-DEFINITION-ERROR : Error while trying to load definition for system osicat from pathname /home/testgrid/cl-test-grid/work-dir/agent/quicklisp/dists/quicklisp/software/osicat-20160318-git/osicat.asd: Error while trying to load definition for system cffi-toolchain from pathname /home/testgrid/cl-test-grid/work-dir/agent/quicklisp/dists/quicklisp/software/cffi_0.17.1/cffi-toolchain.asd: CFFI-toolchain requires ASDF 3.1!
(LOAD osicat FAIL) ASDF/FIND-SYSTEM:LOAD-SYSTEM-DEFINITION-ERROR : Error while trying to load definition for system osicat from pathname /home/testgrid/cl-test-grid/work-dir/agent/quicklisp/dists/quicklisp/software/osicat-20160318-git/osicat.asd: Error while trying to load definition for system cffi-toolchain from pathname /home/testgrid/cl-test-grid/work-dir/agent/quicklisp/dists/quicklisp/software/cffi_0.17.1/cffi-toolchain.asd: CFFI-toolchain requires ASDF 3.1!
sbcl-1.2.14-linux-arm
(LOAD osicat-tests FAIL) ASDF/FIND-SYSTEM:LOAD-SYSTEM-DEFINITION-ERROR : Error while trying to load definition for system osicat from pathname /home/testgrid/cl-test-grid/work-dir/agent/quicklisp/dists/quicklisp/software/osicat-20160318-git/osicat.asd: COMPILE-FILE-ERROR while compiling #<CL-SOURCE-FILE "cffi-toolchain" "toolchain" "c-toolchain">
(LOAD osicat FAIL) ASDF/FIND-SYSTEM:LOAD-SYSTEM-DEFINITION-ERROR : Error while trying to load definition for system osicat from pathname /home/testgrid/cl-test-grid/work-dir/agent/quicklisp/dists/quicklisp/software/osicat-20160318-git/osicat.asd: COMPILE-FILE-ERROR while compiling #<CL-SOURCE-FILE "cffi-toolchain" "toolchain" "c-toolchain">
sbcl-1.2.3-linux-x64
(LOAD osicat-tests FAIL) ASDF/FIND-SYSTEM:LOAD-SYSTEM-DEFINITION-ERROR : Error while trying to load definition for system osicat from pathname /home/hijarian/systems/cl-test-grid/work-dir/agent/quicklisp/dists/quicklisp/software/osicat-20160318-git/osicat.asd: COMPILE-FILE-ERROR while compiling #<CL-SOURCE-FILE "cffi-toolchain" "toolchain" "asdf-compat">
(LOAD osicat FAIL) ASDF/FIND-SYSTEM:LOAD-SYSTEM-DEFINITION-ERROR : Error while trying to load definition for system osicat from pathname /home/hijarian/systems/cl-test-grid/work-dir/agent/quicklisp/dists/quicklisp/software/osicat-20160318-git/osicat.asd: COMPILE-FILE-ERROR while compiling #<CL-SOURCE-FILE "cffi-toolchain" "toolchain" "asdf-compat">
sbcl-1.2.6-linux-x86
sbcl-1.3.2.92-4077405-macosx-x64
(LOAD osicat-tests FAIL) ffi-grovel, CFFI-GROVEL:GROVEL-ERROR : External process exited with code 1. Command was: "cc" "-m64" "-I" "/opt/local/include/" "-I/Users/testgrid/cl-test-grid/work-dir/agent/quicklisp/dists/quicklisp/software/cffi_0.16.1/" "-bundle" "-fPIC" "-o" "/Users/testgrid/cl-test-grid/work-dir/agent/test-runs/20160220052250-sbcl-1.3.2.92-4077405-macosx-x64/fasl/ql/dists/quicklisp/software/osicat-20160208-git/posix/libosicat.dylib" "/Users/testgrid/cl-test-grid/work-dir/agent/test-runs/20160220052250-sbcl-1.3.2.92-4077405-macosx-x64/fasl/ql/dists/quicklisp/software/osicat-20160208-git/posix/wrappers.c" Output was: /Users/testgrid/cl-test-grid/work-dir/agent/test-runs/20160220052250-sbcl-1.3.2.92-4077405-macosx-x64/fasl/ql/dists/quicklisp/software/osicat-20160208-git/posix/wrappers.c:113:10: warning: implicit declaration of function 'posix_fallocate' is invalid in C99 [-Wimplicit-function-declaration] return posix_fallocate(fd, offset, length); ^ 1 warning generated. Undefined symbols for architecture x86_64: "_posix_fallocate", referenced from: _posix_fallocate_cffi_wrap in wrappers-c60376.o (maybe you meant: _posix_fallocate_cffi_wrap) ld: symbol(s) not found for architecture x86_64 clang: error: linker command failed with exit code 1 (use -v to see invocation)
(LOAD osicat FAIL) ffi-grovel, CFFI-GROVEL:GROVEL-ERROR : External process exited with code 1. Command was: "cc" "-m64" "-I" "/opt/local/include/" "-I/Users/testgrid/cl-test-grid/work-dir/agent/quicklisp/dists/quicklisp/software/cffi_0.16.1/" "-bundle" "-fPIC" "-o" "/Users/testgrid/cl-test-grid/work-dir/agent/test-runs/20160220052250-sbcl-1.3.2.92-4077405-macosx-x64/fasl/ql/dists/quicklisp/software/osicat-20160208-git/posix/libosicat.dylib" "/Users/testgrid/cl-test-grid/work-dir/agent/test-runs/20160220052250-sbcl-1.3.2.92-4077405-macosx-x64/fasl/ql/dists/quicklisp/software/osicat-20160208-git/posix/wrappers.c" Output was: /Users/testgrid/cl-test-grid/work-dir/agent/test-runs/20160220052250-sbcl-1.3.2.92-4077405-macosx-x64/fasl/ql/dists/quicklisp/software/osicat-20160208-git/posix/wrappers.c:113:10: warning: implicit declaration of function 'posix_fallocate' is invalid in C99 [-Wimplicit-function-declaration] return posix_fallocate(fd, offset, length); ^ 1 warning generated. Undefined symbols for architecture x86_64: "_posix_fallocate", referenced from: _posix_fallocate_cffi_wrap in wrappers-dd7944.o (maybe you meant: _posix_fallocate_cffi_wrap) ld: symbol(s) not found for architecture x86_64 clang: error: linker command failed with exit code 1 (use -v to see invocation)

Breakdown by testcases: for every failed testcase the lisp implmentations it fails on

The library does not have a testsuite adapter for CL Test Grid.

To reports overview

Generated at: 2016-04-17 01:09:54 GMT.