lisp-zmq results collected by cl-test-grid

Results on the last two Quicklisp distributions

 quicklisp 2016-03-18quicklisp 2016-02-08
abcl-1.2.1-fasl42-linux-x86
(LOAD zmq-test FAIL) ASDF/FIND-SYSTEM:LOAD-SYSTEM-DEFINITION-ERROR : Error while trying to load definition for system zmq from pathname /home/testgrid/cl-test-grid/work-dir/agent/quicklisp/dists/quicklisp/software/lisp-zmq-20160208-git/zmq.asd: Error while trying to load definition for system cffi-toolchain from pathname /home/testgrid/cl-test-grid/work-dir/agent/quicklisp/dists/quicklisp/software/cffi_0.17.1/cffi-toolchain.asd: CFFI-toolchain requires ASDF 3.1!
(LOAD zmq-examples FAIL) ASDF/FIND-SYSTEM:LOAD-SYSTEM-DEFINITION-ERROR : Error while trying to load definition for system zmq from pathname /home/testgrid/cl-test-grid/work-dir/agent/quicklisp/dists/quicklisp/software/lisp-zmq-20160208-git/zmq.asd: Error while trying to load definition for system cffi-toolchain from pathname /home/testgrid/cl-test-grid/work-dir/agent/quicklisp/dists/quicklisp/software/cffi_0.17.1/cffi-toolchain.asd: CFFI-toolchain requires ASDF 3.1!
(LOAD zmq FAIL) ASDF/FIND-SYSTEM:LOAD-SYSTEM-DEFINITION-ERROR : Error while trying to load definition for system zmq from pathname /home/testgrid/cl-test-grid/work-dir/agent/quicklisp/dists/quicklisp/software/lisp-zmq-20160208-git/zmq.asd: Error while trying to load definition for system cffi-toolchain from pathname /home/testgrid/cl-test-grid/work-dir/agent/quicklisp/dists/quicklisp/software/cffi_0.17.1/cffi-toolchain.asd: CFFI-toolchain requires ASDF 3.1!
(LOAD zmq-test FAIL) ffi-grovel, CFFI-GROVEL:GROVEL-ERROR : External process exited with code 1. Command was: "cc" "-m32" "-I/home/testgrid/cl-test-grid/work-dir/agent/quicklisp/dists/quicklisp/software/cffi_0.16.1/" "-o" "/home/testgrid/cl-test-grid/work-dir/agent/test-runs/20160219104759-abcl-1.2.1-fasl42-linux-x86/fasl/ql/dists/quicklisp/software/lisp-zmq-20160208-git/src/grovel" "/home/testgrid/cl-test-grid/work-dir/agent/test-runs/20160219104759-abcl-1.2.1-fasl42-linux-x86/fasl/ql/dists/quicklisp/software/lisp-zmq-20160208-git/src/grovel.c" Output was: /home/testgrid/cl-test-grid/work-dir/agent/test-runs/20160219104759-abcl-1.2.1-fasl42-linux-x86/fasl/ql/dists/quicklisp/software/lisp-zmq-20160208-git/src/grovel.c:6:17: fatal error: zmq.h: No such file or directory compilation terminated.
(LOAD zmq-examples FAIL) ffi-grovel, CFFI-GROVEL:GROVEL-ERROR : External process exited with code 1. Command was: "cc" "-m32" "-I/home/testgrid/cl-test-grid/work-dir/agent/quicklisp/dists/quicklisp/software/cffi_0.16.1/" "-o" "/home/testgrid/cl-test-grid/work-dir/agent/test-runs/20160219104759-abcl-1.2.1-fasl42-linux-x86/fasl/ql/dists/quicklisp/software/lisp-zmq-20160208-git/src/grovel" "/home/testgrid/cl-test-grid/work-dir/agent/test-runs/20160219104759-abcl-1.2.1-fasl42-linux-x86/fasl/ql/dists/quicklisp/software/lisp-zmq-20160208-git/src/grovel.c" Output was: /home/testgrid/cl-test-grid/work-dir/agent/test-runs/20160219104759-abcl-1.2.1-fasl42-linux-x86/fasl/ql/dists/quicklisp/software/lisp-zmq-20160208-git/src/grovel.c:6:17: fatal error: zmq.h: No such file or directory compilation terminated.
(LOAD zmq FAIL) ffi-grovel, CFFI-GROVEL:GROVEL-ERROR : External process exited with code 1. Command was: "cc" "-m32" "-I/home/testgrid/cl-test-grid/work-dir/agent/quicklisp/dists/quicklisp/software/cffi_0.16.1/" "-o" "/home/testgrid/cl-test-grid/work-dir/agent/test-runs/20160219104759-abcl-1.2.1-fasl42-linux-x86/fasl/ql/dists/quicklisp/software/lisp-zmq-20160208-git/src/grovel" "/home/testgrid/cl-test-grid/work-dir/agent/test-runs/20160219104759-abcl-1.2.1-fasl42-linux-x86/fasl/ql/dists/quicklisp/software/lisp-zmq-20160208-git/src/grovel.c" Output was: /home/testgrid/cl-test-grid/work-dir/agent/test-runs/20160219104759-abcl-1.2.1-fasl42-linux-x86/fasl/ql/dists/quicklisp/software/lisp-zmq-20160208-git/src/grovel.c:6:17: fatal error: zmq.h: No such file or directory compilation terminated.
abcl-1.3.0-fasl42-linux-x86
(LOAD zmq-test FAIL) ASDF/FIND-SYSTEM:LOAD-SYSTEM-DEFINITION-ERROR : Error while trying to load definition for system zmq from pathname /home/testgrid/cl-test-grid/work-dir/agent/quicklisp/dists/quicklisp/software/lisp-zmq-20160208-git/zmq.asd: Component "asdf" does not match version 3.1.2, required by #<ASDF/SYSTEM:SYSTEM "cffi-toolchain">
(LOAD zmq-examples FAIL) ASDF/FIND-SYSTEM:LOAD-SYSTEM-DEFINITION-ERROR : Error while trying to load definition for system zmq from pathname /home/testgrid/cl-test-grid/work-dir/agent/quicklisp/dists/quicklisp/software/lisp-zmq-20160208-git/zmq.asd: Component "asdf" does not match version 3.1.2, required by #<ASDF/SYSTEM:SYSTEM "cffi-toolchain">
(LOAD zmq FAIL) ASDF/FIND-SYSTEM:LOAD-SYSTEM-DEFINITION-ERROR : Error while trying to load definition for system zmq from pathname /home/testgrid/cl-test-grid/work-dir/agent/quicklisp/dists/quicklisp/software/lisp-zmq-20160208-git/zmq.asd: Component "asdf" does not match version 3.1.2, required by #<ASDF/SYSTEM:SYSTEM "cffi-toolchain">
(LOAD zmq-test FAIL) ffi-grovel, CFFI-GROVEL:GROVEL-ERROR : External process exited with code 1. Command was: "cc" "-m32" "-I/home/testgrid/cl-test-grid/work-dir/agent/quicklisp/dists/quicklisp/software/cffi_0.16.1/" "-o" "/home/testgrid/cl-test-grid/work-dir/agent/test-runs/20160218183137-abcl-1.3.0-fasl42-linux-x86/fasl/ql/dists/quicklisp/software/lisp-zmq-20160208-git/src/grovel" "/home/testgrid/cl-test-grid/work-dir/agent/test-runs/20160218183137-abcl-1.3.0-fasl42-linux-x86/fasl/ql/dists/quicklisp/software/lisp-zmq-20160208-git/src/grovel.c" Output was: /home/testgrid/cl-test-grid/work-dir/agent/test-runs/20160218183137-abcl-1.3.0-fasl42-linux-x86/fasl/ql/dists/quicklisp/software/lisp-zmq-20160208-git/src/grovel.c:6:17: fatal error: zmq.h: No such file or directory compilation terminated.
(LOAD zmq-examples FAIL) ffi-grovel, CFFI-GROVEL:GROVEL-ERROR : External process exited with code 1. Command was: "cc" "-m32" "-I/home/testgrid/cl-test-grid/work-dir/agent/quicklisp/dists/quicklisp/software/cffi_0.16.1/" "-o" "/home/testgrid/cl-test-grid/work-dir/agent/test-runs/20160218183137-abcl-1.3.0-fasl42-linux-x86/fasl/ql/dists/quicklisp/software/lisp-zmq-20160208-git/src/grovel" "/home/testgrid/cl-test-grid/work-dir/agent/test-runs/20160218183137-abcl-1.3.0-fasl42-linux-x86/fasl/ql/dists/quicklisp/software/lisp-zmq-20160208-git/src/grovel.c" Output was: /home/testgrid/cl-test-grid/work-dir/agent/test-runs/20160218183137-abcl-1.3.0-fasl42-linux-x86/fasl/ql/dists/quicklisp/software/lisp-zmq-20160208-git/src/grovel.c:6:17: fatal error: zmq.h: No such file or directory compilation terminated.
(LOAD zmq FAIL) ffi-grovel, CFFI-GROVEL:GROVEL-ERROR : External process exited with code 1. Command was: "cc" "-m32" "-I/home/testgrid/cl-test-grid/work-dir/agent/quicklisp/dists/quicklisp/software/cffi_0.16.1/" "-o" "/home/testgrid/cl-test-grid/work-dir/agent/test-runs/20160218183137-abcl-1.3.0-fasl42-linux-x86/fasl/ql/dists/quicklisp/software/lisp-zmq-20160208-git/src/grovel" "/home/testgrid/cl-test-grid/work-dir/agent/test-runs/20160218183137-abcl-1.3.0-fasl42-linux-x86/fasl/ql/dists/quicklisp/software/lisp-zmq-20160208-git/src/grovel.c" Output was: /home/testgrid/cl-test-grid/work-dir/agent/test-runs/20160218183137-abcl-1.3.0-fasl42-linux-x86/fasl/ql/dists/quicklisp/software/lisp-zmq-20160208-git/src/grovel.c:6:17: fatal error: zmq.h: No such file or directory compilation terminated.
abcl-1.3.1-fasl42-linux-x86
(LOAD zmq-test FAIL) ASDF/FIND-SYSTEM:LOAD-SYSTEM-DEFINITION-ERROR : Error while trying to load definition for system zmq from pathname /home/testgrid/cl-test-grid/work-dir/agent/quicklisp/dists/quicklisp/software/lisp-zmq-20160208-git/zmq.asd: Component "asdf" does not match version 3.1.2, required by #<ASDF/SYSTEM:SYSTEM "cffi-toolchain">
(LOAD zmq-examples FAIL) ASDF/FIND-SYSTEM:LOAD-SYSTEM-DEFINITION-ERROR : Error while trying to load definition for system zmq from pathname /home/testgrid/cl-test-grid/work-dir/agent/quicklisp/dists/quicklisp/software/lisp-zmq-20160208-git/zmq.asd: Component "asdf" does not match version 3.1.2, required by #<ASDF/SYSTEM:SYSTEM "cffi-toolchain">
(LOAD zmq FAIL) ASDF/FIND-SYSTEM:LOAD-SYSTEM-DEFINITION-ERROR : Error while trying to load definition for system zmq from pathname /home/testgrid/cl-test-grid/work-dir/agent/quicklisp/dists/quicklisp/software/lisp-zmq-20160208-git/zmq.asd: Component "asdf" does not match version 3.1.2, required by #<ASDF/SYSTEM:SYSTEM "cffi-toolchain">
(LOAD zmq-test FAIL) ffi-grovel, CFFI-GROVEL:GROVEL-ERROR : External process exited with code 1. Command was: "cc" "-m32" "-I/home/testgrid/cl-test-grid/work-dir/agent/quicklisp/dists/quicklisp/software/cffi_0.16.1/" "-o" "/home/testgrid/cl-test-grid/work-dir/agent/test-runs/20160217235158-abcl-1.3.1-fasl42-linux-x86/fasl/ql/dists/quicklisp/software/lisp-zmq-20160208-git/src/grovel" "/home/testgrid/cl-test-grid/work-dir/agent/test-runs/20160217235158-abcl-1.3.1-fasl42-linux-x86/fasl/ql/dists/quicklisp/software/lisp-zmq-20160208-git/src/grovel.c" Output was: /home/testgrid/cl-test-grid/work-dir/agent/test-runs/20160217235158-abcl-1.3.1-fasl42-linux-x86/fasl/ql/dists/quicklisp/software/lisp-zmq-20160208-git/src/grovel.c:6:17: fatal error: zmq.h: No such file or directory compilation terminated.
(LOAD zmq-examples FAIL) ffi-grovel, CFFI-GROVEL:GROVEL-ERROR : External process exited with code 1. Command was: "cc" "-m32" "-I/home/testgrid/cl-test-grid/work-dir/agent/quicklisp/dists/quicklisp/software/cffi_0.16.1/" "-o" "/home/testgrid/cl-test-grid/work-dir/agent/test-runs/20160217235158-abcl-1.3.1-fasl42-linux-x86/fasl/ql/dists/quicklisp/software/lisp-zmq-20160208-git/src/grovel" "/home/testgrid/cl-test-grid/work-dir/agent/test-runs/20160217235158-abcl-1.3.1-fasl42-linux-x86/fasl/ql/dists/quicklisp/software/lisp-zmq-20160208-git/src/grovel.c" Output was: /home/testgrid/cl-test-grid/work-dir/agent/test-runs/20160217235158-abcl-1.3.1-fasl42-linux-x86/fasl/ql/dists/quicklisp/software/lisp-zmq-20160208-git/src/grovel.c:6:17: fatal error: zmq.h: No such file or directory compilation terminated.
(LOAD zmq FAIL) ffi-grovel, CFFI-GROVEL:GROVEL-ERROR : External process exited with code 1. Command was: "cc" "-m32" "-I/home/testgrid/cl-test-grid/work-dir/agent/quicklisp/dists/quicklisp/software/cffi_0.16.1/" "-o" "/home/testgrid/cl-test-grid/work-dir/agent/test-runs/20160217235158-abcl-1.3.1-fasl42-linux-x86/fasl/ql/dists/quicklisp/software/lisp-zmq-20160208-git/src/grovel" "/home/testgrid/cl-test-grid/work-dir/agent/test-runs/20160217235158-abcl-1.3.1-fasl42-linux-x86/fasl/ql/dists/quicklisp/software/lisp-zmq-20160208-git/src/grovel.c" Output was: /home/testgrid/cl-test-grid/work-dir/agent/test-runs/20160217235158-abcl-1.3.1-fasl42-linux-x86/fasl/ql/dists/quicklisp/software/lisp-zmq-20160208-git/src/grovel.c:6:17: fatal error: zmq.h: No such file or directory compilation terminated.
abcl-1.3.2-fasl42-linux-x86
(LOAD zmq-test FAIL) ffi-grovel, CFFI-GROVEL:GROVEL-ERROR : Subprocess with command ("cc" "-m32" "-o" "/home/testgrid/cl-test-grid/work-dir/agent/test-runs/20160324115455-abcl-1.3.2-fasl42-linux-x86/fasl/ql/dists/quicklisp/software/lisp-zmq-20160208-git/src/grovel__grovel-tmpS9EPZCAP" "-I/home/testgrid/cl-test-grid/work-dir/agent/quicklisp/dists/quicklisp/software/cffi_0.17.1/" "/home/testgrid/cl-test-grid/work-dir/agent/test-runs/20160324115455-abcl-1.3.2-fasl42-linux-x86/fasl/ql/dists/quicklisp/software/lisp-zmq-20160208-git/src/grovel__grovel.c") exited with error code 1
(LOAD zmq-examples FAIL) ffi-grovel, CFFI-GROVEL:GROVEL-ERROR : Subprocess with command ("cc" "-m32" "-o" "/home/testgrid/cl-test-grid/work-dir/agent/test-runs/20160324115455-abcl-1.3.2-fasl42-linux-x86/fasl/ql/dists/quicklisp/software/lisp-zmq-20160208-git/src/grovel__grovel-tmpU3Q8A43M" "-I/home/testgrid/cl-test-grid/work-dir/agent/quicklisp/dists/quicklisp/software/cffi_0.17.1/" "/home/testgrid/cl-test-grid/work-dir/agent/test-runs/20160324115455-abcl-1.3.2-fasl42-linux-x86/fasl/ql/dists/quicklisp/software/lisp-zmq-20160208-git/src/grovel__grovel.c") exited with error code 1
(LOAD zmq FAIL) ffi-grovel, CFFI-GROVEL:GROVEL-ERROR : Subprocess with command ("cc" "-m32" "-o" "/home/testgrid/cl-test-grid/work-dir/agent/test-runs/20160324115455-abcl-1.3.2-fasl42-linux-x86/fasl/ql/dists/quicklisp/software/lisp-zmq-20160208-git/src/grovel__grovel-tmpIM42DG07" "-I/home/testgrid/cl-test-grid/work-dir/agent/quicklisp/dists/quicklisp/software/cffi_0.17.1/" "/home/testgrid/cl-test-grid/work-dir/agent/test-runs/20160324115455-abcl-1.3.2-fasl42-linux-x86/fasl/ql/dists/quicklisp/software/lisp-zmq-20160208-git/src/grovel__grovel.c") exited with error code 1
(LOAD zmq-test FAIL) ffi-grovel, CFFI-GROVEL:GROVEL-ERROR : External process exited with code 1. Command was: "cc" "-m32" "-I/home/testgrid/cl-test-grid/work-dir/agent/quicklisp/dists/quicklisp/software/cffi_0.16.1/" "-o" "/home/testgrid/cl-test-grid/work-dir/agent/test-runs/20160215090312-abcl-1.3.2-fasl42-linux-x86/fasl/ql/dists/quicklisp/software/lisp-zmq-20160208-git/src/grovel" "/home/testgrid/cl-test-grid/work-dir/agent/test-runs/20160215090312-abcl-1.3.2-fasl42-linux-x86/fasl/ql/dists/quicklisp/software/lisp-zmq-20160208-git/src/grovel.c" Output was: /home/testgrid/cl-test-grid/work-dir/agent/test-runs/20160215090312-abcl-1.3.2-fasl42-linux-x86/fasl/ql/dists/quicklisp/software/lisp-zmq-20160208-git/src/grovel.c:6:17: fatal error: zmq.h: No such file or directory compilation terminated.
(LOAD zmq-examples FAIL) ffi-grovel, CFFI-GROVEL:GROVEL-ERROR : External process exited with code 1. Command was: "cc" "-m32" "-I/home/testgrid/cl-test-grid/work-dir/agent/quicklisp/dists/quicklisp/software/cffi_0.16.1/" "-o" "/home/testgrid/cl-test-grid/work-dir/agent/test-runs/20160215090312-abcl-1.3.2-fasl42-linux-x86/fasl/ql/dists/quicklisp/software/lisp-zmq-20160208-git/src/grovel" "/home/testgrid/cl-test-grid/work-dir/agent/test-runs/20160215090312-abcl-1.3.2-fasl42-linux-x86/fasl/ql/dists/quicklisp/software/lisp-zmq-20160208-git/src/grovel.c" Output was: /home/testgrid/cl-test-grid/work-dir/agent/test-runs/20160215090312-abcl-1.3.2-fasl42-linux-x86/fasl/ql/dists/quicklisp/software/lisp-zmq-20160208-git/src/grovel.c:6:17: fatal error: zmq.h: No such file or directory compilation terminated.
(LOAD zmq FAIL) ffi-grovel, CFFI-GROVEL:GROVEL-ERROR : External process exited with code 1. Command was: "cc" "-m32" "-I/home/testgrid/cl-test-grid/work-dir/agent/quicklisp/dists/quicklisp/software/cffi_0.16.1/" "-o" "/home/testgrid/cl-test-grid/work-dir/agent/test-runs/20160215090312-abcl-1.3.2-fasl42-linux-x86/fasl/ql/dists/quicklisp/software/lisp-zmq-20160208-git/src/grovel" "/home/testgrid/cl-test-grid/work-dir/agent/test-runs/20160215090312-abcl-1.3.2-fasl42-linux-x86/fasl/ql/dists/quicklisp/software/lisp-zmq-20160208-git/src/grovel.c" Output was: /home/testgrid/cl-test-grid/work-dir/agent/test-runs/20160215090312-abcl-1.3.2-fasl42-linux-x86/fasl/ql/dists/quicklisp/software/lisp-zmq-20160208-git/src/grovel.c:6:17: fatal error: zmq.h: No such file or directory compilation terminated.
ccl-1.10-r16196-f101-linux-arm
(LOAD zmq-test FAIL) ffi-grovel, CFFI-GROVEL:GROVEL-ERROR : Subprocess (:PROCESS #<EXTERNAL-PROCESS (cc -marm -o ...)[10121] (EXITED : 1) #x45510456>) with command ("cc" "-marm" "-o" "/home/testgrid/cl-test-grid/work-dir/agent/test-runs/20160407185412-ccl-1.10-r16196-f101-linux-arm/fasl/ql/dists/quicklisp/software/lisp-zmq-20160208-git/src/grovel__grovel-tmpZWZK5Q2S" "-I/home/testgrid/cl-test-grid/work-dir/agent/quicklisp/dists/quicklisp/software/cffi_0.17.1/" "/home/testgrid/cl-test-grid/work-dir/agent/test-runs/20160407185412-ccl-1.10-r16196-f101-linux-arm/fasl/ql/dists/quicklisp/software/lisp-zmq-20160208-git/src/grovel__grovel.c") exited with error code 1
(LOAD zmq-examples FAIL) ffi-grovel, CFFI-GROVEL:GROVEL-ERROR : Subprocess (:PROCESS #<EXTERNAL-PROCESS (cc -marm -o ...)[10112] (EXITED : 1) #x453987A6>) with command ("cc" "-marm" "-o" "/home/testgrid/cl-test-grid/work-dir/agent/test-runs/20160407185412-ccl-1.10-r16196-f101-linux-arm/fasl/ql/dists/quicklisp/software/lisp-zmq-20160208-git/src/grovel__grovel-tmpZWZK5Q2S" "-I/home/testgrid/cl-test-grid/work-dir/agent/quicklisp/dists/quicklisp/software/cffi_0.17.1/" "/home/testgrid/cl-test-grid/work-dir/agent/test-runs/20160407185412-ccl-1.10-r16196-f101-linux-arm/fasl/ql/dists/quicklisp/software/lisp-zmq-20160208-git/src/grovel__grovel.c") exited with error code 1
(LOAD zmq FAIL) ffi-grovel, CFFI-GROVEL:GROVEL-ERROR : Subprocess (:PROCESS #<EXTERNAL-PROCESS (cc -marm -o ...)[10103] (EXITED : 1) #x4548C22E>) with command ("cc" "-marm" "-o" "/home/testgrid/cl-test-grid/work-dir/agent/test-runs/20160407185412-ccl-1.10-r16196-f101-linux-arm/fasl/ql/dists/quicklisp/software/lisp-zmq-20160208-git/src/grovel__grovel-tmpQDDPHH86" "-I/home/testgrid/cl-test-grid/work-dir/agent/quicklisp/dists/quicklisp/software/cffi_0.17.1/" "/home/testgrid/cl-test-grid/work-dir/agent/test-runs/20160407185412-ccl-1.10-r16196-f101-linux-arm/fasl/ql/dists/quicklisp/software/lisp-zmq-20160208-git/src/grovel__grovel.c") exited with error code 1
(LOAD zmq-test FAIL) ffi-grovel, CFFI-GROVEL:GROVEL-ERROR : External process exited with code 1. Command was: "cc" "-marm" "-I/home/testgrid/cl-test-grid/work-dir/agent/quicklisp/dists/quicklisp/software/cffi_0.16.1/" "-o" "/home/testgrid/cl-test-grid/work-dir/agent/test-runs/20160215053538-ccl-1.10-r16196-f101-linux-arm/fasl/ql/dists/quicklisp/software/lisp-zmq-20160208-git/src/grovel" "/home/testgrid/cl-test-grid/work-dir/agent/test-runs/20160215053538-ccl-1.10-r16196-f101-linux-arm/fasl/ql/dists/quicklisp/software/lisp-zmq-20160208-git/src/grovel.c" Output was: /home/testgrid/cl-test-grid/work-dir/agent/test-runs/20160215053538-ccl-1.10-r16196-f101-linux-arm/fasl/ql/dists/quicklisp/software/lisp-zmq-20160208-git/src/grovel.c:6:17: fatal error: zmq.h: No such file or directory #include <zmq.h> ^ compilation terminated.
(LOAD zmq-examples FAIL) ffi-grovel, CFFI-GROVEL:GROVEL-ERROR : External process exited with code 1. Command was: "cc" "-marm" "-I/home/testgrid/cl-test-grid/work-dir/agent/quicklisp/dists/quicklisp/software/cffi_0.16.1/" "-o" "/home/testgrid/cl-test-grid/work-dir/agent/test-runs/20160215053538-ccl-1.10-r16196-f101-linux-arm/fasl/ql/dists/quicklisp/software/lisp-zmq-20160208-git/src/grovel" "/home/testgrid/cl-test-grid/work-dir/agent/test-runs/20160215053538-ccl-1.10-r16196-f101-linux-arm/fasl/ql/dists/quicklisp/software/lisp-zmq-20160208-git/src/grovel.c" Output was: /home/testgrid/cl-test-grid/work-dir/agent/test-runs/20160215053538-ccl-1.10-r16196-f101-linux-arm/fasl/ql/dists/quicklisp/software/lisp-zmq-20160208-git/src/grovel.c:6:17: fatal error: zmq.h: No such file or directory #include <zmq.h> ^ compilation terminated.
(LOAD zmq FAIL) ffi-grovel, CFFI-GROVEL:GROVEL-ERROR : External process exited with code 1. Command was: "cc" "-marm" "-I/home/testgrid/cl-test-grid/work-dir/agent/quicklisp/dists/quicklisp/software/cffi_0.16.1/" "-o" "/home/testgrid/cl-test-grid/work-dir/agent/test-runs/20160215053538-ccl-1.10-r16196-f101-linux-arm/fasl/ql/dists/quicklisp/software/lisp-zmq-20160208-git/src/grovel" "/home/testgrid/cl-test-grid/work-dir/agent/test-runs/20160215053538-ccl-1.10-r16196-f101-linux-arm/fasl/ql/dists/quicklisp/software/lisp-zmq-20160208-git/src/grovel.c" Output was: /home/testgrid/cl-test-grid/work-dir/agent/test-runs/20160215053538-ccl-1.10-r16196-f101-linux-arm/fasl/ql/dists/quicklisp/software/lisp-zmq-20160208-git/src/grovel.c:6:17: fatal error: zmq.h: No such file or directory #include <zmq.h> ^ compilation terminated.
ccl-1.10-r16196-f96-linux-x64
(LOAD zmq-test FAIL) CCL::SIMPLE-PROGRAM-ERROR : Invalid program: In the form ((OS-UNIX-P) NIL), (OS-UNIX-P) is not a symbol or lambda expression.
(LOAD zmq-examples FAIL) CCL::SIMPLE-PROGRAM-ERROR : Invalid program: In the form ((OS-UNIX-P) NIL), (OS-UNIX-P) is not a symbol or lambda expression.
(LOAD zmq FAIL) CCL::SIMPLE-PROGRAM-ERROR : Invalid program: In the form ((OS-UNIX-P) NIL), (OS-UNIX-P) is not a symbol or lambda expression.
(LOAD zmq-test FAIL) ffi-grovel, CFFI-GROVEL:GROVEL-ERROR : External process exited with code 1. Command was: "cc" "-m64" "-I/home/hijarian/systems/cl-test-grid/work-dir/agent/quicklisp/dists/quicklisp/software/cffi_0.16.1/" "-o" "/home/hijarian/systems/cl-test-grid/work-dir/agent/test-runs/20160309055500-ccl-1.10-r16196-f96-linux-x64/fasl/ql/dists/quicklisp/software/lisp-zmq-20160208-git/src/grovel" "/home/hijarian/systems/cl-test-grid/work-dir/agent/test-runs/20160309055500-ccl-1.10-r16196-f96-linux-x64/fasl/ql/dists/quicklisp/software/lisp-zmq-20160208-git/src/grovel.c" Output was: /home/hijarian/systems/cl-test-grid/work-dir/agent/test-runs/20160309055500-ccl-1.10-r16196-f96-linux-x64/fasl/ql/dists/quicklisp/software/lisp-zmq-20160208-git/src/grovel.c:6:17: fatal error: zmq.h: Нет такого файла или каталога compilation terminated.
(LOAD zmq-examples FAIL) ffi-grovel, CFFI-GROVEL:GROVEL-ERROR : External process exited with code 1. Command was: "cc" "-m64" "-I/home/hijarian/systems/cl-test-grid/work-dir/agent/quicklisp/dists/quicklisp/software/cffi_0.16.1/" "-o" "/home/hijarian/systems/cl-test-grid/work-dir/agent/test-runs/20160309055500-ccl-1.10-r16196-f96-linux-x64/fasl/ql/dists/quicklisp/software/lisp-zmq-20160208-git/src/grovel" "/home/hijarian/systems/cl-test-grid/work-dir/agent/test-runs/20160309055500-ccl-1.10-r16196-f96-linux-x64/fasl/ql/dists/quicklisp/software/lisp-zmq-20160208-git/src/grovel.c" Output was: /home/hijarian/systems/cl-test-grid/work-dir/agent/test-runs/20160309055500-ccl-1.10-r16196-f96-linux-x64/fasl/ql/dists/quicklisp/software/lisp-zmq-20160208-git/src/grovel.c:6:17: fatal error: zmq.h: Нет такого файла или каталога compilation terminated.
(LOAD zmq FAIL) ffi-grovel, CFFI-GROVEL:GROVEL-ERROR : External process exited with code 1. Command was: "cc" "-m64" "-I/home/hijarian/systems/cl-test-grid/work-dir/agent/quicklisp/dists/quicklisp/software/cffi_0.16.1/" "-o" "/home/hijarian/systems/cl-test-grid/work-dir/agent/test-runs/20160309055500-ccl-1.10-r16196-f96-linux-x64/fasl/ql/dists/quicklisp/software/lisp-zmq-20160208-git/src/grovel" "/home/hijarian/systems/cl-test-grid/work-dir/agent/test-runs/20160309055500-ccl-1.10-r16196-f96-linux-x64/fasl/ql/dists/quicklisp/software/lisp-zmq-20160208-git/src/grovel.c" Output was: /home/hijarian/systems/cl-test-grid/work-dir/agent/test-runs/20160309055500-ccl-1.10-r16196-f96-linux-x64/fasl/ql/dists/quicklisp/software/lisp-zmq-20160208-git/src/grovel.c:6:17: fatal error: zmq.h: Нет такого файла или каталога compilation terminated.
(LOAD zmq-test FAIL) ffi-grovel, CFFI-GROVEL:GROVEL-ERROR : External process exited with code 1. Command was: "cc" "-m64" "-I/home/hijarian/systems/cl-test-grid/work-dir/agent/quicklisp/dists/quicklisp/software/cffi_0.16.1/" "-o" "/home/hijarian/systems/cl-test-grid/work-dir/agent/test-runs/20160306095236-ccl-1.10-r16196-f96-linux-x64/fasl/ql/dists/quicklisp/software/lisp-zmq-20160208-git/src/grovel" "/home/hijarian/systems/cl-test-grid/work-dir/agent/test-runs/20160306095236-ccl-1.10-r16196-f96-linux-x64/fasl/ql/dists/quicklisp/software/lisp-zmq-20160208-git/src/grovel.c" Output was: /home/hijarian/systems/cl-test-grid/work-dir/agent/test-runs/20160306095236-ccl-1.10-r16196-f96-linux-x64/fasl/ql/dists/quicklisp/software/lisp-zmq-20160208-git/src/grovel.c:6:17: fatal error: zmq.h: Нет такого файла или каталога compilation terminated.
(LOAD zmq-examples FAIL) ffi-grovel, CFFI-GROVEL:GROVEL-ERROR : External process exited with code 1. Command was: "cc" "-m64" "-I/home/hijarian/systems/cl-test-grid/work-dir/agent/quicklisp/dists/quicklisp/software/cffi_0.16.1/" "-o" "/home/hijarian/systems/cl-test-grid/work-dir/agent/test-runs/20160306095236-ccl-1.10-r16196-f96-linux-x64/fasl/ql/dists/quicklisp/software/lisp-zmq-20160208-git/src/grovel" "/home/hijarian/systems/cl-test-grid/work-dir/agent/test-runs/20160306095236-ccl-1.10-r16196-f96-linux-x64/fasl/ql/dists/quicklisp/software/lisp-zmq-20160208-git/src/grovel.c" Output was: /home/hijarian/systems/cl-test-grid/work-dir/agent/test-runs/20160306095236-ccl-1.10-r16196-f96-linux-x64/fasl/ql/dists/quicklisp/software/lisp-zmq-20160208-git/src/grovel.c:6:17: fatal error: zmq.h: Нет такого файла или каталога compilation terminated.
(LOAD zmq FAIL) ffi-grovel, CFFI-GROVEL:GROVEL-ERROR : External process exited with code 1. Command was: "cc" "-m64" "-I/home/hijarian/systems/cl-test-grid/work-dir/agent/quicklisp/dists/quicklisp/software/cffi_0.16.1/" "-o" "/home/hijarian/systems/cl-test-grid/work-dir/agent/test-runs/20160306095236-ccl-1.10-r16196-f96-linux-x64/fasl/ql/dists/quicklisp/software/lisp-zmq-20160208-git/src/grovel" "/home/hijarian/systems/cl-test-grid/work-dir/agent/test-runs/20160306095236-ccl-1.10-r16196-f96-linux-x64/fasl/ql/dists/quicklisp/software/lisp-zmq-20160208-git/src/grovel.c" Output was: /home/hijarian/systems/cl-test-grid/work-dir/agent/test-runs/20160306095236-ccl-1.10-r16196-f96-linux-x64/fasl/ql/dists/quicklisp/software/lisp-zmq-20160208-git/src/grovel.c:6:17: fatal error: zmq.h: Нет такого файла или каталога compilation terminated.
(LOAD zmq-test FAIL) ffi-grovel, CFFI-GROVEL:GROVEL-ERROR : External process exited with code 1. Command was: "cc" "-m64" "-I/home/hijarian/systems/cl-test-grid/work-dir/agent/quicklisp/dists/quicklisp/software/cffi_0.16.1/" "-o" "/home/hijarian/systems/cl-test-grid/work-dir/agent/test-runs/20160214121759-ccl-1.10-r16196-f96-linux-x64/fasl/ql/dists/quicklisp/software/lisp-zmq-20160208-git/src/grovel" "/home/hijarian/systems/cl-test-grid/work-dir/agent/test-runs/20160214121759-ccl-1.10-r16196-f96-linux-x64/fasl/ql/dists/quicklisp/software/lisp-zmq-20160208-git/src/grovel.c" Output was: /home/hijarian/systems/cl-test-grid/work-dir/agent/test-runs/20160214121759-ccl-1.10-r16196-f96-linux-x64/fasl/ql/dists/quicklisp/software/lisp-zmq-20160208-git/src/grovel.c:6:17: fatal error: zmq.h: Нет такого файла или каталога #include <zmq.h> ^ compilation terminated.
(LOAD zmq-examples FAIL) ffi-grovel, CFFI-GROVEL:GROVEL-ERROR : External process exited with code 1. Command was: "cc" "-m64" "-I/home/hijarian/systems/cl-test-grid/work-dir/agent/quicklisp/dists/quicklisp/software/cffi_0.16.1/" "-o" "/home/hijarian/systems/cl-test-grid/work-dir/agent/test-runs/20160214121759-ccl-1.10-r16196-f96-linux-x64/fasl/ql/dists/quicklisp/software/lisp-zmq-20160208-git/src/grovel" "/home/hijarian/systems/cl-test-grid/work-dir/agent/test-runs/20160214121759-ccl-1.10-r16196-f96-linux-x64/fasl/ql/dists/quicklisp/software/lisp-zmq-20160208-git/src/grovel.c" Output was: /home/hijarian/systems/cl-test-grid/work-dir/agent/test-runs/20160214121759-ccl-1.10-r16196-f96-linux-x64/fasl/ql/dists/quicklisp/software/lisp-zmq-20160208-git/src/grovel.c:6:17: fatal error: zmq.h: Нет такого файла или каталога #include <zmq.h> ^ compilation terminated.
(LOAD zmq FAIL) ffi-grovel, CFFI-GROVEL:GROVEL-ERROR : External process exited with code 1. Command was: "cc" "-m64" "-I/home/hijarian/systems/cl-test-grid/work-dir/agent/quicklisp/dists/quicklisp/software/cffi_0.16.1/" "-o" "/home/hijarian/systems/cl-test-grid/work-dir/agent/test-runs/20160214121759-ccl-1.10-r16196-f96-linux-x64/fasl/ql/dists/quicklisp/software/lisp-zmq-20160208-git/src/grovel" "/home/hijarian/systems/cl-test-grid/work-dir/agent/test-runs/20160214121759-ccl-1.10-r16196-f96-linux-x64/fasl/ql/dists/quicklisp/software/lisp-zmq-20160208-git/src/grovel.c" Output was: /home/hijarian/systems/cl-test-grid/work-dir/agent/test-runs/20160214121759-ccl-1.10-r16196-f96-linux-x64/fasl/ql/dists/quicklisp/software/lisp-zmq-20160208-git/src/grovel.c:6:17: fatal error: zmq.h: Нет такого файла или каталога #include <zmq.h> ^ compilation terminated.
ccl-1.10-r16196-f96-linux-x86
(LOAD zmq-test FAIL) ffi-grovel, CFFI-GROVEL:GROVEL-ERROR : Subprocess (:PROCESS #<EXTERNAL-PROCESS (cc -m32 -o ...)[18392] (EXITED : 1) #x18F1B7B6>) with command ("cc" "-m32" "-o" "/home/testgrid/cl-test-grid/work-dir/agent/test-runs/20160323092220-ccl-1.10-r16196-f96-linux-x86/fasl/ql/dists/quicklisp/software/lisp-zmq-20160208-git/src/grovel__grovel-tmpZWZK5Q2S" "-I/home/testgrid/cl-test-grid/work-dir/agent/quicklisp/dists/quicklisp/software/cffi_0.17.1/" "/home/testgrid/cl-test-grid/work-dir/agent/test-runs/20160323092220-ccl-1.10-r16196-f96-linux-x86/fasl/ql/dists/quicklisp/software/lisp-zmq-20160208-git/src/grovel__grovel.c") exited with error code 1
(LOAD zmq-examples FAIL) ffi-grovel, CFFI-GROVEL:GROVEL-ERROR : Subprocess (:PROCESS #<EXTERNAL-PROCESS (cc -m32 -o ...)[18383] (EXITED : 1) #x18E702F6>) with command ("cc" "-m32" "-o" "/home/testgrid/cl-test-grid/work-dir/agent/test-runs/20160323092220-ccl-1.10-r16196-f96-linux-x86/fasl/ql/dists/quicklisp/software/lisp-zmq-20160208-git/src/grovel__grovel-tmpZWZK5Q2S" "-I/home/testgrid/cl-test-grid/work-dir/agent/quicklisp/dists/quicklisp/software/cffi_0.17.1/" "/home/testgrid/cl-test-grid/work-dir/agent/test-runs/20160323092220-ccl-1.10-r16196-f96-linux-x86/fasl/ql/dists/quicklisp/software/lisp-zmq-20160208-git/src/grovel__grovel.c") exited with error code 1
(LOAD zmq FAIL) ffi-grovel, CFFI-GROVEL:GROVEL-ERROR : Subprocess (:PROCESS #<EXTERNAL-PROCESS (cc -m32 -o ...)[18374] (EXITED : 1) #x18ED2DFE>) with command ("cc" "-m32" "-o" "/home/testgrid/cl-test-grid/work-dir/agent/test-runs/20160323092220-ccl-1.10-r16196-f96-linux-x86/fasl/ql/dists/quicklisp/software/lisp-zmq-20160208-git/src/grovel__grovel-tmpQDDPHH86" "-I/home/testgrid/cl-test-grid/work-dir/agent/quicklisp/dists/quicklisp/software/cffi_0.17.1/" "/home/testgrid/cl-test-grid/work-dir/agent/test-runs/20160323092220-ccl-1.10-r16196-f96-linux-x86/fasl/ql/dists/quicklisp/software/lisp-zmq-20160208-git/src/grovel__grovel.c") exited with error code 1
ccl-1.11-r16635-f96-linux-x86
(LOAD zmq-test FAIL) ffi-grovel, CFFI-GROVEL:GROVEL-ERROR : Subprocess (:PROCESS #<EXTERNAL-PROCESS (cc -m32 -o ...)[2184] (EXITED : 1) #x18EF3256>) with command ("cc" "-m32" "-o" "/home/testgrid/cl-test-grid/work-dir/agent/test-runs/20160325064828-ccl-1.11-r16635-f96-linux-x86/fasl/ql/dists/quicklisp/software/lisp-zmq-20160208-git/src/grovel__grovel-tmpZWZK5Q2S" "-I/home/testgrid/cl-test-grid/work-dir/agent/quicklisp/dists/quicklisp/software/cffi_0.17.1/" "/home/testgrid/cl-test-grid/work-dir/agent/test-runs/20160325064828-ccl-1.11-r16635-f96-linux-x86/fasl/ql/dists/quicklisp/software/lisp-zmq-20160208-git/src/grovel__grovel.c") exited with error code 1
(LOAD zmq-examples FAIL) ffi-grovel, CFFI-GROVEL:GROVEL-ERROR : Subprocess (:PROCESS #<EXTERNAL-PROCESS (cc -m32 -o ...)[2175] (EXITED : 1) #x18EFF996>) with command ("cc" "-m32" "-o" "/home/testgrid/cl-test-grid/work-dir/agent/test-runs/20160325064828-ccl-1.11-r16635-f96-linux-x86/fasl/ql/dists/quicklisp/software/lisp-zmq-20160208-git/src/grovel__grovel-tmpZWZK5Q2S" "-I/home/testgrid/cl-test-grid/work-dir/agent/quicklisp/dists/quicklisp/software/cffi_0.17.1/" "/home/testgrid/cl-test-grid/work-dir/agent/test-runs/20160325064828-ccl-1.11-r16635-f96-linux-x86/fasl/ql/dists/quicklisp/software/lisp-zmq-20160208-git/src/grovel__grovel.c") exited with error code 1
(LOAD zmq FAIL) ffi-grovel, CFFI-GROVEL:GROVEL-ERROR : Subprocess (:PROCESS #<EXTERNAL-PROCESS (cc -m32 -o ...)[2166] (EXITED : 1) #x18EB39FE>) with command ("cc" "-m32" "-o" "/home/testgrid/cl-test-grid/work-dir/agent/test-runs/20160325064828-ccl-1.11-r16635-f96-linux-x86/fasl/ql/dists/quicklisp/software/lisp-zmq-20160208-git/src/grovel__grovel-tmpQDDPHH86" "-I/home/testgrid/cl-test-grid/work-dir/agent/quicklisp/dists/quicklisp/software/cffi_0.17.1/" "/home/testgrid/cl-test-grid/work-dir/agent/test-runs/20160325064828-ccl-1.11-r16635-f96-linux-x86/fasl/ql/dists/quicklisp/software/lisp-zmq-20160208-git/src/grovel__grovel.c") exited with error code 1
(LOAD zmq-test FAIL) ffi-grovel, CFFI-GROVEL:GROVEL-ERROR : External process exited with code 1. Command was: "cc" "-m32" "-I/home/testgrid/cl-test-grid/work-dir/agent/quicklisp/dists/quicklisp/software/cffi_0.16.1/" "-o" "/home/testgrid/cl-test-grid/work-dir/agent/test-runs/20160216034139-ccl-1.11-r16635-f96-linux-x86/fasl/ql/dists/quicklisp/software/lisp-zmq-20160208-git/src/grovel" "/home/testgrid/cl-test-grid/work-dir/agent/test-runs/20160216034139-ccl-1.11-r16635-f96-linux-x86/fasl/ql/dists/quicklisp/software/lisp-zmq-20160208-git/src/grovel.c" Output was: /home/testgrid/cl-test-grid/work-dir/agent/test-runs/20160216034139-ccl-1.11-r16635-f96-linux-x86/fasl/ql/dists/quicklisp/software/lisp-zmq-20160208-git/src/grovel.c:6:17: fatal error: zmq.h: No such file or directory compilation terminated.
(LOAD zmq-examples FAIL) ffi-grovel, CFFI-GROVEL:GROVEL-ERROR : External process exited with code 1. Command was: "cc" "-m32" "-I/home/testgrid/cl-test-grid/work-dir/agent/quicklisp/dists/quicklisp/software/cffi_0.16.1/" "-o" "/home/testgrid/cl-test-grid/work-dir/agent/test-runs/20160216034139-ccl-1.11-r16635-f96-linux-x86/fasl/ql/dists/quicklisp/software/lisp-zmq-20160208-git/src/grovel" "/home/testgrid/cl-test-grid/work-dir/agent/test-runs/20160216034139-ccl-1.11-r16635-f96-linux-x86/fasl/ql/dists/quicklisp/software/lisp-zmq-20160208-git/src/grovel.c" Output was: /home/testgrid/cl-test-grid/work-dir/agent/test-runs/20160216034139-ccl-1.11-r16635-f96-linux-x86/fasl/ql/dists/quicklisp/software/lisp-zmq-20160208-git/src/grovel.c:6:17: fatal error: zmq.h: No such file or directory compilation terminated.
(LOAD zmq FAIL) ffi-grovel, CFFI-GROVEL:GROVEL-ERROR : External process exited with code 1. Command was: "cc" "-m32" "-I/home/testgrid/cl-test-grid/work-dir/agent/quicklisp/dists/quicklisp/software/cffi_0.16.1/" "-o" "/home/testgrid/cl-test-grid/work-dir/agent/test-runs/20160216034139-ccl-1.11-r16635-f96-linux-x86/fasl/ql/dists/quicklisp/software/lisp-zmq-20160208-git/src/grovel" "/home/testgrid/cl-test-grid/work-dir/agent/test-runs/20160216034139-ccl-1.11-r16635-f96-linux-x86/fasl/ql/dists/quicklisp/software/lisp-zmq-20160208-git/src/grovel.c" Output was: /home/testgrid/cl-test-grid/work-dir/agent/test-runs/20160216034139-ccl-1.11-r16635-f96-linux-x86/fasl/ql/dists/quicklisp/software/lisp-zmq-20160208-git/src/grovel.c:6:17: fatal error: zmq.h: No such file or directory compilation terminated.
ccl-1.11-r16635-f96-macosx-x64
(LOAD zmq-test FAIL) ffi-grovel, CFFI-GROVEL:GROVEL-ERROR : External process exited with code 1. Command was: "cc" "-m64" "-I" "/opt/local/include/" "-I/Users/testgrid/cl-test-grid/work-dir/agent/quicklisp/dists/quicklisp/software/cffi_0.16.1/" "-o" "/Users/testgrid/cl-test-grid/work-dir/agent/test-runs/20160220010916-ccl-1.11-r16635-f96-macosx-x64/fasl/ql/dists/quicklisp/software/lisp-zmq-20160208-git/src/grovel" "/Users/testgrid/cl-test-grid/work-dir/agent/test-runs/20160220010916-ccl-1.11-r16635-f96-macosx-x64/fasl/ql/dists/quicklisp/software/lisp-zmq-20160208-git/src/grovel.c" Output was: /Users/testgrid/cl-test-grid/work-dir/agent/test-runs/20160220010916-ccl-1.11-r16635-f96-macosx-x64/fasl/ql/dists/quicklisp/software/lisp-zmq-20160208-git/src/grovel.c:6:10: fatal error: 'zmq.h' file not found #include <zmq.h> ^ 1 error generated.
(LOAD zmq-examples FAIL) ffi-grovel, CFFI-GROVEL:GROVEL-ERROR : External process exited with code 1. Command was: "cc" "-m64" "-I" "/opt/local/include/" "-I/Users/testgrid/cl-test-grid/work-dir/agent/quicklisp/dists/quicklisp/software/cffi_0.16.1/" "-o" "/Users/testgrid/cl-test-grid/work-dir/agent/test-runs/20160220010916-ccl-1.11-r16635-f96-macosx-x64/fasl/ql/dists/quicklisp/software/lisp-zmq-20160208-git/src/grovel" "/Users/testgrid/cl-test-grid/work-dir/agent/test-runs/20160220010916-ccl-1.11-r16635-f96-macosx-x64/fasl/ql/dists/quicklisp/software/lisp-zmq-20160208-git/src/grovel.c" Output was: /Users/testgrid/cl-test-grid/work-dir/agent/test-runs/20160220010916-ccl-1.11-r16635-f96-macosx-x64/fasl/ql/dists/quicklisp/software/lisp-zmq-20160208-git/src/grovel.c:6:10: fatal error: 'zmq.h' file not found #include <zmq.h> ^ 1 error generated.
(LOAD zmq FAIL) ffi-grovel, CFFI-GROVEL:GROVEL-ERROR : External process exited with code 1. Command was: "cc" "-m64" "-I" "/opt/local/include/" "-I/Users/testgrid/cl-test-grid/work-dir/agent/quicklisp/dists/quicklisp/software/cffi_0.16.1/" "-o" "/Users/testgrid/cl-test-grid/work-dir/agent/test-runs/20160220010916-ccl-1.11-r16635-f96-macosx-x64/fasl/ql/dists/quicklisp/software/lisp-zmq-20160208-git/src/grovel" "/Users/testgrid/cl-test-grid/work-dir/agent/test-runs/20160220010916-ccl-1.11-r16635-f96-macosx-x64/fasl/ql/dists/quicklisp/software/lisp-zmq-20160208-git/src/grovel.c" Output was: /Users/testgrid/cl-test-grid/work-dir/agent/test-runs/20160220010916-ccl-1.11-r16635-f96-macosx-x64/fasl/ql/dists/quicklisp/software/lisp-zmq-20160208-git/src/grovel.c:6:10: fatal error: 'zmq.h' file not found #include <zmq.h> ^ 1 error generated.
ccl-1.11-r16635-f96-macosx-x86
(LOAD zmq-test FAIL) ffi-grovel, CFFI-GROVEL:GROVEL-ERROR : External process exited with code 1. Command was: "cc" "-m32" "-I" "/opt/local/include/" "-I/Users/testgrid/cl-test-grid/work-dir/agent/quicklisp/dists/quicklisp/software/cffi_0.16.1/" "-o" "/Users/testgrid/cl-test-grid/work-dir/agent/test-runs/20160219210452-ccl-1.11-r16635-f96-macosx-x86/fasl/ql/dists/quicklisp/software/lisp-zmq-20160208-git/src/grovel" "/Users/testgrid/cl-test-grid/work-dir/agent/test-runs/20160219210452-ccl-1.11-r16635-f96-macosx-x86/fasl/ql/dists/quicklisp/software/lisp-zmq-20160208-git/src/grovel.c" Output was: /Users/testgrid/cl-test-grid/work-dir/agent/test-runs/20160219210452-ccl-1.11-r16635-f96-macosx-x86/fasl/ql/dists/quicklisp/software/lisp-zmq-20160208-git/src/grovel.c:6:10: fatal error: 'zmq.h' file not found #include <zmq.h> ^ 1 error generated.
(LOAD zmq-examples FAIL) ffi-grovel, CFFI-GROVEL:GROVEL-ERROR : External process exited with code 1. Command was: "cc" "-m32" "-I" "/opt/local/include/" "-I/Users/testgrid/cl-test-grid/work-dir/agent/quicklisp/dists/quicklisp/software/cffi_0.16.1/" "-o" "/Users/testgrid/cl-test-grid/work-dir/agent/test-runs/20160219210452-ccl-1.11-r16635-f96-macosx-x86/fasl/ql/dists/quicklisp/software/lisp-zmq-20160208-git/src/grovel" "/Users/testgrid/cl-test-grid/work-dir/agent/test-runs/20160219210452-ccl-1.11-r16635-f96-macosx-x86/fasl/ql/dists/quicklisp/software/lisp-zmq-20160208-git/src/grovel.c" Output was: /Users/testgrid/cl-test-grid/work-dir/agent/test-runs/20160219210452-ccl-1.11-r16635-f96-macosx-x86/fasl/ql/dists/quicklisp/software/lisp-zmq-20160208-git/src/grovel.c:6:10: fatal error: 'zmq.h' file not found #include <zmq.h> ^ 1 error generated.
(LOAD zmq FAIL) ffi-grovel, CFFI-GROVEL:GROVEL-ERROR : External process exited with code 1. Command was: "cc" "-m32" "-I" "/opt/local/include/" "-I/Users/testgrid/cl-test-grid/work-dir/agent/quicklisp/dists/quicklisp/software/cffi_0.16.1/" "-o" "/Users/testgrid/cl-test-grid/work-dir/agent/test-runs/20160219210452-ccl-1.11-r16635-f96-macosx-x86/fasl/ql/dists/quicklisp/software/lisp-zmq-20160208-git/src/grovel" "/Users/testgrid/cl-test-grid/work-dir/agent/test-runs/20160219210452-ccl-1.11-r16635-f96-macosx-x86/fasl/ql/dists/quicklisp/software/lisp-zmq-20160208-git/src/grovel.c" Output was: /Users/testgrid/cl-test-grid/work-dir/agent/test-runs/20160219210452-ccl-1.11-r16635-f96-macosx-x86/fasl/ql/dists/quicklisp/software/lisp-zmq-20160208-git/src/grovel.c:6:10: fatal error: 'zmq.h' file not found #include <zmq.h> ^ 1 error generated.
ccl-1.11-r16702m-f101-linux-arm
(LOAD zmq-test FAIL) ffi-grovel, CFFI-GROVEL:GROVEL-ERROR : External process exited with code 1. Command was: "cc" "-marm" "-I/home/testgrid/cl-test-grid/work-dir/agent/quicklisp/dists/quicklisp/software/cffi_0.16.1/" "-o" "/home/testgrid/cl-test-grid/work-dir/agent/test-runs/20160218133323-ccl-1.11-r16702m-f101-linux-arm/fasl/ql/dists/quicklisp/software/lisp-zmq-20160208-git/src/grovel" "/home/testgrid/cl-test-grid/work-dir/agent/test-runs/20160218133323-ccl-1.11-r16702m-f101-linux-arm/fasl/ql/dists/quicklisp/software/lisp-zmq-20160208-git/src/grovel.c" Output was: /home/testgrid/cl-test-grid/work-dir/agent/test-runs/20160218133323-ccl-1.11-r16702m-f101-linux-arm/fasl/ql/dists/quicklisp/software/lisp-zmq-20160208-git/src/grovel.c:6:17: fatal error: zmq.h: No such file or directory compilation terminated.
(LOAD zmq-examples FAIL) ffi-grovel, CFFI-GROVEL:GROVEL-ERROR : External process exited with code 1. Command was: "cc" "-marm" "-I/home/testgrid/cl-test-grid/work-dir/agent/quicklisp/dists/quicklisp/software/cffi_0.16.1/" "-o" "/home/testgrid/cl-test-grid/work-dir/agent/test-runs/20160218133323-ccl-1.11-r16702m-f101-linux-arm/fasl/ql/dists/quicklisp/software/lisp-zmq-20160208-git/src/grovel" "/home/testgrid/cl-test-grid/work-dir/agent/test-runs/20160218133323-ccl-1.11-r16702m-f101-linux-arm/fasl/ql/dists/quicklisp/software/lisp-zmq-20160208-git/src/grovel.c" Output was: /home/testgrid/cl-test-grid/work-dir/agent/test-runs/20160218133323-ccl-1.11-r16702m-f101-linux-arm/fasl/ql/dists/quicklisp/software/lisp-zmq-20160208-git/src/grovel.c:6:17: fatal error: zmq.h: No such file or directory compilation terminated.
(LOAD zmq FAIL) ffi-grovel, CFFI-GROVEL:GROVEL-ERROR : External process exited with code 1. Command was: "cc" "-marm" "-I/home/testgrid/cl-test-grid/work-dir/agent/quicklisp/dists/quicklisp/software/cffi_0.16.1/" "-o" "/home/testgrid/cl-test-grid/work-dir/agent/test-runs/20160218133323-ccl-1.11-r16702m-f101-linux-arm/fasl/ql/dists/quicklisp/software/lisp-zmq-20160208-git/src/grovel" "/home/testgrid/cl-test-grid/work-dir/agent/test-runs/20160218133323-ccl-1.11-r16702m-f101-linux-arm/fasl/ql/dists/quicklisp/software/lisp-zmq-20160208-git/src/grovel.c" Output was: /home/testgrid/cl-test-grid/work-dir/agent/test-runs/20160218133323-ccl-1.11-r16702m-f101-linux-arm/fasl/ql/dists/quicklisp/software/lisp-zmq-20160208-git/src/grovel.c:6:17: fatal error: zmq.h: No such file or directory compilation terminated.
ccl-1.11-rc1-r16536-f101-linux-arm
(LOAD zmq-test FAIL) ffi-grovel, CFFI-GROVEL:GROVEL-ERROR : Subprocess (:PROCESS #<EXTERNAL-PROCESS (cc -marm -o ...)[5117] (EXITED : 1) #x45447966>) with command ("cc" "-marm" "-o" "/home/testgrid/cl-test-grid/work-dir/agent/test-runs/20160409092710-ccl-1.11-rc1-r16536-f101-linux-arm/fasl/ql/dists/quicklisp/software/lisp-zmq-20160208-git/src/grovel__grovel-tmpZWZK5Q2S" "-I/home/testgrid/cl-test-grid/work-dir/agent/quicklisp/dists/quicklisp/software/cffi_0.17.1/" "/home/testgrid/cl-test-grid/work-dir/agent/test-runs/20160409092710-ccl-1.11-rc1-r16536-f101-linux-arm/fasl/ql/dists/quicklisp/software/lisp-zmq-20160208-git/src/grovel__grovel.c") exited with error code 1
(LOAD zmq-examples FAIL) ffi-grovel, CFFI-GROVEL:GROVEL-ERROR : Subprocess (:PROCESS #<EXTERNAL-PROCESS (cc -marm -o ...)[5108] (EXITED : 1) #x4549A7E6>) with command ("cc" "-marm" "-o" "/home/testgrid/cl-test-grid/work-dir/agent/test-runs/20160409092710-ccl-1.11-rc1-r16536-f101-linux-arm/fasl/ql/dists/quicklisp/software/lisp-zmq-20160208-git/src/grovel__grovel-tmpZWZK5Q2S" "-I/home/testgrid/cl-test-grid/work-dir/agent/quicklisp/dists/quicklisp/software/cffi_0.17.1/" "/home/testgrid/cl-test-grid/work-dir/agent/test-runs/20160409092710-ccl-1.11-rc1-r16536-f101-linux-arm/fasl/ql/dists/quicklisp/software/lisp-zmq-20160208-git/src/grovel__grovel.c") exited with error code 1
(LOAD zmq FAIL) ffi-grovel, CFFI-GROVEL:GROVEL-ERROR : Subprocess (:PROCESS #<EXTERNAL-PROCESS (cc -marm -o ...)[5099] (EXITED : 1) #x45455B4E>) with command ("cc" "-marm" "-o" "/home/testgrid/cl-test-grid/work-dir/agent/test-runs/20160409092710-ccl-1.11-rc1-r16536-f101-linux-arm/fasl/ql/dists/quicklisp/software/lisp-zmq-20160208-git/src/grovel__grovel-tmpQDDPHH86" "-I/home/testgrid/cl-test-grid/work-dir/agent/quicklisp/dists/quicklisp/software/cffi_0.17.1/" "/home/testgrid/cl-test-grid/work-dir/agent/test-runs/20160409092710-ccl-1.11-rc1-r16536-f101-linux-arm/fasl/ql/dists/quicklisp/software/lisp-zmq-20160208-git/src/grovel__grovel.c") exited with error code 1
(LOAD zmq-test FAIL) ffi-grovel, CFFI-GROVEL:GROVEL-ERROR : External process exited with code 1. Command was: "cc" "-marm" "-I/home/testgrid/cl-test-grid/work-dir/agent/quicklisp/dists/quicklisp/software/cffi_0.16.1/" "-o" "/home/testgrid/cl-test-grid/work-dir/agent/test-runs/20160216170231-ccl-1.11-rc1-r16536-f101-linux-arm/fasl/ql/dists/quicklisp/software/lisp-zmq-20160208-git/src/grovel" "/home/testgrid/cl-test-grid/work-dir/agent/test-runs/20160216170231-ccl-1.11-rc1-r16536-f101-linux-arm/fasl/ql/dists/quicklisp/software/lisp-zmq-20160208-git/src/grovel.c" Output was: /home/testgrid/cl-test-grid/work-dir/agent/test-runs/20160216170231-ccl-1.11-rc1-r16536-f101-linux-arm/fasl/ql/dists/quicklisp/software/lisp-zmq-20160208-git/src/grovel.c:6:17: fatal error: zmq.h: No such file or directory #include <zmq.h> ^ compilation terminated.
(LOAD zmq-examples FAIL) ffi-grovel, CFFI-GROVEL:GROVEL-ERROR : External process exited with code 1. Command was: "cc" "-marm" "-I/home/testgrid/cl-test-grid/work-dir/agent/quicklisp/dists/quicklisp/software/cffi_0.16.1/" "-o" "/home/testgrid/cl-test-grid/work-dir/agent/test-runs/20160216170231-ccl-1.11-rc1-r16536-f101-linux-arm/fasl/ql/dists/quicklisp/software/lisp-zmq-20160208-git/src/grovel" "/home/testgrid/cl-test-grid/work-dir/agent/test-runs/20160216170231-ccl-1.11-rc1-r16536-f101-linux-arm/fasl/ql/dists/quicklisp/software/lisp-zmq-20160208-git/src/grovel.c" Output was: /home/testgrid/cl-test-grid/work-dir/agent/test-runs/20160216170231-ccl-1.11-rc1-r16536-f101-linux-arm/fasl/ql/dists/quicklisp/software/lisp-zmq-20160208-git/src/grovel.c:6:17: fatal error: zmq.h: No such file or directory #include <zmq.h> ^ compilation terminated.
(LOAD zmq FAIL) ffi-grovel, CFFI-GROVEL:GROVEL-ERROR : External process exited with code 1. Command was: "cc" "-marm" "-I/home/testgrid/cl-test-grid/work-dir/agent/quicklisp/dists/quicklisp/software/cffi_0.16.1/" "-o" "/home/testgrid/cl-test-grid/work-dir/agent/test-runs/20160216170231-ccl-1.11-rc1-r16536-f101-linux-arm/fasl/ql/dists/quicklisp/software/lisp-zmq-20160208-git/src/grovel" "/home/testgrid/cl-test-grid/work-dir/agent/test-runs/20160216170231-ccl-1.11-rc1-r16536-f101-linux-arm/fasl/ql/dists/quicklisp/software/lisp-zmq-20160208-git/src/grovel.c" Output was: /home/testgrid/cl-test-grid/work-dir/agent/test-runs/20160216170231-ccl-1.11-rc1-r16536-f101-linux-arm/fasl/ql/dists/quicklisp/software/lisp-zmq-20160208-git/src/grovel.c:6:17: fatal error: zmq.h: No such file or directory #include <zmq.h> ^ compilation terminated.
ccl-1.11-rc1-r16536-f96-linux-x86
(LOAD zmq-test FAIL) ffi-grovel, CFFI-GROVEL:GROVEL-ERROR : Subprocess (:PROCESS #<EXTERNAL-PROCESS (cc -m32 -o ...)[31348] (EXITED : 1) #x18EC3B66>) with command ("cc" "-m32" "-o" "/home/testgrid/cl-test-grid/work-dir/agent/test-runs/20160325142452-ccl-1.11-rc1-r16536-f96-linux-x86/fasl/ql/dists/quicklisp/software/lisp-zmq-20160208-git/src/grovel__grovel-tmpZWZK5Q2S" "-I/home/testgrid/cl-test-grid/work-dir/agent/quicklisp/dists/quicklisp/software/cffi_0.17.1/" "/home/testgrid/cl-test-grid/work-dir/agent/test-runs/20160325142452-ccl-1.11-rc1-r16536-f96-linux-x86/fasl/ql/dists/quicklisp/software/lisp-zmq-20160208-git/src/grovel__grovel.c") exited with error code 1
(LOAD zmq-examples FAIL) ffi-grovel, CFFI-GROVEL:GROVEL-ERROR : Subprocess (:PROCESS #<EXTERNAL-PROCESS (cc -m32 -o ...)[31339] (EXITED : 1) #x18F15D76>) with command ("cc" "-m32" "-o" "/home/testgrid/cl-test-grid/work-dir/agent/test-runs/20160325142452-ccl-1.11-rc1-r16536-f96-linux-x86/fasl/ql/dists/quicklisp/software/lisp-zmq-20160208-git/src/grovel__grovel-tmpZWZK5Q2S" "-I/home/testgrid/cl-test-grid/work-dir/agent/quicklisp/dists/quicklisp/software/cffi_0.17.1/" "/home/testgrid/cl-test-grid/work-dir/agent/test-runs/20160325142452-ccl-1.11-rc1-r16536-f96-linux-x86/fasl/ql/dists/quicklisp/software/lisp-zmq-20160208-git/src/grovel__grovel.c") exited with error code 1
(LOAD zmq FAIL) ffi-grovel, CFFI-GROVEL:GROVEL-ERROR : Subprocess (:PROCESS #<EXTERNAL-PROCESS (cc -m32 -o ...)[31330] (EXITED : 1) #x18EB1206>) with command ("cc" "-m32" "-o" "/home/testgrid/cl-test-grid/work-dir/agent/test-runs/20160325142452-ccl-1.11-rc1-r16536-f96-linux-x86/fasl/ql/dists/quicklisp/software/lisp-zmq-20160208-git/src/grovel__grovel-tmpQDDPHH86" "-I/home/testgrid/cl-test-grid/work-dir/agent/quicklisp/dists/quicklisp/software/cffi_0.17.1/" "/home/testgrid/cl-test-grid/work-dir/agent/test-runs/20160325142452-ccl-1.11-rc1-r16536-f96-linux-x86/fasl/ql/dists/quicklisp/software/lisp-zmq-20160208-git/src/grovel__grovel.c") exited with error code 1
(LOAD zmq-test FAIL) ffi-grovel, CFFI-GROVEL:GROVEL-ERROR : External process exited with code 1. Command was: "cc" "-m32" "-I/home/testgrid/cl-test-grid/work-dir/agent/quicklisp/dists/quicklisp/software/cffi_0.16.1/" "-o" "/home/testgrid/cl-test-grid/work-dir/agent/test-runs/20160216134117-ccl-1.11-rc1-r16536-f96-linux-x86/fasl/ql/dists/quicklisp/software/lisp-zmq-20160208-git/src/grovel" "/home/testgrid/cl-test-grid/work-dir/agent/test-runs/20160216134117-ccl-1.11-rc1-r16536-f96-linux-x86/fasl/ql/dists/quicklisp/software/lisp-zmq-20160208-git/src/grovel.c" Output was: /home/testgrid/cl-test-grid/work-dir/agent/test-runs/20160216134117-ccl-1.11-rc1-r16536-f96-linux-x86/fasl/ql/dists/quicklisp/software/lisp-zmq-20160208-git/src/grovel.c:6:17: fatal error: zmq.h: No such file or directory compilation terminated.
(LOAD zmq-examples FAIL) ffi-grovel, CFFI-GROVEL:GROVEL-ERROR : External process exited with code 1. Command was: "cc" "-m32" "-I/home/testgrid/cl-test-grid/work-dir/agent/quicklisp/dists/quicklisp/software/cffi_0.16.1/" "-o" "/home/testgrid/cl-test-grid/work-dir/agent/test-runs/20160216134117-ccl-1.11-rc1-r16536-f96-linux-x86/fasl/ql/dists/quicklisp/software/lisp-zmq-20160208-git/src/grovel" "/home/testgrid/cl-test-grid/work-dir/agent/test-runs/20160216134117-ccl-1.11-rc1-r16536-f96-linux-x86/fasl/ql/dists/quicklisp/software/lisp-zmq-20160208-git/src/grovel.c" Output was: /home/testgrid/cl-test-grid/work-dir/agent/test-runs/20160216134117-ccl-1.11-rc1-r16536-f96-linux-x86/fasl/ql/dists/quicklisp/software/lisp-zmq-20160208-git/src/grovel.c:6:17: fatal error: zmq.h: No such file or directory compilation terminated.
(LOAD zmq FAIL) ffi-grovel, CFFI-GROVEL:GROVEL-ERROR : External process exited with code 1. Command was: "cc" "-m32" "-I/home/testgrid/cl-test-grid/work-dir/agent/quicklisp/dists/quicklisp/software/cffi_0.16.1/" "-o" "/home/testgrid/cl-test-grid/work-dir/agent/test-runs/20160216134117-ccl-1.11-rc1-r16536-f96-linux-x86/fasl/ql/dists/quicklisp/software/lisp-zmq-20160208-git/src/grovel" "/home/testgrid/cl-test-grid/work-dir/agent/test-runs/20160216134117-ccl-1.11-rc1-r16536-f96-linux-x86/fasl/ql/dists/quicklisp/software/lisp-zmq-20160208-git/src/grovel.c" Output was: /home/testgrid/cl-test-grid/work-dir/agent/test-runs/20160216134117-ccl-1.11-rc1-r16536-f96-linux-x86/fasl/ql/dists/quicklisp/software/lisp-zmq-20160208-git/src/grovel.c:6:17: fatal error: zmq.h: No such file or directory compilation terminated.
ccl-1.8-r15286m-f95-linux-x86
(LOAD zmq-test FAIL) ASDF:LOAD-SYSTEM-DEFINITION-ERROR : Error while trying to load definition for system bordeaux-threads from pathname /home/testgrid/cl-test-grid/work-dir/agent/quicklisp/dists/quicklisp/software/bordeaux-threads-v0.8.5/bordeaux-threads.asd: You need ASDF >= 3.1 to load this system correctly.
(LOAD zmq-examples FAIL) ASDF:LOAD-SYSTEM-DEFINITION-ERROR : Error while trying to load definition for system bordeaux-threads from pathname /home/testgrid/cl-test-grid/work-dir/agent/quicklisp/dists/quicklisp/software/bordeaux-threads-v0.8.5/bordeaux-threads.asd: You need ASDF >= 3.1 to load this system correctly.
(LOAD zmq FAIL) ASDF:LOAD-SYSTEM-DEFINITION-ERROR : Error while trying to load definition for system zmq from pathname /home/testgrid/cl-test-grid/work-dir/agent/quicklisp/dists/quicklisp/software/lisp-zmq-20160208-git/zmq.asd: Error while trying to load definition for system cffi-toolchain from pathname /home/testgrid/cl-test-grid/work-dir/agent/quicklisp/dists/quicklisp/software/cffi_0.17.1/cffi-toolchain.asd: CFFI-toolchain requires ASDF 3.1!
(LOAD zmq-test FAIL) ASDF:LOAD-SYSTEM-DEFINITION-ERROR : Error while trying to load definition for system bordeaux-threads from pathname /home/testgrid/cl-test-grid/work-dir/agent/quicklisp/dists/quicklisp/software/bordeaux-threads-v0.8.4-git/bordeaux-threads.asd: There is no package named "UIOP" .
(LOAD zmq-examples FAIL) ASDF:LOAD-SYSTEM-DEFINITION-ERROR : Error while trying to load definition for system bordeaux-threads from pathname /home/testgrid/cl-test-grid/work-dir/agent/quicklisp/dists/quicklisp/software/bordeaux-threads-v0.8.4-git/bordeaux-threads.asd: There is no package named "UIOP" .
(LOAD zmq FAIL) ffi-grovel, CFFI-GROVEL:GROVEL-ERROR : External process exited with code 1. Command was: "cc" "-m32" "-I/home/testgrid/cl-test-grid/work-dir/agent/quicklisp/dists/quicklisp/software/cffi_0.16.1/" "-o" "/home/testgrid/cl-test-grid/work-dir/agent/test-runs/20160217020635-ccl-1.8-r15286m-f95-linux-x86/fasl/ql/dists/quicklisp/software/lisp-zmq-20160208-git/src/grovel" "/home/testgrid/cl-test-grid/work-dir/agent/test-runs/20160217020635-ccl-1.8-r15286m-f95-linux-x86/fasl/ql/dists/quicklisp/software/lisp-zmq-20160208-git/src/grovel.c" Output was: /home/testgrid/cl-test-grid/work-dir/agent/test-runs/20160217020635-ccl-1.8-r15286m-f95-linux-x86/fasl/ql/dists/quicklisp/software/lisp-zmq-20160208-git/src/grovel.c:6:17: fatal error: zmq.h: No such file or directory compilation terminated.
ccl-1.8-r15286m-f97-linux-arm
(LOAD zmq-test FAIL) ASDF:LOAD-SYSTEM-DEFINITION-ERROR : Error while trying to load definition for system bordeaux-threads from pathname /home/testgrid/cl-test-grid/work-dir/agent/quicklisp/dists/quicklisp/software/bordeaux-threads-v0.8.5/bordeaux-threads.asd: You need ASDF >= 3.1 to load this system correctly.
(LOAD zmq-examples FAIL) ASDF:LOAD-SYSTEM-DEFINITION-ERROR : Error while trying to load definition for system bordeaux-threads from pathname /home/testgrid/cl-test-grid/work-dir/agent/quicklisp/dists/quicklisp/software/bordeaux-threads-v0.8.5/bordeaux-threads.asd: You need ASDF >= 3.1 to load this system correctly.
(LOAD zmq FAIL) ASDF:LOAD-SYSTEM-DEFINITION-ERROR : Error while trying to load definition for system zmq from pathname /home/testgrid/cl-test-grid/work-dir/agent/quicklisp/dists/quicklisp/software/lisp-zmq-20160208-git/zmq.asd: Error while trying to load definition for system cffi-toolchain from pathname /home/testgrid/cl-test-grid/work-dir/agent/quicklisp/dists/quicklisp/software/cffi_0.17.1/cffi-toolchain.asd: CFFI-toolchain requires ASDF 3.1!
(LOAD zmq-test FAIL) ASDF:LOAD-SYSTEM-DEFINITION-ERROR : Error while trying to load definition for system bordeaux-threads from pathname /home/testgrid/cl-test-grid/work-dir/agent/quicklisp/dists/quicklisp/software/bordeaux-threads-v0.8.4-git/bordeaux-threads.asd: There is no package named "UIOP" .
(LOAD zmq-examples FAIL) ASDF:LOAD-SYSTEM-DEFINITION-ERROR : Error while trying to load definition for system bordeaux-threads from pathname /home/testgrid/cl-test-grid/work-dir/agent/quicklisp/dists/quicklisp/software/bordeaux-threads-v0.8.4-git/bordeaux-threads.asd: There is no package named "UIOP" .
(LOAD zmq FAIL) ffi-grovel, CFFI-GROVEL:GROVEL-ERROR : External process exited with code 1. Command was: "cc" "-marm" "-I/home/testgrid/cl-test-grid/work-dir/agent/quicklisp/dists/quicklisp/software/cffi_0.16.1/" "-o" "/home/testgrid/cl-test-grid/work-dir/agent/test-runs/20160216093619-ccl-1.8-r15286m-f97-linux-arm/fasl/ql/dists/quicklisp/software/lisp-zmq-20160208-git/src/grovel" "/home/testgrid/cl-test-grid/work-dir/agent/test-runs/20160216093619-ccl-1.8-r15286m-f97-linux-arm/fasl/ql/dists/quicklisp/software/lisp-zmq-20160208-git/src/grovel.c" Output was: /home/testgrid/cl-test-grid/work-dir/agent/test-runs/20160216093619-ccl-1.8-r15286m-f97-linux-arm/fasl/ql/dists/quicklisp/software/lisp-zmq-20160208-git/src/grovel.c:6:17: fatal error: zmq.h: No such file or directory #include <zmq.h> ^ compilation terminated.
ccl-1.9-r15756-f96-linux-x86
(LOAD zmq-test FAIL) ASDF/FIND-SYSTEM:LOAD-SYSTEM-DEFINITION-ERROR : Error while trying to load definition for system zmq from pathname /home/testgrid/cl-test-grid/work-dir/agent/quicklisp/dists/quicklisp/software/lisp-zmq-20160208-git/zmq.asd: Error while trying to load definition for system cffi-toolchain from pathname /home/testgrid/cl-test-grid/work-dir/agent/quicklisp/dists/quicklisp/software/cffi_0.17.1/cffi-toolchain.asd: CFFI-toolchain requires ASDF 3.1!
(LOAD zmq-examples FAIL) ASDF/FIND-SYSTEM:LOAD-SYSTEM-DEFINITION-ERROR : Error while trying to load definition for system zmq from pathname /home/testgrid/cl-test-grid/work-dir/agent/quicklisp/dists/quicklisp/software/lisp-zmq-20160208-git/zmq.asd: Error while trying to load definition for system cffi-toolchain from pathname /home/testgrid/cl-test-grid/work-dir/agent/quicklisp/dists/quicklisp/software/cffi_0.17.1/cffi-toolchain.asd: CFFI-toolchain requires ASDF 3.1!
(LOAD zmq FAIL) ASDF/FIND-SYSTEM:LOAD-SYSTEM-DEFINITION-ERROR : Error while trying to load definition for system zmq from pathname /home/testgrid/cl-test-grid/work-dir/agent/quicklisp/dists/quicklisp/software/lisp-zmq-20160208-git/zmq.asd: Error while trying to load definition for system cffi-toolchain from pathname /home/testgrid/cl-test-grid/work-dir/agent/quicklisp/dists/quicklisp/software/cffi_0.17.1/cffi-toolchain.asd: CFFI-toolchain requires ASDF 3.1!
(LOAD zmq-test FAIL) ffi-grovel, CFFI-GROVEL:GROVEL-ERROR : External process exited with code 1. Command was: "cc" "-m32" "-I/home/testgrid/cl-test-grid/work-dir/agent/quicklisp/dists/quicklisp/software/cffi_0.16.1/" "-o" "/home/testgrid/cl-test-grid/work-dir/agent/test-runs/20160216090332-ccl-1.9-r15756-f96-linux-x86/fasl/ql/dists/quicklisp/software/lisp-zmq-20160208-git/src/grovel" "/home/testgrid/cl-test-grid/work-dir/agent/test-runs/20160216090332-ccl-1.9-r15756-f96-linux-x86/fasl/ql/dists/quicklisp/software/lisp-zmq-20160208-git/src/grovel.c" Output was: /home/testgrid/cl-test-grid/work-dir/agent/test-runs/20160216090332-ccl-1.9-r15756-f96-linux-x86/fasl/ql/dists/quicklisp/software/lisp-zmq-20160208-git/src/grovel.c:6:17: fatal error: zmq.h: No such file or directory compilation terminated.
(LOAD zmq-examples FAIL) ffi-grovel, CFFI-GROVEL:GROVEL-ERROR : External process exited with code 1. Command was: "cc" "-m32" "-I/home/testgrid/cl-test-grid/work-dir/agent/quicklisp/dists/quicklisp/software/cffi_0.16.1/" "-o" "/home/testgrid/cl-test-grid/work-dir/agent/test-runs/20160216090332-ccl-1.9-r15756-f96-linux-x86/fasl/ql/dists/quicklisp/software/lisp-zmq-20160208-git/src/grovel" "/home/testgrid/cl-test-grid/work-dir/agent/test-runs/20160216090332-ccl-1.9-r15756-f96-linux-x86/fasl/ql/dists/quicklisp/software/lisp-zmq-20160208-git/src/grovel.c" Output was: /home/testgrid/cl-test-grid/work-dir/agent/test-runs/20160216090332-ccl-1.9-r15756-f96-linux-x86/fasl/ql/dists/quicklisp/software/lisp-zmq-20160208-git/src/grovel.c:6:17: fatal error: zmq.h: No such file or directory compilation terminated.
(LOAD zmq FAIL) ffi-grovel, CFFI-GROVEL:GROVEL-ERROR : External process exited with code 1. Command was: "cc" "-m32" "-I/home/testgrid/cl-test-grid/work-dir/agent/quicklisp/dists/quicklisp/software/cffi_0.16.1/" "-o" "/home/testgrid/cl-test-grid/work-dir/agent/test-runs/20160216090332-ccl-1.9-r15756-f96-linux-x86/fasl/ql/dists/quicklisp/software/lisp-zmq-20160208-git/src/grovel" "/home/testgrid/cl-test-grid/work-dir/agent/test-runs/20160216090332-ccl-1.9-r15756-f96-linux-x86/fasl/ql/dists/quicklisp/software/lisp-zmq-20160208-git/src/grovel.c" Output was: /home/testgrid/cl-test-grid/work-dir/agent/test-runs/20160216090332-ccl-1.9-r15756-f96-linux-x86/fasl/ql/dists/quicklisp/software/lisp-zmq-20160208-git/src/grovel.c:6:17: fatal error: zmq.h: No such file or directory compilation terminated.
ccl-1.9-r15767-f99-linux-arm
(LOAD zmq-test FAIL) ASDF/FIND-SYSTEM:LOAD-SYSTEM-DEFINITION-ERROR : Error while trying to load definition for system zmq from pathname /home/testgrid/cl-test-grid/work-dir/agent/quicklisp/dists/quicklisp/software/lisp-zmq-20160208-git/zmq.asd: Error while trying to load definition for system cffi-toolchain from pathname /home/testgrid/cl-test-grid/work-dir/agent/quicklisp/dists/quicklisp/software/cffi_0.17.1/cffi-toolchain.asd: CFFI-toolchain requires ASDF 3.1!
(LOAD zmq-examples FAIL) ASDF/FIND-SYSTEM:LOAD-SYSTEM-DEFINITION-ERROR : Error while trying to load definition for system zmq from pathname /home/testgrid/cl-test-grid/work-dir/agent/quicklisp/dists/quicklisp/software/lisp-zmq-20160208-git/zmq.asd: Error while trying to load definition for system cffi-toolchain from pathname /home/testgrid/cl-test-grid/work-dir/agent/quicklisp/dists/quicklisp/software/cffi_0.17.1/cffi-toolchain.asd: CFFI-toolchain requires ASDF 3.1!
(LOAD zmq FAIL) ASDF/FIND-SYSTEM:LOAD-SYSTEM-DEFINITION-ERROR : Error while trying to load definition for system zmq from pathname /home/testgrid/cl-test-grid/work-dir/agent/quicklisp/dists/quicklisp/software/lisp-zmq-20160208-git/zmq.asd: Error while trying to load definition for system cffi-toolchain from pathname /home/testgrid/cl-test-grid/work-dir/agent/quicklisp/dists/quicklisp/software/cffi_0.17.1/cffi-toolchain.asd: CFFI-toolchain requires ASDF 3.1!
(LOAD zmq-test FAIL) ffi-grovel, CFFI-GROVEL:GROVEL-ERROR : External process exited with code 1. Command was: "cc" "-marm" "-I/home/testgrid/cl-test-grid/work-dir/agent/quicklisp/dists/quicklisp/software/cffi_0.16.1/" "-o" "/home/testgrid/cl-test-grid/work-dir/agent/test-runs/20160215204000-ccl-1.9-r15767-f99-linux-arm/fasl/ql/dists/quicklisp/software/lisp-zmq-20160208-git/src/grovel" "/home/testgrid/cl-test-grid/work-dir/agent/test-runs/20160215204000-ccl-1.9-r15767-f99-linux-arm/fasl/ql/dists/quicklisp/software/lisp-zmq-20160208-git/src/grovel.c" Output was: /home/testgrid/cl-test-grid/work-dir/agent/test-runs/20160215204000-ccl-1.9-r15767-f99-linux-arm/fasl/ql/dists/quicklisp/software/lisp-zmq-20160208-git/src/grovel.c:6:17: fatal error: zmq.h: No such file or directory #include <zmq.h> ^ compilation terminated.
(LOAD zmq-examples FAIL) ffi-grovel, CFFI-GROVEL:GROVEL-ERROR : External process exited with code 1. Command was: "cc" "-marm" "-I/home/testgrid/cl-test-grid/work-dir/agent/quicklisp/dists/quicklisp/software/cffi_0.16.1/" "-o" "/home/testgrid/cl-test-grid/work-dir/agent/test-runs/20160215204000-ccl-1.9-r15767-f99-linux-arm/fasl/ql/dists/quicklisp/software/lisp-zmq-20160208-git/src/grovel" "/home/testgrid/cl-test-grid/work-dir/agent/test-runs/20160215204000-ccl-1.9-r15767-f99-linux-arm/fasl/ql/dists/quicklisp/software/lisp-zmq-20160208-git/src/grovel.c" Output was: /home/testgrid/cl-test-grid/work-dir/agent/test-runs/20160215204000-ccl-1.9-r15767-f99-linux-arm/fasl/ql/dists/quicklisp/software/lisp-zmq-20160208-git/src/grovel.c:6:17: fatal error: zmq.h: No such file or directory #include <zmq.h> ^ compilation terminated.
(LOAD zmq FAIL) ffi-grovel, CFFI-GROVEL:GROVEL-ERROR : External process exited with code 1. Command was: "cc" "-marm" "-I/home/testgrid/cl-test-grid/work-dir/agent/quicklisp/dists/quicklisp/software/cffi_0.16.1/" "-o" "/home/testgrid/cl-test-grid/work-dir/agent/test-runs/20160215204000-ccl-1.9-r15767-f99-linux-arm/fasl/ql/dists/quicklisp/software/lisp-zmq-20160208-git/src/grovel" "/home/testgrid/cl-test-grid/work-dir/agent/test-runs/20160215204000-ccl-1.9-r15767-f99-linux-arm/fasl/ql/dists/quicklisp/software/lisp-zmq-20160208-git/src/grovel.c" Output was: /home/testgrid/cl-test-grid/work-dir/agent/test-runs/20160215204000-ccl-1.9-r15767-f99-linux-arm/fasl/ql/dists/quicklisp/software/lisp-zmq-20160208-git/src/grovel.c:6:17: fatal error: zmq.h: No such file or directory #include <zmq.h> ^ compilation terminated.
clisp-2.49-unix-armv7l
(LOAD zmq-test FAIL) ASDF:LOAD-SYSTEM-DEFINITION-ERROR : Error while trying to load definition for system bordeaux-threads from pathname /home/testgrid/cl-test-grid/work-dir/agent/quicklisp/dists/quicklisp/software/bordeaux-threads-v0.8.5/bordeaux-threads.asd: You need ASDF >= 3.1 to load this system correctly.
(LOAD zmq-examples FAIL) ASDF:LOAD-SYSTEM-DEFINITION-ERROR : Error while trying to load definition for system bordeaux-threads from pathname /home/testgrid/cl-test-grid/work-dir/agent/quicklisp/dists/quicklisp/software/bordeaux-threads-v0.8.5/bordeaux-threads.asd: You need ASDF >= 3.1 to load this system correctly.
(LOAD zmq FAIL) ASDF:LOAD-SYSTEM-DEFINITION-ERROR : Error while trying to load definition for system zmq from pathname /home/testgrid/cl-test-grid/work-dir/agent/quicklisp/dists/quicklisp/software/lisp-zmq-20160208-git/zmq.asd: Error while trying to load definition for system cffi-toolchain from pathname /home/testgrid/cl-test-grid/work-dir/agent/quicklisp/dists/quicklisp/software/cffi_0.17.1/cffi-toolchain.asd: CFFI-toolchain requires ASDF 3.1!
(LOAD zmq-test FAIL) ASDF:LOAD-SYSTEM-DEFINITION-ERROR : Error while trying to load definition for system bordeaux-threads from pathname /home/testgrid/cl-test-grid/work-dir/agent/quicklisp/dists/quicklisp/software/bordeaux-threads-v0.8.4-git/bordeaux-threads.asd: READ from #<INPUT BUFFERED FILE-STREAM CHARACTER #P"/home/testgrid/cl-test-grid/work-dir/agent/quicklisp/dists/quicklisp/software/bordeaux-threads-v0.8.4-git/bordeaux-threads.asd" @68>: there is no package with name "UIOP"
(LOAD zmq-examples FAIL) ASDF:LOAD-SYSTEM-DEFINITION-ERROR : Error while trying to load definition for system bordeaux-threads from pathname /home/testgrid/cl-test-grid/work-dir/agent/quicklisp/dists/quicklisp/software/bordeaux-threads-v0.8.4-git/bordeaux-threads.asd: READ from #<INPUT BUFFERED FILE-STREAM CHARACTER #P"/home/testgrid/cl-test-grid/work-dir/agent/quicklisp/dists/quicklisp/software/bordeaux-threads-v0.8.4-git/bordeaux-threads.asd" @68>: there is no package with name "UIOP"
(LOAD zmq FAIL) ffi-grovel, CFFI-GROVEL:GROVEL-ERROR : External process exited with code 1. Command was: "cc" "-m32" "-I/home/testgrid/cl-test-grid/work-dir/agent/quicklisp/dists/quicklisp/software/cffi_0.16.1/" "-o" "/home/testgrid/cl-test-grid/work-dir/agent/test-runs/20160217083144-clisp-2.49-unix-armv7l/fasl/ql/dists/quicklisp/software/lisp-zmq-20160208-git/src/grovel" "/home/testgrid/cl-test-grid/work-dir/agent/test-runs/20160217083144-clisp-2.49-unix-armv7l/fasl/ql/dists/quicklisp/software/lisp-zmq-20160208-git/src/grovel.c" Output was:
clisp-2.49-unix-x86
(LOAD zmq-test FAIL) ASDF:LOAD-SYSTEM-DEFINITION-ERROR : Error while trying to load definition for system bordeaux-threads from pathname /home/testgrid/cl-test-grid/work-dir/agent/quicklisp/dists/quicklisp/software/bordeaux-threads-v0.8.5/bordeaux-threads.asd: You need ASDF >= 3.1 to load this system correctly.
(LOAD zmq-examples FAIL) ASDF:LOAD-SYSTEM-DEFINITION-ERROR : Error while trying to load definition for system bordeaux-threads from pathname /home/testgrid/cl-test-grid/work-dir/agent/quicklisp/dists/quicklisp/software/bordeaux-threads-v0.8.5/bordeaux-threads.asd: You need ASDF >= 3.1 to load this system correctly.
(LOAD zmq FAIL) ASDF:LOAD-SYSTEM-DEFINITION-ERROR : Error while trying to load definition for system zmq from pathname /home/testgrid/cl-test-grid/work-dir/agent/quicklisp/dists/quicklisp/software/lisp-zmq-20160208-git/zmq.asd: Error while trying to load definition for system cffi-toolchain from pathname /home/testgrid/cl-test-grid/work-dir/agent/quicklisp/dists/quicklisp/software/cffi_0.17.1/cffi-toolchain.asd: CFFI-toolchain requires ASDF 3.1!
(LOAD zmq-test FAIL) ASDF:LOAD-SYSTEM-DEFINITION-ERROR : Error while trying to load definition for system bordeaux-threads from pathname /home/testgrid/cl-test-grid/work-dir/agent/quicklisp/dists/quicklisp/software/bordeaux-threads-v0.8.4-git/bordeaux-threads.asd: READ from #<INPUT BUFFERED FILE-STREAM CHARACTER #P"/home/testgrid/cl-test-grid/work-dir/agent/quicklisp/dists/quicklisp/software/bordeaux-threads-v0.8.4-git/bordeaux-threads.asd" @68>: there is no package with name "UIOP"
(LOAD zmq-examples FAIL) ASDF:LOAD-SYSTEM-DEFINITION-ERROR : Error while trying to load definition for system bordeaux-threads from pathname /home/testgrid/cl-test-grid/work-dir/agent/quicklisp/dists/quicklisp/software/bordeaux-threads-v0.8.4-git/bordeaux-threads.asd: READ from #<INPUT BUFFERED FILE-STREAM CHARACTER #P"/home/testgrid/cl-test-grid/work-dir/agent/quicklisp/dists/quicklisp/software/bordeaux-threads-v0.8.4-git/bordeaux-threads.asd" @68>: there is no package with name "UIOP"
(LOAD zmq FAIL) ffi-grovel, CFFI-GROVEL:GROVEL-ERROR : External process exited with code 1. Command was: "cc" "-m32" "-I/home/testgrid/cl-test-grid/work-dir/agent/quicklisp/dists/quicklisp/software/cffi_0.16.1/" "-o" "/home/testgrid/cl-test-grid/work-dir/agent/test-runs/20160214095017-clisp-2.49-unix-x86/fasl/ql/dists/quicklisp/software/lisp-zmq-20160208-git/src/grovel" "/home/testgrid/cl-test-grid/work-dir/agent/test-runs/20160214095017-clisp-2.49-unix-x86/fasl/ql/dists/quicklisp/software/lisp-zmq-20160208-git/src/grovel.c" Output was:
cmu-snapshot-2013-04__20d_unicode_-linux-x86
(LOAD zmq-test FAIL) ASDF/FIND-SYSTEM:LOAD-SYSTEM-DEFINITION-ERROR : Error while trying to load definition for system zmq from pathname /home/testgrid/cl-test-grid/work-dir/agent/quicklisp/dists/quicklisp/software/lisp-zmq-20160208-git/zmq.asd: Error while trying to load definition for system cffi-toolchain from pathname /home/testgrid/cl-test-grid/work-dir/agent/quicklisp/dists/quicklisp/software/cffi_0.17.1/cffi-toolchain.asd: Error in function LISP::SLOLOAD: CFFI-toolchain requires ASDF 3.1!
(LOAD zmq-examples FAIL) ASDF/FIND-SYSTEM:LOAD-SYSTEM-DEFINITION-ERROR : Error while trying to load definition for system zmq from pathname /home/testgrid/cl-test-grid/work-dir/agent/quicklisp/dists/quicklisp/software/lisp-zmq-20160208-git/zmq.asd: Error while trying to load definition for system cffi-toolchain from pathname /home/testgrid/cl-test-grid/work-dir/agent/quicklisp/dists/quicklisp/software/cffi_0.17.1/cffi-toolchain.asd: Error in function LISP::SLOLOAD: CFFI-toolchain requires ASDF 3.1!
(LOAD zmq FAIL) ASDF/FIND-SYSTEM:LOAD-SYSTEM-DEFINITION-ERROR : Error while trying to load definition for system zmq from pathname /home/testgrid/cl-test-grid/work-dir/agent/quicklisp/dists/quicklisp/software/lisp-zmq-20160208-git/zmq.asd: Error while trying to load definition for system cffi-toolchain from pathname /home/testgrid/cl-test-grid/work-dir/agent/quicklisp/dists/quicklisp/software/cffi_0.17.1/cffi-toolchain.asd: Error in function LISP::SLOLOAD: CFFI-toolchain requires ASDF 3.1!
(LOAD zmq-test FAIL) ffi-grovel, CFFI-GROVEL:GROVEL-ERROR : Error in function CFFI-GROVEL:GROVEL-ERROR: External process exited with code 1. Command was: "cc" "-m32" "-I/home/testgrid/cl-test-grid/work-dir/agent/quicklisp/dists/quicklisp/software/cffi_0.16.1/" "-o" "/home/testgrid/cl-test-grid/work-dir/agent/test-runs/20160217101249-cmu-snapshot-2013-04__20d_unicode_-linux-x86/fasl/ql/dists/quicklisp/software/lisp-zmq-20160208-git/src/grovel" "/home/testgrid/cl-test-grid/work-dir/agent/test-runs/20160217101249-cmu-snapshot-2013-04__20d_unicode_-linux-x86/fasl/ql/dists/quicklisp/software/lisp-zmq-20160208-git/src/grovel.c" Output was: /home/testgrid/cl-test-grid/work-dir/agent/test-runs/20160217101249-cmu-snapshot-2013-04__20d_unicode_-linux-x86/fasl/ql/dists/quicklisp/software/lisp-zmq-20160208-git/src/grovel.c:6:17: fatal error: zmq.h: No such file or directory compilation terminated.
(LOAD zmq-examples FAIL) ffi-grovel, CFFI-GROVEL:GROVEL-ERROR : Error in function CFFI-GROVEL:GROVEL-ERROR: External process exited with code 1. Command was: "cc" "-m32" "-I/home/testgrid/cl-test-grid/work-dir/agent/quicklisp/dists/quicklisp/software/cffi_0.16.1/" "-o" "/home/testgrid/cl-test-grid/work-dir/agent/test-runs/20160217101249-cmu-snapshot-2013-04__20d_unicode_-linux-x86/fasl/ql/dists/quicklisp/software/lisp-zmq-20160208-git/src/grovel" "/home/testgrid/cl-test-grid/work-dir/agent/test-runs/20160217101249-cmu-snapshot-2013-04__20d_unicode_-linux-x86/fasl/ql/dists/quicklisp/software/lisp-zmq-20160208-git/src/grovel.c" Output was: /home/testgrid/cl-test-grid/work-dir/agent/test-runs/20160217101249-cmu-snapshot-2013-04__20d_unicode_-linux-x86/fasl/ql/dists/quicklisp/software/lisp-zmq-20160208-git/src/grovel.c:6:17: fatal error: zmq.h: No such file or directory compilation terminated.
(LOAD zmq FAIL) ffi-grovel, CFFI-GROVEL:GROVEL-ERROR : Error in function CFFI-GROVEL:GROVEL-ERROR: External process exited with code 1. Command was: "cc" "-m32" "-I/home/testgrid/cl-test-grid/work-dir/agent/quicklisp/dists/quicklisp/software/cffi_0.16.1/" "-o" "/home/testgrid/cl-test-grid/work-dir/agent/test-runs/20160217101249-cmu-snapshot-2013-04__20d_unicode_-linux-x86/fasl/ql/dists/quicklisp/software/lisp-zmq-20160208-git/src/grovel" "/home/testgrid/cl-test-grid/work-dir/agent/test-runs/20160217101249-cmu-snapshot-2013-04__20d_unicode_-linux-x86/fasl/ql/dists/quicklisp/software/lisp-zmq-20160208-git/src/grovel.c" Output was: /home/testgrid/cl-test-grid/work-dir/agent/test-runs/20160217101249-cmu-snapshot-2013-04__20d_unicode_-linux-x86/fasl/ql/dists/quicklisp/software/lisp-zmq-20160208-git/src/grovel.c:6:17: fatal error: zmq.h: No such file or directory compilation terminated.
cmu-snapshot-2014-01__20e_unicode_-linux-x86
(LOAD zmq-test FAIL) ASDF/FIND-SYSTEM:LOAD-SYSTEM-DEFINITION-ERROR : Error while trying to load definition for system zmq from pathname /home/testgrid/cl-test-grid/work-dir/agent/quicklisp/dists/quicklisp/software/lisp-zmq-20160208-git/zmq.asd: Error while trying to load definition for system cffi-toolchain from pathname /home/testgrid/cl-test-grid/work-dir/agent/quicklisp/dists/quicklisp/software/cffi_0.17.1/cffi-toolchain.asd: Error in function LISP::SLOLOAD: CFFI-toolchain requires ASDF 3.1!
(LOAD zmq-examples FAIL) ASDF/FIND-SYSTEM:LOAD-SYSTEM-DEFINITION-ERROR : Error while trying to load definition for system zmq from pathname /home/testgrid/cl-test-grid/work-dir/agent/quicklisp/dists/quicklisp/software/lisp-zmq-20160208-git/zmq.asd: Error while trying to load definition for system cffi-toolchain from pathname /home/testgrid/cl-test-grid/work-dir/agent/quicklisp/dists/quicklisp/software/cffi_0.17.1/cffi-toolchain.asd: Error in function LISP::SLOLOAD: CFFI-toolchain requires ASDF 3.1!
(LOAD zmq FAIL) ASDF/FIND-SYSTEM:LOAD-SYSTEM-DEFINITION-ERROR : Error while trying to load definition for system zmq from pathname /home/testgrid/cl-test-grid/work-dir/agent/quicklisp/dists/quicklisp/software/lisp-zmq-20160208-git/zmq.asd: Error while trying to load definition for system cffi-toolchain from pathname /home/testgrid/cl-test-grid/work-dir/agent/quicklisp/dists/quicklisp/software/cffi_0.17.1/cffi-toolchain.asd: Error in function LISP::SLOLOAD: CFFI-toolchain requires ASDF 3.1!
(LOAD zmq-test FAIL) ffi-grovel, CFFI-GROVEL:GROVEL-ERROR : Error in function CFFI-GROVEL:GROVEL-ERROR: External process exited with code 1. Command was: "cc" "-m32" "-I/home/testgrid/cl-test-grid/work-dir/agent/quicklisp/dists/quicklisp/software/cffi_0.16.1/" "-o" "/home/testgrid/cl-test-grid/work-dir/agent/test-runs/20160217072251-cmu-snapshot-2014-01__20e_unicode_-linux-x86/fasl/ql/dists/quicklisp/software/lisp-zmq-20160208-git/src/grovel" "/home/testgrid/cl-test-grid/work-dir/agent/test-runs/20160217072251-cmu-snapshot-2014-01__20e_unicode_-linux-x86/fasl/ql/dists/quicklisp/software/lisp-zmq-20160208-git/src/grovel.c" Output was: /home/testgrid/cl-test-grid/work-dir/agent/test-runs/20160217072251-cmu-snapshot-2014-01__20e_unicode_-linux-x86/fasl/ql/dists/quicklisp/software/lisp-zmq-20160208-git/src/grovel.c:6:17: fatal error: zmq.h: No such file or directory compilation terminated.
(LOAD zmq-examples FAIL) ffi-grovel, CFFI-GROVEL:GROVEL-ERROR : Error in function CFFI-GROVEL:GROVEL-ERROR: External process exited with code 1. Command was: "cc" "-m32" "-I/home/testgrid/cl-test-grid/work-dir/agent/quicklisp/dists/quicklisp/software/cffi_0.16.1/" "-o" "/home/testgrid/cl-test-grid/work-dir/agent/test-runs/20160217072251-cmu-snapshot-2014-01__20e_unicode_-linux-x86/fasl/ql/dists/quicklisp/software/lisp-zmq-20160208-git/src/grovel" "/home/testgrid/cl-test-grid/work-dir/agent/test-runs/20160217072251-cmu-snapshot-2014-01__20e_unicode_-linux-x86/fasl/ql/dists/quicklisp/software/lisp-zmq-20160208-git/src/grovel.c" Output was: /home/testgrid/cl-test-grid/work-dir/agent/test-runs/20160217072251-cmu-snapshot-2014-01__20e_unicode_-linux-x86/fasl/ql/dists/quicklisp/software/lisp-zmq-20160208-git/src/grovel.c:6:17: fatal error: zmq.h: No such file or directory compilation terminated.
(LOAD zmq FAIL) ffi-grovel, CFFI-GROVEL:GROVEL-ERROR : Error in function CFFI-GROVEL:GROVEL-ERROR: External process exited with code 1. Command was: "cc" "-m32" "-I/home/testgrid/cl-test-grid/work-dir/agent/quicklisp/dists/quicklisp/software/cffi_0.16.1/" "-o" "/home/testgrid/cl-test-grid/work-dir/agent/test-runs/20160217072251-cmu-snapshot-2014-01__20e_unicode_-linux-x86/fasl/ql/dists/quicklisp/software/lisp-zmq-20160208-git/src/grovel" "/home/testgrid/cl-test-grid/work-dir/agent/test-runs/20160217072251-cmu-snapshot-2014-01__20e_unicode_-linux-x86/fasl/ql/dists/quicklisp/software/lisp-zmq-20160208-git/src/grovel.c" Output was: /home/testgrid/cl-test-grid/work-dir/agent/test-runs/20160217072251-cmu-snapshot-2014-01__20e_unicode_-linux-x86/fasl/ql/dists/quicklisp/software/lisp-zmq-20160208-git/src/grovel.c:6:17: fatal error: zmq.h: No such file or directory compilation terminated.
cmu-snapshot-2014-05-dirty__20e_unicode_-linux-x86
(LOAD zmq-test FAIL) ASDF/FIND-SYSTEM:LOAD-SYSTEM-DEFINITION-ERROR : Error while trying to load definition for system zmq from pathname /home/testgrid/cl-test-grid/work-dir/agent/quicklisp/dists/quicklisp/software/lisp-zmq-20160208-git/zmq.asd: Error while trying to load definition for system cffi-toolchain from pathname /home/testgrid/cl-test-grid/work-dir/agent/quicklisp/dists/quicklisp/software/cffi_0.17.1/cffi-toolchain.asd: Error in function LISP::SLOLOAD: CFFI-toolchain requires ASDF 3.1!
(LOAD zmq-examples FAIL) ASDF/FIND-SYSTEM:LOAD-SYSTEM-DEFINITION-ERROR : Error while trying to load definition for system zmq from pathname /home/testgrid/cl-test-grid/work-dir/agent/quicklisp/dists/quicklisp/software/lisp-zmq-20160208-git/zmq.asd: Error while trying to load definition for system cffi-toolchain from pathname /home/testgrid/cl-test-grid/work-dir/agent/quicklisp/dists/quicklisp/software/cffi_0.17.1/cffi-toolchain.asd: Error in function LISP::SLOLOAD: CFFI-toolchain requires ASDF 3.1!
(LOAD zmq FAIL) ASDF/FIND-SYSTEM:LOAD-SYSTEM-DEFINITION-ERROR : Error while trying to load definition for system zmq from pathname /home/testgrid/cl-test-grid/work-dir/agent/quicklisp/dists/quicklisp/software/lisp-zmq-20160208-git/zmq.asd: Error while trying to load definition for system cffi-toolchain from pathname /home/testgrid/cl-test-grid/work-dir/agent/quicklisp/dists/quicklisp/software/cffi_0.17.1/cffi-toolchain.asd: Error in function LISP::SLOLOAD: CFFI-toolchain requires ASDF 3.1!
(LOAD zmq-test FAIL) ffi-grovel, CFFI-GROVEL:GROVEL-ERROR : Error in function CFFI-GROVEL:GROVEL-ERROR: External process exited with code 1. Command was: "cc" "-m32" "-I/home/testgrid/cl-test-grid/work-dir/agent/quicklisp/dists/quicklisp/software/cffi_0.16.1/" "-o" "/home/testgrid/cl-test-grid/work-dir/agent/test-runs/20160217042443-cmu-snapshot-2014-05-dirty__20e_unicode_-linux-x86/fasl/ql/dists/quicklisp/software/lisp-zmq-20160208-git/src/grovel" "/home/testgrid/cl-test-grid/work-dir/agent/test-runs/20160217042443-cmu-snapshot-2014-05-dirty__20e_unicode_-linux-x86/fasl/ql/dists/quicklisp/software/lisp-zmq-20160208-git/src/grovel.c" Output was: /home/testgrid/cl-test-grid/work-dir/agent/test-runs/20160217042443-cmu-snapshot-2014-05-dirty__20e_unicode_-linux-x86/fasl/ql/dists/quicklisp/software/lisp-zmq-20160208-git/src/grovel.c:6:17: fatal error: zmq.h: No such file or directory compilation terminated.
(LOAD zmq-examples FAIL) ffi-grovel, CFFI-GROVEL:GROVEL-ERROR : Error in function CFFI-GROVEL:GROVEL-ERROR: External process exited with code 1. Command was: "cc" "-m32" "-I/home/testgrid/cl-test-grid/work-dir/agent/quicklisp/dists/quicklisp/software/cffi_0.16.1/" "-o" "/home/testgrid/cl-test-grid/work-dir/agent/test-runs/20160217042443-cmu-snapshot-2014-05-dirty__20e_unicode_-linux-x86/fasl/ql/dists/quicklisp/software/lisp-zmq-20160208-git/src/grovel" "/home/testgrid/cl-test-grid/work-dir/agent/test-runs/20160217042443-cmu-snapshot-2014-05-dirty__20e_unicode_-linux-x86/fasl/ql/dists/quicklisp/software/lisp-zmq-20160208-git/src/grovel.c" Output was: /home/testgrid/cl-test-grid/work-dir/agent/test-runs/20160217042443-cmu-snapshot-2014-05-dirty__20e_unicode_-linux-x86/fasl/ql/dists/quicklisp/software/lisp-zmq-20160208-git/src/grovel.c:6:17: fatal error: zmq.h: No such file or directory compilation terminated.
(LOAD zmq FAIL) ffi-grovel, CFFI-GROVEL:GROVEL-ERROR : Error in function CFFI-GROVEL:GROVEL-ERROR: External process exited with code 1. Command was: "cc" "-m32" "-I/home/testgrid/cl-test-grid/work-dir/agent/quicklisp/dists/quicklisp/software/cffi_0.16.1/" "-o" "/home/testgrid/cl-test-grid/work-dir/agent/test-runs/20160217042443-cmu-snapshot-2014-05-dirty__20e_unicode_-linux-x86/fasl/ql/dists/quicklisp/software/lisp-zmq-20160208-git/src/grovel" "/home/testgrid/cl-test-grid/work-dir/agent/test-runs/20160217042443-cmu-snapshot-2014-05-dirty__20e_unicode_-linux-x86/fasl/ql/dists/quicklisp/software/lisp-zmq-20160208-git/src/grovel.c" Output was: /home/testgrid/cl-test-grid/work-dir/agent/test-runs/20160217042443-cmu-snapshot-2014-05-dirty__20e_unicode_-linux-x86/fasl/ql/dists/quicklisp/software/lisp-zmq-20160208-git/src/grovel.c:6:17: fatal error: zmq.h: No such file or directory compilation terminated.
cmu-snapshot-2014-12___20f_unicode_-linux-x86
(LOAD zmq-test FAIL) ASDF/FIND-SYSTEM:LOAD-SYSTEM-DEFINITION-ERROR : Error while trying to load definition for system zmq from pathname /home/testgrid/cl-test-grid/work-dir/agent/quicklisp/dists/quicklisp/software/lisp-zmq-20160208-git/zmq.asd: (during macroexpansion) Error in FDEFINITION: the function GATHER-TYPE is undefined.
(LOAD zmq-examples FAIL) ASDF/FIND-SYSTEM:LOAD-SYSTEM-DEFINITION-ERROR : Error while trying to load definition for system zmq from pathname /home/testgrid/cl-test-grid/work-dir/agent/quicklisp/dists/quicklisp/software/lisp-zmq-20160208-git/zmq.asd: (during macroexpansion) Error in FDEFINITION: the function GATHER-TYPE is undefined.
(LOAD zmq FAIL) ASDF/FIND-SYSTEM:LOAD-SYSTEM-DEFINITION-ERROR : Error while trying to load definition for system zmq from pathname /home/testgrid/cl-test-grid/work-dir/agent/quicklisp/dists/quicklisp/software/lisp-zmq-20160208-git/zmq.asd: (during macroexpansion) Error in FDEFINITION: the function GATHER-TYPE is undefined.
(LOAD zmq-test FAIL) ffi-grovel, CFFI-GROVEL:GROVEL-ERROR : Error in function CFFI-GROVEL:GROVEL-ERROR: External process exited with code 1. Command was: "cc" "-m32" "-I/home/testgrid/cl-test-grid/work-dir/agent/quicklisp/dists/quicklisp/software/cffi_0.16.1/" "-o" "/home/testgrid/cl-test-grid/work-dir/agent/test-runs/20160214053403-cmu-snapshot-2014-12___20f_unicode_-linux-x86/fasl/ql/dists/quicklisp/software/lisp-zmq-20160208-git/src/grovel" "/home/testgrid/cl-test-grid/work-dir/agent/test-runs/20160214053403-cmu-snapshot-2014-12___20f_unicode_-linux-x86/fasl/ql/dists/quicklisp/software/lisp-zmq-20160208-git/src/grovel.c" Output was: /home/testgrid/cl-test-grid/work-dir/agent/test-runs/20160214053403-cmu-snapshot-2014-12___20f_unicode_-linux-x86/fasl/ql/dists/quicklisp/software/lisp-zmq-20160208-git/src/grovel.c:6:17: fatal error: zmq.h: No such file or directory compilation terminated.
(LOAD zmq-examples FAIL) ffi-grovel, CFFI-GROVEL:GROVEL-ERROR : Error in function CFFI-GROVEL:GROVEL-ERROR: External process exited with code 1. Command was: "cc" "-m32" "-I/home/testgrid/cl-test-grid/work-dir/agent/quicklisp/dists/quicklisp/software/cffi_0.16.1/" "-o" "/home/testgrid/cl-test-grid/work-dir/agent/test-runs/20160214053403-cmu-snapshot-2014-12___20f_unicode_-linux-x86/fasl/ql/dists/quicklisp/software/lisp-zmq-20160208-git/src/grovel" "/home/testgrid/cl-test-grid/work-dir/agent/test-runs/20160214053403-cmu-snapshot-2014-12___20f_unicode_-linux-x86/fasl/ql/dists/quicklisp/software/lisp-zmq-20160208-git/src/grovel.c" Output was: /home/testgrid/cl-test-grid/work-dir/agent/test-runs/20160214053403-cmu-snapshot-2014-12___20f_unicode_-linux-x86/fasl/ql/dists/quicklisp/software/lisp-zmq-20160208-git/src/grovel.c:6:17: fatal error: zmq.h: No such file or directory compilation terminated.
(LOAD zmq FAIL) ffi-grovel, CFFI-GROVEL:GROVEL-ERROR : Error in function CFFI-GROVEL:GROVEL-ERROR: External process exited with code 1. Command was: "cc" "-m32" "-I/home/testgrid/cl-test-grid/work-dir/agent/quicklisp/dists/quicklisp/software/cffi_0.16.1/" "-o" "/home/testgrid/cl-test-grid/work-dir/agent/test-runs/20160214053403-cmu-snapshot-2014-12___20f_unicode_-linux-x86/fasl/ql/dists/quicklisp/software/lisp-zmq-20160208-git/src/grovel" "/home/testgrid/cl-test-grid/work-dir/agent/test-runs/20160214053403-cmu-snapshot-2014-12___20f_unicode_-linux-x86/fasl/ql/dists/quicklisp/software/lisp-zmq-20160208-git/src/grovel.c" Output was: /home/testgrid/cl-test-grid/work-dir/agent/test-runs/20160214053403-cmu-snapshot-2014-12___20f_unicode_-linux-x86/fasl/ql/dists/quicklisp/software/lisp-zmq-20160208-git/src/grovel.c:6:17: fatal error: zmq.h: No such file or directory compilation terminated.
ecl-13.5.1-unknown-linux-i686-bytecode
(LOAD zmq-test FAIL) ASDF/FIND-SYSTEM:LOAD-SYSTEM-DEFINITION-ERROR : Error while trying to load definition for system zmq from pathname /home/testgrid/cl-test-grid/work-dir/agent/quicklisp/dists/quicklisp/software/lisp-zmq-20160208-git/zmq.asd: Error while trying to load definition for system cffi-toolchain from pathname /home/testgrid/cl-test-grid/work-dir/agent/quicklisp/dists/quicklisp/software/cffi_0.17.1/cffi-toolchain.asd: CFFI-toolchain requires ASDF 3.1!
(LOAD zmq-examples FAIL) ASDF/FIND-SYSTEM:LOAD-SYSTEM-DEFINITION-ERROR : Error while trying to load definition for system zmq from pathname /home/testgrid/cl-test-grid/work-dir/agent/quicklisp/dists/quicklisp/software/lisp-zmq-20160208-git/zmq.asd: Error while trying to load definition for system cffi-toolchain from pathname /home/testgrid/cl-test-grid/work-dir/agent/quicklisp/dists/quicklisp/software/cffi_0.17.1/cffi-toolchain.asd: CFFI-toolchain requires ASDF 3.1!
(LOAD zmq FAIL) ASDF/FIND-SYSTEM:LOAD-SYSTEM-DEFINITION-ERROR : Error while trying to load definition for system zmq from pathname /home/testgrid/cl-test-grid/work-dir/agent/quicklisp/dists/quicklisp/software/lisp-zmq-20160208-git/zmq.asd: Error while trying to load definition for system cffi-toolchain from pathname /home/testgrid/cl-test-grid/work-dir/agent/quicklisp/dists/quicklisp/software/cffi_0.17.1/cffi-toolchain.asd: CFFI-toolchain requires ASDF 3.1!
ecl-13.5.1-unknown-linux-i686-lisp-to-c
(LOAD zmq-test FAIL) ASDF/FIND-SYSTEM:LOAD-SYSTEM-DEFINITION-ERROR : Error while trying to load definition for system zmq from pathname /home/testgrid/cl-test-grid/work-dir/agent/quicklisp/dists/quicklisp/software/lisp-zmq-20160208-git/zmq.asd: Error while trying to load definition for system cffi-toolchain from pathname /home/testgrid/cl-test-grid/work-dir/agent/quicklisp/dists/quicklisp/software/cffi_0.17.1/cffi-toolchain.asd: CFFI-toolchain requires ASDF 3.1!
(LOAD zmq-examples FAIL) ASDF/FIND-SYSTEM:LOAD-SYSTEM-DEFINITION-ERROR : Error while trying to load definition for system zmq from pathname /home/testgrid/cl-test-grid/work-dir/agent/quicklisp/dists/quicklisp/software/lisp-zmq-20160208-git/zmq.asd: Error while trying to load definition for system cffi-toolchain from pathname /home/testgrid/cl-test-grid/work-dir/agent/quicklisp/dists/quicklisp/software/cffi_0.17.1/cffi-toolchain.asd: CFFI-toolchain requires ASDF 3.1!
(LOAD zmq FAIL) ASDF/FIND-SYSTEM:LOAD-SYSTEM-DEFINITION-ERROR : Error while trying to load definition for system zmq from pathname /home/testgrid/cl-test-grid/work-dir/agent/quicklisp/dists/quicklisp/software/lisp-zmq-20160208-git/zmq.asd: Error while trying to load definition for system cffi-toolchain from pathname /home/testgrid/cl-test-grid/work-dir/agent/quicklisp/dists/quicklisp/software/cffi_0.17.1/cffi-toolchain.asd: CFFI-toolchain requires ASDF 3.1!
(LOAD zmq-test FAIL) ffi-grovel, CFFI-GROVEL:GROVEL-ERROR : External process exited with code 1. Command was: "cc" "-m32" " -D_GNU_SOURCE -D_FILE_OFFSET_BITS=64 -g -O2 -fPIC -D_GNU_SOURCE -D_FILE_OFFSET_BITS=64 -g -O2 -fPIC -D_THREAD_SAFE -Dlinux" "-I/home/testgrid/cl-test-grid/work-dir/agent/quicklisp/dists/quicklisp/software/cffi_0.16.1/" "-o" "/home/testgrid/cl-test-grid/work-dir/agent/test-runs/20160215035056-ecl-13.5.1-unknown-linux-i686-lisp-to-c/fasl/ql/dists/quicklisp/software/lisp-zmq-20160208-git/src/grovel" "/home/testgrid/cl-test-grid/work-dir/agent/test-runs/20160215035056-ecl-13.5.1-unknown-linux-i686-lisp-to-c/fasl/ql/dists/quicklisp/software/lisp-zmq-20160208-git/src/grovel.c" Output was:
(LOAD zmq-examples FAIL) ffi-grovel, CFFI-GROVEL:GROVEL-ERROR : External process exited with code 1. Command was: "cc" "-m32" " -D_GNU_SOURCE -D_FILE_OFFSET_BITS=64 -g -O2 -fPIC -D_GNU_SOURCE -D_FILE_OFFSET_BITS=64 -g -O2 -fPIC -D_THREAD_SAFE -Dlinux" "-I/home/testgrid/cl-test-grid/work-dir/agent/quicklisp/dists/quicklisp/software/cffi_0.16.1/" "-o" "/home/testgrid/cl-test-grid/work-dir/agent/test-runs/20160215035056-ecl-13.5.1-unknown-linux-i686-lisp-to-c/fasl/ql/dists/quicklisp/software/lisp-zmq-20160208-git/src/grovel" "/home/testgrid/cl-test-grid/work-dir/agent/test-runs/20160215035056-ecl-13.5.1-unknown-linux-i686-lisp-to-c/fasl/ql/dists/quicklisp/software/lisp-zmq-20160208-git/src/grovel.c" Output was:
(LOAD zmq FAIL) ffi-grovel, CFFI-GROVEL:GROVEL-ERROR : External process exited with code 1. Command was: "cc" "-m32" " -D_GNU_SOURCE -D_FILE_OFFSET_BITS=64 -g -O2 -fPIC -D_GNU_SOURCE -D_FILE_OFFSET_BITS=64 -g -O2 -fPIC -D_THREAD_SAFE -Dlinux" "-I/home/testgrid/cl-test-grid/work-dir/agent/quicklisp/dists/quicklisp/software/cffi_0.16.1/" "-o" "/home/testgrid/cl-test-grid/work-dir/agent/test-runs/20160215035056-ecl-13.5.1-unknown-linux-i686-lisp-to-c/fasl/ql/dists/quicklisp/software/lisp-zmq-20160208-git/src/grovel" "/home/testgrid/cl-test-grid/work-dir/agent/test-runs/20160215035056-ecl-13.5.1-unknown-linux-i686-lisp-to-c/fasl/ql/dists/quicklisp/software/lisp-zmq-20160208-git/src/grovel.c" Output was:
ecl-15.2.21-ee989b97-linux-i686-bytecode
(LOAD zmq-test FAIL) ASDF/FIND-SYSTEM:LOAD-SYSTEM-DEFINITION-ERROR : Error while trying to load definition for system zmq from pathname /home/testgrid/cl-test-grid/work-dir/agent/quicklisp/dists/quicklisp/software/lisp-zmq-20160208-git/zmq.asd: The variable C::*CC-FLAGS* is unbound.
(LOAD zmq-examples FAIL) ASDF/FIND-SYSTEM:LOAD-SYSTEM-DEFINITION-ERROR : Error while trying to load definition for system zmq from pathname /home/testgrid/cl-test-grid/work-dir/agent/quicklisp/dists/quicklisp/software/lisp-zmq-20160208-git/zmq.asd: The variable C::*CC-FLAGS* is unbound.
(LOAD zmq FAIL) ASDF/FIND-SYSTEM:LOAD-SYSTEM-DEFINITION-ERROR : Error while trying to load definition for system zmq from pathname /home/testgrid/cl-test-grid/work-dir/agent/quicklisp/dists/quicklisp/software/lisp-zmq-20160208-git/zmq.asd: The variable C::*CC-FLAGS* is unbound.
(LOAD zmq-test FAIL) ASDF/FIND-SYSTEM:LOAD-SYSTEM-DEFINITION-ERROR : Error while trying to load definition for system zmq from pathname /home/testgrid/cl-test-grid/work-dir/agent/quicklisp/dists/quicklisp/software/lisp-zmq-20160208-git/zmq.asd: The variable C::*CC-FLAGS* is unbound.
(LOAD zmq-examples FAIL) ASDF/FIND-SYSTEM:LOAD-SYSTEM-DEFINITION-ERROR : Error while trying to load definition for system zmq from pathname /home/testgrid/cl-test-grid/work-dir/agent/quicklisp/dists/quicklisp/software/lisp-zmq-20160208-git/zmq.asd: The variable C::*CC-FLAGS* is unbound.
(LOAD zmq FAIL) ASDF/FIND-SYSTEM:LOAD-SYSTEM-DEFINITION-ERROR : Error while trying to load definition for system zmq from pathname /home/testgrid/cl-test-grid/work-dir/agent/quicklisp/dists/quicklisp/software/lisp-zmq-20160208-git/zmq.asd: The variable C::*CC-FLAGS* is unbound.
ecl-15.2.21-ee989b97-linux-i686-lisp-to-c
(LOAD zmq-test FAIL) ffi-grovel, CFFI-GROVEL:GROVEL-ERROR : Subprocess with command ("cc" "-m32" "-D_GNU_SOURCE" "-D_FILE_OFFSET_BITS=64" "-g" "-O2" "-fPIC" "-D_THREAD_SAFE" "-Dlinux" "-o" "/home/testgrid/cl-test-grid/work-dir/agent/test-runs/20160326143858-ecl-15.2.21-ee989b97-linux-i686-lisp-to-c/fasl/ql/dists/quicklisp/software/lisp-zmq-20160208-git/src/grovel__grovel-tmpP8LQX6IK" "-I/home/testgrid/cl-test-grid/work-dir/agent/quicklisp/dists/quicklisp/software/cffi_0.17.1/" "/home/testgrid/cl-test-grid/work-dir/agent/test-runs/20160326143858-ecl-15.2.21-ee989b97-linux-i686-lisp-to-c/fasl/ql/dists/quicklisp/software/lisp-zmq-20160208-git/src/grovel__grovel.c") exited with error code 1
(LOAD zmq-examples FAIL) ffi-grovel, CFFI-GROVEL:GROVEL-ERROR : Subprocess with command ("cc" "-m32" "-D_GNU_SOURCE" "-D_FILE_OFFSET_BITS=64" "-g" "-O2" "-fPIC" "-D_THREAD_SAFE" "-Dlinux" "-o" "/home/testgrid/cl-test-grid/work-dir/agent/test-runs/20160326143858-ecl-15.2.21-ee989b97-linux-i686-lisp-to-c/fasl/ql/dists/quicklisp/software/lisp-zmq-20160208-git/src/grovel__grovel-tmpLA25FK3G" "-I/home/testgrid/cl-test-grid/work-dir/agent/quicklisp/dists/quicklisp/software/cffi_0.17.1/" "/home/testgrid/cl-test-grid/work-dir/agent/test-runs/20160326143858-ecl-15.2.21-ee989b97-linux-i686-lisp-to-c/fasl/ql/dists/quicklisp/software/lisp-zmq-20160208-git/src/grovel__grovel.c") exited with error code 1
(LOAD zmq FAIL) ffi-grovel, CFFI-GROVEL:GROVEL-ERROR : Subprocess with command ("cc" "-m32" "-D_GNU_SOURCE" "-D_FILE_OFFSET_BITS=64" "-g" "-O2" "-fPIC" "-D_THREAD_SAFE" "-Dlinux" "-o" "/home/testgrid/cl-test-grid/work-dir/agent/test-runs/20160326143858-ecl-15.2.21-ee989b97-linux-i686-lisp-to-c/fasl/ql/dists/quicklisp/software/lisp-zmq-20160208-git/src/grovel__grovel-tmp5K0OHAB0" "-I/home/testgrid/cl-test-grid/work-dir/agent/quicklisp/dists/quicklisp/software/cffi_0.17.1/" "/home/testgrid/cl-test-grid/work-dir/agent/test-runs/20160326143858-ecl-15.2.21-ee989b97-linux-i686-lisp-to-c/fasl/ql/dists/quicklisp/software/lisp-zmq-20160208-git/src/grovel__grovel.c") exited with error code 1
(LOAD zmq-test FAIL) ffi-grovel, CFFI-GROVEL:GROVEL-ERROR : External process exited with code 1. Command was: "cc" "-m32" " -D_GNU_SOURCE -D_FILE_OFFSET_BITS=64 -g -O2 -fPIC -D_THREAD_SAFE -Dlinux" "-I/home/testgrid/cl-test-grid/work-dir/agent/quicklisp/dists/quicklisp/software/cffi_0.16.1/" "-o" "/home/testgrid/cl-test-grid/work-dir/agent/test-runs/20160217174139-ecl-15.2.21-ee989b97-linux-i686-lisp-to-c/fasl/ql/dists/quicklisp/software/lisp-zmq-20160208-git/src/grovel" "/home/testgrid/cl-test-grid/work-dir/agent/test-runs/20160217174139-ecl-15.2.21-ee989b97-linux-i686-lisp-to-c/fasl/ql/dists/quicklisp/software/lisp-zmq-20160208-git/src/grovel.c" Output was:
(LOAD zmq-examples FAIL) ffi-grovel, CFFI-GROVEL:GROVEL-ERROR : External process exited with code 1. Command was: "cc" "-m32" " -D_GNU_SOURCE -D_FILE_OFFSET_BITS=64 -g -O2 -fPIC -D_THREAD_SAFE -Dlinux" "-I/home/testgrid/cl-test-grid/work-dir/agent/quicklisp/dists/quicklisp/software/cffi_0.16.1/" "-o" "/home/testgrid/cl-test-grid/work-dir/agent/test-runs/20160217174139-ecl-15.2.21-ee989b97-linux-i686-lisp-to-c/fasl/ql/dists/quicklisp/software/lisp-zmq-20160208-git/src/grovel" "/home/testgrid/cl-test-grid/work-dir/agent/test-runs/20160217174139-ecl-15.2.21-ee989b97-linux-i686-lisp-to-c/fasl/ql/dists/quicklisp/software/lisp-zmq-20160208-git/src/grovel.c" Output was:
(LOAD zmq FAIL) ffi-grovel, CFFI-GROVEL:GROVEL-ERROR : External process exited with code 1. Command was: "cc" "-m32" " -D_GNU_SOURCE -D_FILE_OFFSET_BITS=64 -g -O2 -fPIC -D_THREAD_SAFE -Dlinux" "-I/home/testgrid/cl-test-grid/work-dir/agent/quicklisp/dists/quicklisp/software/cffi_0.16.1/" "-o" "/home/testgrid/cl-test-grid/work-dir/agent/test-runs/20160217174139-ecl-15.2.21-ee989b97-linux-i686-lisp-to-c/fasl/ql/dists/quicklisp/software/lisp-zmq-20160208-git/src/grovel" "/home/testgrid/cl-test-grid/work-dir/agent/test-runs/20160217174139-ecl-15.2.21-ee989b97-linux-i686-lisp-to-c/fasl/ql/dists/quicklisp/software/lisp-zmq-20160208-git/src/grovel.c" Output was:
ecl-15.2.21-ee989b97-linux-x64-bytecode
(LOAD zmq-test FAIL) ASDF/FIND-SYSTEM:LOAD-SYSTEM-DEFINITION-ERROR : Error while trying to load definition for system zmq from pathname /home/hijarian/systems/cl-test-grid/work-dir/agent/quicklisp/dists/quicklisp/software/lisp-zmq-20160208-git/zmq.asd: In form ((OS-UNIX-P) "o") FUNCTION: Not a valid argument (OS-UNIX-P).
(LOAD zmq-examples FAIL) ASDF/FIND-SYSTEM:LOAD-SYSTEM-DEFINITION-ERROR : Error while trying to load definition for system zmq from pathname /home/hijarian/systems/cl-test-grid/work-dir/agent/quicklisp/dists/quicklisp/software/lisp-zmq-20160208-git/zmq.asd: In form ((OS-UNIX-P) "o") FUNCTION: Not a valid argument (OS-UNIX-P).
(LOAD zmq FAIL) ASDF/FIND-SYSTEM:LOAD-SYSTEM-DEFINITION-ERROR : Error while trying to load definition for system zmq from pathname /home/hijarian/systems/cl-test-grid/work-dir/agent/quicklisp/dists/quicklisp/software/lisp-zmq-20160208-git/zmq.asd: In form ((OS-UNIX-P) "o") FUNCTION: Not a valid argument (OS-UNIX-P).
(LOAD zmq-test FAIL) ASDF/FIND-SYSTEM:LOAD-SYSTEM-DEFINITION-ERROR : Error while trying to load definition for system zmq from pathname /home/hijarian/systems/cl-test-grid/work-dir/agent/quicklisp/dists/quicklisp/software/lisp-zmq-20160208-git/zmq.asd: The variable C::*CC-FLAGS* is unbound.
(LOAD zmq-examples FAIL) ASDF/FIND-SYSTEM:LOAD-SYSTEM-DEFINITION-ERROR : Error while trying to load definition for system zmq from pathname /home/hijarian/systems/cl-test-grid/work-dir/agent/quicklisp/dists/quicklisp/software/lisp-zmq-20160208-git/zmq.asd: The variable C::*CC-FLAGS* is unbound.
(LOAD zmq FAIL) ASDF/FIND-SYSTEM:LOAD-SYSTEM-DEFINITION-ERROR : Error while trying to load definition for system zmq from pathname /home/hijarian/systems/cl-test-grid/work-dir/agent/quicklisp/dists/quicklisp/software/lisp-zmq-20160208-git/zmq.asd: The variable C::*CC-FLAGS* is unbound.
(LOAD zmq-test FAIL) ASDF/FIND-SYSTEM:LOAD-SYSTEM-DEFINITION-ERROR : Error while trying to load definition for system zmq from pathname /home/hijarian/systems/cl-test-grid/work-dir/agent/quicklisp/dists/quicklisp/software/lisp-zmq-20160208-git/zmq.asd: The variable C::*CC-FLAGS* is unbound.
(LOAD zmq-examples FAIL) ASDF/FIND-SYSTEM:LOAD-SYSTEM-DEFINITION-ERROR : Error while trying to load definition for system zmq from pathname /home/hijarian/systems/cl-test-grid/work-dir/agent/quicklisp/dists/quicklisp/software/lisp-zmq-20160208-git/zmq.asd: The variable C::*CC-FLAGS* is unbound.
(LOAD zmq FAIL) ASDF/FIND-SYSTEM:LOAD-SYSTEM-DEFINITION-ERROR : Error while trying to load definition for system zmq from pathname /home/hijarian/systems/cl-test-grid/work-dir/agent/quicklisp/dists/quicklisp/software/lisp-zmq-20160208-git/zmq.asd: The variable C::*CC-FLAGS* is unbound.
ecl-15.2.21-ee989b97-linux-x64-lisp-to-c
(LOAD zmq-test FAIL) ASDF/FIND-SYSTEM:LOAD-SYSTEM-DEFINITION-ERROR : Error while trying to load definition for system zmq from pathname /home/hijarian/systems/cl-test-grid/work-dir/agent/quicklisp/dists/quicklisp/software/lisp-zmq-20160208-git/zmq.asd: COMPILE-FILE-ERROR while compiling #<cl-source-file "cffi-toolchain" "toolchain" "asdf-compat">
(LOAD zmq-examples FAIL) ASDF/FIND-SYSTEM:LOAD-SYSTEM-DEFINITION-ERROR : Error while trying to load definition for system zmq from pathname /home/hijarian/systems/cl-test-grid/work-dir/agent/quicklisp/dists/quicklisp/software/lisp-zmq-20160208-git/zmq.asd: COMPILE-FILE-ERROR while compiling #<cl-source-file "cffi-toolchain" "toolchain" "asdf-compat">
(LOAD zmq FAIL) ASDF/FIND-SYSTEM:LOAD-SYSTEM-DEFINITION-ERROR : Error while trying to load definition for system zmq from pathname /home/hijarian/systems/cl-test-grid/work-dir/agent/quicklisp/dists/quicklisp/software/lisp-zmq-20160208-git/zmq.asd: COMPILE-FILE-ERROR while compiling #<cl-source-file "cffi-toolchain" "toolchain" "asdf-compat">
(LOAD zmq-test FAIL) ffi-grovel, CFFI-GROVEL:GROVEL-ERROR : External process exited with code 1. Command was: "cc" "-m64" " -D_GNU_SOURCE -D_FILE_OFFSET_BITS=64 -g -O2 -fPIC -D_THREAD_SAFE -Dlinux" "-I/home/hijarian/systems/cl-test-grid/work-dir/agent/quicklisp/dists/quicklisp/software/cffi_0.16.1/" "-o" "/home/hijarian/systems/cl-test-grid/work-dir/agent/test-runs/20160309125026-ecl-15.2.21-ee989b97-linux-x64-lisp-to-c/fasl/ql/dists/quicklisp/software/lisp-zmq-20160208-git/src/grovel" "/home/hijarian/systems/cl-test-grid/work-dir/agent/test-runs/20160309125026-ecl-15.2.21-ee989b97-linux-x64-lisp-to-c/fasl/ql/dists/quicklisp/software/lisp-zmq-20160208-git/src/grovel.c" Output was:
(LOAD zmq-examples FAIL) ffi-grovel, CFFI-GROVEL:GROVEL-ERROR : External process exited with code 1. Command was: "cc" "-m64" " -D_GNU_SOURCE -D_FILE_OFFSET_BITS=64 -g -O2 -fPIC -D_THREAD_SAFE -Dlinux" "-I/home/hijarian/systems/cl-test-grid/work-dir/agent/quicklisp/dists/quicklisp/software/cffi_0.16.1/" "-o" "/home/hijarian/systems/cl-test-grid/work-dir/agent/test-runs/20160309125026-ecl-15.2.21-ee989b97-linux-x64-lisp-to-c/fasl/ql/dists/quicklisp/software/lisp-zmq-20160208-git/src/grovel" "/home/hijarian/systems/cl-test-grid/work-dir/agent/test-runs/20160309125026-ecl-15.2.21-ee989b97-linux-x64-lisp-to-c/fasl/ql/dists/quicklisp/software/lisp-zmq-20160208-git/src/grovel.c" Output was:
(LOAD zmq FAIL) ffi-grovel, CFFI-GROVEL:GROVEL-ERROR : External process exited with code 1. Command was: "cc" "-m64" " -D_GNU_SOURCE -D_FILE_OFFSET_BITS=64 -g -O2 -fPIC -D_THREAD_SAFE -Dlinux" "-I/home/hijarian/systems/cl-test-grid/work-dir/agent/quicklisp/dists/quicklisp/software/cffi_0.16.1/" "-o" "/home/hijarian/systems/cl-test-grid/work-dir/agent/test-runs/20160309125026-ecl-15.2.21-ee989b97-linux-x64-lisp-to-c/fasl/ql/dists/quicklisp/software/lisp-zmq-20160208-git/src/grovel" "/home/hijarian/systems/cl-test-grid/work-dir/agent/test-runs/20160309125026-ecl-15.2.21-ee989b97-linux-x64-lisp-to-c/fasl/ql/dists/quicklisp/software/lisp-zmq-20160208-git/src/grovel.c" Output was:
(LOAD zmq-test FAIL) ffi-grovel, CFFI-GROVEL:GROVEL-ERROR : External process exited with code 1. Command was: "cc" "-m64" " -D_GNU_SOURCE -D_FILE_OFFSET_BITS=64 -g -O2 -fPIC -D_THREAD_SAFE -Dlinux" "-I/home/hijarian/systems/cl-test-grid/work-dir/agent/quicklisp/dists/quicklisp/software/cffi_0.16.1/" "-o" "/home/hijarian/systems/cl-test-grid/work-dir/agent/test-runs/20160215113646-ecl-15.2.21-ee989b97-linux-x64-lisp-to-c/fasl/ql/dists/quicklisp/software/lisp-zmq-20160208-git/src/grovel" "/home/hijarian/systems/cl-test-grid/work-dir/agent/test-runs/20160215113646-ecl-15.2.21-ee989b97-linux-x64-lisp-to-c/fasl/ql/dists/quicklisp/software/lisp-zmq-20160208-git/src/grovel.c" Output was:
(LOAD zmq-examples FAIL) ffi-grovel, CFFI-GROVEL:GROVEL-ERROR : External process exited with code 1. Command was: "cc" "-m64" " -D_GNU_SOURCE -D_FILE_OFFSET_BITS=64 -g -O2 -fPIC -D_THREAD_SAFE -Dlinux" "-I/home/hijarian/systems/cl-test-grid/work-dir/agent/quicklisp/dists/quicklisp/software/cffi_0.16.1/" "-o" "/home/hijarian/systems/cl-test-grid/work-dir/agent/test-runs/20160215113646-ecl-15.2.21-ee989b97-linux-x64-lisp-to-c/fasl/ql/dists/quicklisp/software/lisp-zmq-20160208-git/src/grovel" "/home/hijarian/systems/cl-test-grid/work-dir/agent/test-runs/20160215113646-ecl-15.2.21-ee989b97-linux-x64-lisp-to-c/fasl/ql/dists/quicklisp/software/lisp-zmq-20160208-git/src/grovel.c" Output was:
(LOAD zmq FAIL) ffi-grovel, CFFI-GROVEL:GROVEL-ERROR : External process exited with code 1. Command was: "cc" "-m64" " -D_GNU_SOURCE -D_FILE_OFFSET_BITS=64 -g -O2 -fPIC -D_THREAD_SAFE -Dlinux" "-I/home/hijarian/systems/cl-test-grid/work-dir/agent/quicklisp/dists/quicklisp/software/cffi_0.16.1/" "-o" "/home/hijarian/systems/cl-test-grid/work-dir/agent/test-runs/20160215113646-ecl-15.2.21-ee989b97-linux-x64-lisp-to-c/fasl/ql/dists/quicklisp/software/lisp-zmq-20160208-git/src/grovel" "/home/hijarian/systems/cl-test-grid/work-dir/agent/test-runs/20160215113646-ecl-15.2.21-ee989b97-linux-x64-lisp-to-c/fasl/ql/dists/quicklisp/software/lisp-zmq-20160208-git/src/grovel.c" Output was:
ecl-16.0.0-98fc12d3-linux-i686-bytecode
(LOAD zmq-test FAIL) ASDF/FIND-SYSTEM:LOAD-SYSTEM-DEFINITION-ERROR : Error while trying to load definition for system zmq from pathname /home/testgrid/cl-test-grid/work-dir/agent/quicklisp/dists/quicklisp/software/lisp-zmq-20160208-git/zmq.asd: The variable C::*CC-FLAGS* is unbound.
(LOAD zmq-examples FAIL) ASDF/FIND-SYSTEM:LOAD-SYSTEM-DEFINITION-ERROR : Error while trying to load definition for system zmq from pathname /home/testgrid/cl-test-grid/work-dir/agent/quicklisp/dists/quicklisp/software/lisp-zmq-20160208-git/zmq.asd: The variable C::*CC-FLAGS* is unbound.
(LOAD zmq FAIL) ASDF/FIND-SYSTEM:LOAD-SYSTEM-DEFINITION-ERROR : Error while trying to load definition for system zmq from pathname /home/testgrid/cl-test-grid/work-dir/agent/quicklisp/dists/quicklisp/software/lisp-zmq-20160208-git/zmq.asd: The variable C::*CC-FLAGS* is unbound.
(LOAD zmq-test FAIL) ASDF/FIND-SYSTEM:LOAD-SYSTEM-DEFINITION-ERROR : Error while trying to load definition for system zmq from pathname /home/testgrid/cl-test-grid/work-dir/agent/quicklisp/dists/quicklisp/software/lisp-zmq-20160208-git/zmq.asd: The variable C::*CC-FLAGS* is unbound.
(LOAD zmq-examples FAIL) ASDF/FIND-SYSTEM:LOAD-SYSTEM-DEFINITION-ERROR : Error while trying to load definition for system zmq from pathname /home/testgrid/cl-test-grid/work-dir/agent/quicklisp/dists/quicklisp/software/lisp-zmq-20160208-git/zmq.asd: The variable C::*CC-FLAGS* is unbound.
(LOAD zmq FAIL) ASDF/FIND-SYSTEM:LOAD-SYSTEM-DEFINITION-ERROR : Error while trying to load definition for system zmq from pathname /home/testgrid/cl-test-grid/work-dir/agent/quicklisp/dists/quicklisp/software/lisp-zmq-20160208-git/zmq.asd: The variable C::*CC-FLAGS* is unbound.
ecl-16.0.0-98fc12d3-linux-i686-lisp-to-c
(LOAD zmq-test FAIL) ffi-grovel, CFFI-GROVEL:GROVEL-ERROR : Subprocess with command ("cc" "-m32" "-D_GNU_SOURCE" "-D_FILE_OFFSET_BITS=64" "-g" "-O2" "-fPIC" "-D_THREAD_SAFE" "-Dlinux" "-o" "/home/testgrid/cl-test-grid/work-dir/agent/test-runs/20160324000443-ecl-16.0.0-98fc12d3-linux-i686-lisp-to-c/fasl/ql/dists/quicklisp/software/lisp-zmq-20160208-git/src/grovel__grovel-tmpNXVE2IGP" "-I/home/testgrid/cl-test-grid/work-dir/agent/quicklisp/dists/quicklisp/software/cffi_0.17.1/" "/home/testgrid/cl-test-grid/work-dir/agent/test-runs/20160324000443-ecl-16.0.0-98fc12d3-linux-i686-lisp-to-c/fasl/ql/dists/quicklisp/software/lisp-zmq-20160208-git/src/grovel__grovel.c") exited with error code 1
(LOAD zmq-examples FAIL) ffi-grovel, CFFI-GROVEL:GROVEL-ERROR : Subprocess with command ("cc" "-m32" "-D_GNU_SOURCE" "-D_FILE_OFFSET_BITS=64" "-g" "-O2" "-fPIC" "-D_THREAD_SAFE" "-Dlinux" "-o" "/home/testgrid/cl-test-grid/work-dir/agent/test-runs/20160324000443-ecl-16.0.0-98fc12d3-linux-i686-lisp-to-c/fasl/ql/dists/quicklisp/software/lisp-zmq-20160208-git/src/grovel__grovel-tmp1S0W4KAZ" "-I/home/testgrid/cl-test-grid/work-dir/agent/quicklisp/dists/quicklisp/software/cffi_0.17.1/" "/home/testgrid/cl-test-grid/work-dir/agent/test-runs/20160324000443-ecl-16.0.0-98fc12d3-linux-i686-lisp-to-c/fasl/ql/dists/quicklisp/software/lisp-zmq-20160208-git/src/grovel__grovel.c") exited with error code 1
(LOAD zmq FAIL) ffi-grovel, CFFI-GROVEL:GROVEL-ERROR : Subprocess with command ("cc" "-m32" "-D_GNU_SOURCE" "-D_FILE_OFFSET_BITS=64" "-g" "-O2" "-fPIC" "-D_THREAD_SAFE" "-Dlinux" "-o" "/home/testgrid/cl-test-grid/work-dir/agent/test-runs/20160324000443-ecl-16.0.0-98fc12d3-linux-i686-lisp-to-c/fasl/ql/dists/quicklisp/software/lisp-zmq-20160208-git/src/grovel__grovel-tmp7HT4RKD8" "-I/home/testgrid/cl-test-grid/work-dir/agent/quicklisp/dists/quicklisp/software/cffi_0.17.1/" "/home/testgrid/cl-test-grid/work-dir/agent/test-runs/20160324000443-ecl-16.0.0-98fc12d3-linux-i686-lisp-to-c/fasl/ql/dists/quicklisp/software/lisp-zmq-20160208-git/src/grovel__grovel.c") exited with error code 1
ecl-16.0.0-b2661fd1-linux-x64-bytecode
(LOAD zmq-test FAIL) ASDF/FIND-SYSTEM:LOAD-SYSTEM-DEFINITION-ERROR : Error while trying to load definition for system zmq from pathname /home/jack/quicklisp/local-projects/cl-test-grid/work-dir/agent/quicklisp/dists/quicklisp/software/lisp-zmq-20160208-git/zmq.asd: The variable C::*CC-FLAGS* is unbound.
(LOAD zmq-examples FAIL) ASDF/FIND-SYSTEM:LOAD-SYSTEM-DEFINITION-ERROR : Error while trying to load definition for system zmq from pathname /home/jack/quicklisp/local-projects/cl-test-grid/work-dir/agent/quicklisp/dists/quicklisp/software/lisp-zmq-20160208-git/zmq.asd: The variable C::*CC-FLAGS* is unbound.
(LOAD zmq FAIL) ASDF/FIND-SYSTEM:LOAD-SYSTEM-DEFINITION-ERROR : Error while trying to load definition for system zmq from pathname /home/jack/quicklisp/local-projects/cl-test-grid/work-dir/agent/quicklisp/dists/quicklisp/software/lisp-zmq-20160208-git/zmq.asd: The variable C::*CC-FLAGS* is unbound.
ecl-16.0.0-b2661fd1-linux-x64-lisp-to-c
(LOAD zmq-test FAIL) ffi-grovel, CFFI-GROVEL:GROVEL-ERROR : External process exited with code 1. Command was: "cc" "-m64" " -D_GNU_SOURCE -D_FILE_OFFSET_BITS=64 -g -O2 -fPIC -D_THREAD_SAFE -Dlinux" "-I/home/jack/quicklisp/local-projects/cl-test-grid/work-dir/agent/quicklisp/dists/quicklisp/software/cffi_0.16.1/" "-o" "/home/jack/quicklisp/local-projects/cl-test-grid/work-dir/agent/test-runs/20160212095113-ecl-16.0.0-b2661fd1-linux-x64-lisp-to-c/fasl/ql/dists/quicklisp/software/lisp-zmq-20160208-git/src/grovel" "/home/jack/quicklisp/local-projects/cl-test-grid/work-dir/agent/test-runs/20160212095113-ecl-16.0.0-b2661fd1-linux-x64-lisp-to-c/fasl/ql/dists/quicklisp/software/lisp-zmq-20160208-git/src/grovel.c" Output was:
(LOAD zmq-examples FAIL) ffi-grovel, CFFI-GROVEL:GROVEL-ERROR : External process exited with code 1. Command was: "cc" "-m64" " -D_GNU_SOURCE -D_FILE_OFFSET_BITS=64 -g -O2 -fPIC -D_THREAD_SAFE -Dlinux" "-I/home/jack/quicklisp/local-projects/cl-test-grid/work-dir/agent/quicklisp/dists/quicklisp/software/cffi_0.16.1/" "-o" "/home/jack/quicklisp/local-projects/cl-test-grid/work-dir/agent/test-runs/20160212095113-ecl-16.0.0-b2661fd1-linux-x64-lisp-to-c/fasl/ql/dists/quicklisp/software/lisp-zmq-20160208-git/src/grovel" "/home/jack/quicklisp/local-projects/cl-test-grid/work-dir/agent/test-runs/20160212095113-ecl-16.0.0-b2661fd1-linux-x64-lisp-to-c/fasl/ql/dists/quicklisp/software/lisp-zmq-20160208-git/src/grovel.c" Output was:
(LOAD zmq FAIL) ffi-grovel, CFFI-GROVEL:GROVEL-ERROR : External process exited with code 1. Command was: "cc" "-m64" " -D_GNU_SOURCE -D_FILE_OFFSET_BITS=64 -g -O2 -fPIC -D_THREAD_SAFE -Dlinux" "-I/home/jack/quicklisp/local-projects/cl-test-grid/work-dir/agent/quicklisp/dists/quicklisp/software/cffi_0.16.1/" "-o" "/home/jack/quicklisp/local-projects/cl-test-grid/work-dir/agent/test-runs/20160212095113-ecl-16.0.0-b2661fd1-linux-x64-lisp-to-c/fasl/ql/dists/quicklisp/software/lisp-zmq-20160208-git/src/grovel" "/home/jack/quicklisp/local-projects/cl-test-grid/work-dir/agent/test-runs/20160212095113-ecl-16.0.0-b2661fd1-linux-x64-lisp-to-c/fasl/ql/dists/quicklisp/software/lisp-zmq-20160208-git/src/grovel.c" Output was:
ecl-16.0.0-b2661fd1-macosx-x64-bytecode
(LOAD zmq-test FAIL) ASDF/FIND-SYSTEM:LOAD-SYSTEM-DEFINITION-ERROR : Error while trying to load definition for system zmq from pathname /Users/testgrid/cl-test-grid/work-dir/agent/quicklisp/dists/quicklisp/software/lisp-zmq-20160208-git/zmq.asd: The variable C::*CC-FLAGS* is unbound.
(LOAD zmq-examples FAIL) ASDF/FIND-SYSTEM:LOAD-SYSTEM-DEFINITION-ERROR : Error while trying to load definition for system zmq from pathname /Users/testgrid/cl-test-grid/work-dir/agent/quicklisp/dists/quicklisp/software/lisp-zmq-20160208-git/zmq.asd: The variable C::*CC-FLAGS* is unbound.
(LOAD zmq FAIL) ASDF/FIND-SYSTEM:LOAD-SYSTEM-DEFINITION-ERROR : Error while trying to load definition for system zmq from pathname /Users/testgrid/cl-test-grid/work-dir/agent/quicklisp/dists/quicklisp/software/lisp-zmq-20160208-git/zmq.asd: The variable C::*CC-FLAGS* is unbound.
ecl-16.0.0-b2661fd1-macosx-x64-lisp-to-c
(LOAD zmq-test FAIL) ffi-grovel, CFFI-GROVEL:GROVEL-ERROR : External process exited with code 1. Command was: "cc" "-m64" "-I" "/opt/local/include/" " -g -O2 -fPIC -fno-common -D_THREAD_SAFE -Ddarwin" "-I/Users/testgrid/cl-test-grid/work-dir/agent/quicklisp/dists/quicklisp/software/cffi_0.16.1/" "-o" "/Users/testgrid/cl-test-grid/work-dir/agent/test-runs/20160220134238-ecl-16.0.0-b2661fd1-macosx-x64-lisp-to-c/fasl/ql/dists/quicklisp/software/lisp-zmq-20160208-git/src/grovel" "/Users/testgrid/cl-test-grid/work-dir/agent/test-runs/20160220134238-ecl-16.0.0-b2661fd1-macosx-x64-lisp-to-c/fasl/ql/dists/quicklisp/software/lisp-zmq-20160208-git/src/grovel.c" Output was:
(LOAD zmq-examples FAIL) ffi-grovel, CFFI-GROVEL:GROVEL-ERROR : External process exited with code 1. Command was: "cc" "-m64" "-I" "/opt/local/include/" " -g -O2 -fPIC -fno-common -D_THREAD_SAFE -Ddarwin" "-I/Users/testgrid/cl-test-grid/work-dir/agent/quicklisp/dists/quicklisp/software/cffi_0.16.1/" "-o" "/Users/testgrid/cl-test-grid/work-dir/agent/test-runs/20160220134238-ecl-16.0.0-b2661fd1-macosx-x64-lisp-to-c/fasl/ql/dists/quicklisp/software/lisp-zmq-20160208-git/src/grovel" "/Users/testgrid/cl-test-grid/work-dir/agent/test-runs/20160220134238-ecl-16.0.0-b2661fd1-macosx-x64-lisp-to-c/fasl/ql/dists/quicklisp/software/lisp-zmq-20160208-git/src/grovel.c" Output was:
(LOAD zmq FAIL) ffi-grovel, CFFI-GROVEL:GROVEL-ERROR : External process exited with code 1. Command was: "cc" "-m64" "-I" "/opt/local/include/" " -g -O2 -fPIC -fno-common -D_THREAD_SAFE -Ddarwin" "-I/Users/testgrid/cl-test-grid/work-dir/agent/quicklisp/dists/quicklisp/software/cffi_0.16.1/" "-o" "/Users/testgrid/cl-test-grid/work-dir/agent/test-runs/20160220134238-ecl-16.0.0-b2661fd1-macosx-x64-lisp-to-c/fasl/ql/dists/quicklisp/software/lisp-zmq-20160208-git/src/grovel" "/Users/testgrid/cl-test-grid/work-dir/agent/test-runs/20160220134238-ecl-16.0.0-b2661fd1-macosx-x64-lisp-to-c/fasl/ql/dists/quicklisp/software/lisp-zmq-20160208-git/src/grovel.c" Output was:
ecl-16.1.2-rc2-093ba0ab-linux-x64-bytecode
(LOAD zmq-test FAIL) ASDF/FIND-SYSTEM:LOAD-SYSTEM-DEFINITION-ERROR : Error while trying to load definition for system zmq from pathname /home/jack/quicklisp/local-projects/cl-test-grid/work-dir/agent/quicklisp/dists/quicklisp/software/lisp-zmq-20160208-git/zmq.asd: The variable C::*CC-FLAGS* is unbound.
(LOAD zmq-examples FAIL) ASDF/FIND-SYSTEM:LOAD-SYSTEM-DEFINITION-ERROR : Error while trying to load definition for system zmq from pathname /home/jack/quicklisp/local-projects/cl-test-grid/work-dir/agent/quicklisp/dists/quicklisp/software/lisp-zmq-20160208-git/zmq.asd: The variable C::*CC-FLAGS* is unbound.
(LOAD zmq FAIL) ASDF/FIND-SYSTEM:LOAD-SYSTEM-DEFINITION-ERROR : Error while trying to load definition for system zmq from pathname /home/jack/quicklisp/local-projects/cl-test-grid/work-dir/agent/quicklisp/dists/quicklisp/software/lisp-zmq-20160208-git/zmq.asd: The variable C::*CC-FLAGS* is unbound.
ecl-16.1.2-rc2-093ba0ab-linux-x64-lisp-to-c
(LOAD zmq-test FAIL) ffi-grovel, CFFI-GROVEL:GROVEL-ERROR : External process exited with code 1. Command was: "cc" "-m64" " -D_GNU_SOURCE -D_FILE_OFFSET_BITS=64 -g -O2 -fPIC -D_THREAD_SAFE -Dlinux" "-I/home/jack/quicklisp/local-projects/cl-test-grid/work-dir/agent/quicklisp/dists/quicklisp/software/cffi_0.16.1/" "-o" "/home/jack/quicklisp/local-pr... "/home/jack/quicklisp/local-pr... Output was:
(LOAD zmq-examples FAIL) ffi-grovel, CFFI-GROVEL:GROVEL-ERROR : External process exited with code 1. Command was: "cc" "-m64" " -D_GNU_SOURCE -D_FILE_OFFSET_BITS=64 -g -O2 -fPIC -D_THREAD_SAFE -Dlinux" "-I/home/jack/quicklisp/local-projects/cl-test-grid/work-dir/agent/quicklisp/dists/quicklisp/software/cffi_0.16.1/" "-o" "/home/jack/quicklisp/local-pr... "/home/jack/quicklisp/local-pr... Output was:
(LOAD zmq FAIL) ffi-grovel, CFFI-GROVEL:GROVEL-ERROR : External process exited with code 1. Command was: "cc" "-m64" " -D_GNU_SOURCE -D_FILE_OFFSET_BITS=64 -g -O2 -fPIC -D_THREAD_SAFE -Dlinux" "-I/home/jack/quicklisp/local-projects/cl-test-grid/work-dir/agent/quicklisp/dists/quicklisp/software/cffi_0.16.1/" "-o" "/home/jack/quicklisp/local-pr... "/home/jack/quicklisp/local-pr... Output was:
ecl-16.1.2-rc3-9e5a61f4-linux-x64-bytecode
(LOAD zmq-test FAIL) ASDF/FIND-SYSTEM:LOAD-SYSTEM-DEFINITION-ERROR : Error while trying to load definition for system zmq from pathname /home/jack/Projekty/lisp-systems/cl-test-grid/work-dir/agent/quicklisp/dists/quicklisp/software/lisp-zmq-20160208-git/zmq.asd: The variable C::*CC-FLAGS* is unbound.
(LOAD zmq-examples FAIL) ASDF/FIND-SYSTEM:LOAD-SYSTEM-DEFINITION-ERROR : Error while trying to load definition for system zmq from pathname /home/jack/Projekty/lisp-systems/cl-test-grid/work-dir/agent/quicklisp/dists/quicklisp/software/lisp-zmq-20160208-git/zmq.asd: The variable C::*CC-FLAGS* is unbound.
(LOAD zmq FAIL) ASDF/FIND-SYSTEM:LOAD-SYSTEM-DEFINITION-ERROR : Error while trying to load definition for system zmq from pathname /home/jack/Projekty/lisp-systems/cl-test-grid/work-dir/agent/quicklisp/dists/quicklisp/software/lisp-zmq-20160208-git/zmq.asd: The variable C::*CC-FLAGS* is unbound.
ecl-16.1.2-rc3-9e5a61f4-linux-x64-lisp-to-c
(LOAD zmq-test FAIL) ffi-grovel, CFFI-GROVEL:GROVEL-ERROR : External process exited with code 1. Command was: "cc" "-m64" " -D_GNU_SOURCE -D_FILE_OFFSET_BITS=64 -g -O2 -fPIC -D_THREAD_SAFE -Dlinux" "-I/home/jack/quicklisp/local-projects/cl-test-grid/work-dir/agent/quicklisp/dists/quicklisp/software/cffi_0.16.1/" "-o" "/home/jack/quicklisp/local-pr... "/home/jack/quicklisp/local-pr... Output was:
(LOAD zmq-examples FAIL) ffi-grovel, CFFI-GROVEL:GROVEL-ERROR : External process exited with code 1. Command was: "cc" "-m64" " -D_GNU_SOURCE -D_FILE_OFFSET_BITS=64 -g -O2 -fPIC -D_THREAD_SAFE -Dlinux" "-I/home/jack/quicklisp/local-projects/cl-test-grid/work-dir/agent/quicklisp/dists/quicklisp/software/cffi_0.16.1/" "-o" "/home/jack/quicklisp/local-pr... "/home/jack/quicklisp/local-pr... Output was:
(LOAD zmq FAIL) ffi-grovel, CFFI-GROVEL:GROVEL-ERROR : External process exited with code 1. Command was: "cc" "-m64" " -D_GNU_SOURCE -D_FILE_OFFSET_BITS=64 -g -O2 -fPIC -D_THREAD_SAFE -Dlinux" "-I/home/jack/quicklisp/local-projects/cl-test-grid/work-dir/agent/quicklisp/dists/quicklisp/software/cffi_0.16.1/" "-o" "/home/jack/quicklisp/local-pr... "/home/jack/quicklisp/local-pr... Output was:
(LOAD zmq-test FAIL) ffi-grovel, CFFI-GROVEL:GROVEL-ERROR : External process exited with code 1. Command was: "cc" "-m64" " -D_GNU_SOURCE -D_FILE_OFFSET_BITS=64 -g -O2 -fPIC -D_THREAD_SAFE -Dlinux" "-I/home/jack/Projekty/lisp-systems/cl-test-grid/work-dir/agent/quicklisp/dists/quicklisp/software/cffi_0.16.1/" "-o" "/home/jack/Projekty/lisp-systems/cl-test-grid/work-dir/agent/test-runs/20160214222758-ecl-16.1.2-rc3-9e5a61f4-linux-x64-lisp-to-c/fasl/ql/dists/quicklisp/software/lisp-zmq-20160208-git/src/grovel" "/home/jack/Projekty/lisp-systems/cl-test-grid/work-dir/agent/test-runs/20160214222758-ecl-16.1.2-rc3-9e5a61f4-linux-x64-lisp-to-c/fasl/ql/dists/quicklisp/software/lisp-zmq-20160208-git/src/grovel.c" Output was:
(LOAD zmq-examples FAIL) ffi-grovel, CFFI-GROVEL:GROVEL-ERROR : External process exited with code 1. Command was: "cc" "-m64" " -D_GNU_SOURCE -D_FILE_OFFSET_BITS=64 -g -O2 -fPIC -D_THREAD_SAFE -Dlinux" "-I/home/jack/Projekty/lisp-systems/cl-test-grid/work-dir/agent/quicklisp/dists/quicklisp/software/cffi_0.16.1/" "-o" "/home/jack/Projekty/lisp-systems/cl-test-grid/work-dir/agent/test-runs/20160214222758-ecl-16.1.2-rc3-9e5a61f4-linux-x64-lisp-to-c/fasl/ql/dists/quicklisp/software/lisp-zmq-20160208-git/src/grovel" "/home/jack/Projekty/lisp-systems/cl-test-grid/work-dir/agent/test-runs/20160214222758-ecl-16.1.2-rc3-9e5a61f4-linux-x64-lisp-to-c/fasl/ql/dists/quicklisp/software/lisp-zmq-20160208-git/src/grovel.c" Output was:
(LOAD zmq FAIL) ffi-grovel, CFFI-GROVEL:GROVEL-ERROR : External process exited with code 1. Command was: "cc" "-m64" " -D_GNU_SOURCE -D_FILE_OFFSET_BITS=64 -g -O2 -fPIC -D_THREAD_SAFE -Dlinux" "-I/home/jack/Projekty/lisp-systems/cl-test-grid/work-dir/agent/quicklisp/dists/quicklisp/software/cffi_0.16.1/" "-o" "/home/jack/Projekty/lisp-systems/cl-test-grid/work-dir/agent/test-runs/20160214222758-ecl-16.1.2-rc3-9e5a61f4-linux-x64-lisp-to-c/fasl/ql/dists/quicklisp/software/lisp-zmq-20160208-git/src/grovel" "/home/jack/Projekty/lisp-systems/cl-test-grid/work-dir/agent/test-runs/20160214222758-ecl-16.1.2-rc3-9e5a61f4-linux-x64-lisp-to-c/fasl/ql/dists/quicklisp/software/lisp-zmq-20160208-git/src/grovel.c" Output was:
sbcl-1.0.58-linux-x86
(LOAD zmq-test FAIL) ASDF:LOAD-SYSTEM-DEFINITION-ERROR : Error while trying to load definition for system bordeaux-threads from pathname /home/testgrid/cl-test-grid/work-dir/agent/quicklisp/dists/quicklisp/software/bordeaux-threads-v0.8.5/bordeaux-threads.asd: READ error during COMPILE-FILE: You need ASDF >= 3.1 to load this system correctly. (in form starting at line: 1, column: 0, file-position: 0)
(LOAD zmq-examples FAIL) ASDF:LOAD-SYSTEM-DEFINITION-ERROR : Error while trying to load definition for system bordeaux-threads from pathname /home/testgrid/cl-test-grid/work-dir/agent/quicklisp/dists/quicklisp/software/bordeaux-threads-v0.8.5/bordeaux-threads.asd: READ error during COMPILE-FILE: You need ASDF >= 3.1 to load this system correctly. (in form starting at line: 1, column: 0, file-position: 0)
(LOAD zmq FAIL) ASDF:LOAD-SYSTEM-DEFINITION-ERROR : Error while trying to load definition for system zmq from pathname /home/testgrid/cl-test-grid/work-dir/agent/quicklisp/dists/quicklisp/software/lisp-zmq-20160208-git/zmq.asd: Error while trying to load definition for system cffi-toolchain from pathname /home/testgrid/cl-test-grid/work-dir/agent/quicklisp/dists/quicklisp/software/cffi_0.17.1/cffi-toolchain.asd: CFFI-toolchain requires ASDF 3.1!
(LOAD zmq-test FAIL) ASDF:LOAD-SYSTEM-DEFINITION-ERROR : Error while trying to load definition for system bordeaux-threads from pathname /home/testgrid/cl-test-grid/work-dir/agent/quicklisp/dists/quicklisp/software/bordeaux-threads-v0.8.4-git/bordeaux-threads.asd: READ error during COMPILE-FILE: Package UIOP does not exist. Line: 68, Column: 19, File-Position: 2835 Stream: #<SB-SYS:FD-STREAM for "file /home/testgrid/cl-test-grid/work-dir/agent/quicklisp/dists/quicklisp/software/bordeaux-threads-v0.8.4-git/bordeaux-threads.asd" {B13A581}>
(LOAD zmq-examples FAIL) ASDF:LOAD-SYSTEM-DEFINITION-ERROR : Error while trying to load definition for system bordeaux-threads from pathname /home/testgrid/cl-test-grid/work-dir/agent/quicklisp/dists/quicklisp/software/bordeaux-threads-v0.8.4-git/bordeaux-threads.asd: READ error during COMPILE-FILE: Package UIOP does not exist. Line: 68, Column: 19, File-Position: 2835 Stream: #<SB-SYS:FD-STREAM for "file /home/testgrid/cl-test-grid/work-dir/agent/quicklisp/dists/quicklisp/software/bordeaux-threads-v0.8.4-git/bordeaux-threads.asd" {B138841}>
(LOAD zmq FAIL) ASDF:LOAD-SYSTEM-DEFINITION-ERROR : Error while trying to load definition for system zmq from pathname /home/testgrid/cl-test-grid/work-dir/agent/quicklisp/dists/quicklisp/software/lisp-zmq-20160208-git/zmq.asd: Error while invoking #<COMPILE-OP NIL {B43EEB1}> on #<CL-SOURCE-FILE "uiop" "image">
sbcl-1.1.11-linux-x86
(LOAD zmq-test FAIL) ASDF/FIND-SYSTEM:LOAD-SYSTEM-DEFINITION-ERROR : Error while trying to load definition for system zmq from pathname /home/testgrid/cl-test-grid/work-dir/agent/quicklisp/dists/quicklisp/software/lisp-zmq-20160208-git/zmq.asd: Error while trying to load definition for system cffi-toolchain from pathname /home/testgrid/cl-test-grid/work-dir/agent/quicklisp/dists/quicklisp/software/cffi_0.17.1/cffi-toolchain.asd: CFFI-toolchain requires ASDF 3.1!
(LOAD zmq-examples FAIL) ASDF/FIND-SYSTEM:LOAD-SYSTEM-DEFINITION-ERROR : Error while trying to load definition for system zmq from pathname /home/testgrid/cl-test-grid/work-dir/agent/quicklisp/dists/quicklisp/software/lisp-zmq-20160208-git/zmq.asd: Error while trying to load definition for system cffi-toolchain from pathname /home/testgrid/cl-test-grid/work-dir/agent/quicklisp/dists/quicklisp/software/cffi_0.17.1/cffi-toolchain.asd: CFFI-toolchain requires ASDF 3.1!
(LOAD zmq FAIL) ASDF/FIND-SYSTEM:LOAD-SYSTEM-DEFINITION-ERROR : Error while trying to load definition for system zmq from pathname /home/testgrid/cl-test-grid/work-dir/agent/quicklisp/dists/quicklisp/software/lisp-zmq-20160208-git/zmq.asd: Error while trying to load definition for system cffi-toolchain from pathname /home/testgrid/cl-test-grid/work-dir/agent/quicklisp/dists/quicklisp/software/cffi_0.17.1/cffi-toolchain.asd: CFFI-toolchain requires ASDF 3.1!
(LOAD zmq-test FAIL) ffi-grovel, CFFI-GROVEL:GROVEL-ERROR : External process exited with code 1. Command was: "cc" "-m32" "-I/home/testgrid/cl-test-grid/work-dir/agent/quicklisp/dists/quicklisp/software/cffi_0.16.1/" "-o" "/home/testgrid/cl-test-grid/work-dir/agent/test-runs/20160216212151-sbcl-1.1.11-linux-x86/fasl/ql/dists/quicklisp/software/lisp-zmq-20160208-git/src/grovel" "/home/testgrid/cl-test-grid/work-dir/agent/test-runs/20160216212151-sbcl-1.1.11-linux-x86/fasl/ql/dists/quicklisp/software/lisp-zmq-20160208-git/src/grovel.c" Output was: /home/testgrid/cl-test-grid/work-dir/agent/test-runs/20160216212151-sbcl-1.1.11-linux-x86/fasl/ql/dists/quicklisp/software/lisp-zmq-20160208-git/src/grovel.c:6:17: fatal error: zmq.h: No such file or directory compilation terminated.
(LOAD zmq-examples FAIL) ffi-grovel, CFFI-GROVEL:GROVEL-ERROR : External process exited with code 1. Command was: "cc" "-m32" "-I/home/testgrid/cl-test-grid/work-dir/agent/quicklisp/dists/quicklisp/software/cffi_0.16.1/" "-o" "/home/testgrid/cl-test-grid/work-dir/agent/test-runs/20160216212151-sbcl-1.1.11-linux-x86/fasl/ql/dists/quicklisp/software/lisp-zmq-20160208-git/src/grovel" "/home/testgrid/cl-test-grid/work-dir/agent/test-runs/20160216212151-sbcl-1.1.11-linux-x86/fasl/ql/dists/quicklisp/software/lisp-zmq-20160208-git/src/grovel.c" Output was: /home/testgrid/cl-test-grid/work-dir/agent/test-runs/20160216212151-sbcl-1.1.11-linux-x86/fasl/ql/dists/quicklisp/software/lisp-zmq-20160208-git/src/grovel.c:6:17: fatal error: zmq.h: No such file or directory compilation terminated.
(LOAD zmq FAIL) ffi-grovel, CFFI-GROVEL:GROVEL-ERROR : External process exited with code 1. Command was: "cc" "-m32" "-I/home/testgrid/cl-test-grid/work-dir/agent/quicklisp/dists/quicklisp/software/cffi_0.16.1/" "-o" "/home/testgrid/cl-test-grid/work-dir/agent/test-runs/20160216212151-sbcl-1.1.11-linux-x86/fasl/ql/dists/quicklisp/software/lisp-zmq-20160208-git/src/grovel" "/home/testgrid/cl-test-grid/work-dir/agent/test-runs/20160216212151-sbcl-1.1.11-linux-x86/fasl/ql/dists/quicklisp/software/lisp-zmq-20160208-git/src/grovel.c" Output was: /home/testgrid/cl-test-grid/work-dir/agent/test-runs/20160216212151-sbcl-1.1.11-linux-x86/fasl/ql/dists/quicklisp/software/lisp-zmq-20160208-git/src/grovel.c:6:17: fatal error: zmq.h: No such file or directory compilation terminated.
sbcl-1.1.16-linux-x86
(LOAD zmq-test FAIL) ASDF/FIND-SYSTEM:LOAD-SYSTEM-DEFINITION-ERROR : Error while trying to load definition for system zmq from pathname /home/testgrid/cl-test-grid/work-dir/agent/quicklisp/dists/quicklisp/software/lisp-zmq-20160208-git/zmq.asd: Error while trying to load definition for system cffi-toolchain from pathname /home/testgrid/cl-test-grid/work-dir/agent/quicklisp/dists/quicklisp/software/cffi_0.17.1/cffi-toolchain.asd: CFFI-toolchain requires ASDF 3.1!
(LOAD zmq-examples FAIL) ASDF/FIND-SYSTEM:LOAD-SYSTEM-DEFINITION-ERROR : Error while trying to load definition for system zmq from pathname /home/testgrid/cl-test-grid/work-dir/agent/quicklisp/dists/quicklisp/software/lisp-zmq-20160208-git/zmq.asd: Error while trying to load definition for system cffi-toolchain from pathname /home/testgrid/cl-test-grid/work-dir/agent/quicklisp/dists/quicklisp/software/cffi_0.17.1/cffi-toolchain.asd: CFFI-toolchain requires ASDF 3.1!
(LOAD zmq FAIL) ASDF/FIND-SYSTEM:LOAD-SYSTEM-DEFINITION-ERROR : Error while trying to load definition for system zmq from pathname /home/testgrid/cl-test-grid/work-dir/agent/quicklisp/dists/quicklisp/software/lisp-zmq-20160208-git/zmq.asd: Error while trying to load definition for system cffi-toolchain from pathname /home/testgrid/cl-test-grid/work-dir/agent/quicklisp/dists/quicklisp/software/cffi_0.17.1/cffi-toolchain.asd: CFFI-toolchain requires ASDF 3.1!
(LOAD zmq-test FAIL) ffi-grovel, CFFI-GROVEL:GROVEL-ERROR : External process exited with code 1. Command was: "cc" "-m32" "-I/home/testgrid/cl-test-grid/work-dir/agent/quicklisp/dists/quicklisp/software/cffi_0.16.1/" "-o" "/home/testgrid/cl-test-grid/work-dir/agent/test-runs/20160216184032-sbcl-1.1.16-linux-x86/fasl/ql/dists/quicklisp/software/lisp-zmq-20160208-git/src/grovel" "/home/testgrid/cl-test-grid/work-dir/agent/test-runs/20160216184032-sbcl-1.1.16-linux-x86/fasl/ql/dists/quicklisp/software/lisp-zmq-20160208-git/src/grovel.c" Output was: /home/testgrid/cl-test-grid/work-dir/agent/test-runs/20160216184032-sbcl-1.1.16-linux-x86/fasl/ql/dists/quicklisp/software/lisp-zmq-20160208-git/src/grovel.c:6:17: fatal error: zmq.h: No such file or directory compilation terminated.
(LOAD zmq-examples FAIL) ffi-grovel, CFFI-GROVEL:GROVEL-ERROR : External process exited with code 1. Command was: "cc" "-m32" "-I/home/testgrid/cl-test-grid/work-dir/agent/quicklisp/dists/quicklisp/software/cffi_0.16.1/" "-o" "/home/testgrid/cl-test-grid/work-dir/agent/test-runs/20160216184032-sbcl-1.1.16-linux-x86/fasl/ql/dists/quicklisp/software/lisp-zmq-20160208-git/src/grovel" "/home/testgrid/cl-test-grid/work-dir/agent/test-runs/20160216184032-sbcl-1.1.16-linux-x86/fasl/ql/dists/quicklisp/software/lisp-zmq-20160208-git/src/grovel.c" Output was: /home/testgrid/cl-test-grid/work-dir/agent/test-runs/20160216184032-sbcl-1.1.16-linux-x86/fasl/ql/dists/quicklisp/software/lisp-zmq-20160208-git/src/grovel.c:6:17: fatal error: zmq.h: No such file or directory compilation terminated.
(LOAD zmq FAIL) ffi-grovel, CFFI-GROVEL:GROVEL-ERROR : External process exited with code 1. Command was: "cc" "-m32" "-I/home/testgrid/cl-test-grid/work-dir/agent/quicklisp/dists/quicklisp/software/cffi_0.16.1/" "-o" "/home/testgrid/cl-test-grid/work-dir/agent/test-runs/20160216184032-sbcl-1.1.16-linux-x86/fasl/ql/dists/quicklisp/software/lisp-zmq-20160208-git/src/grovel" "/home/testgrid/cl-test-grid/work-dir/agent/test-runs/20160216184032-sbcl-1.1.16-linux-x86/fasl/ql/dists/quicklisp/software/lisp-zmq-20160208-git/src/grovel.c" Output was: /home/testgrid/cl-test-grid/work-dir/agent/test-runs/20160216184032-sbcl-1.1.16-linux-x86/fasl/ql/dists/quicklisp/software/lisp-zmq-20160208-git/src/grovel.c:6:17: fatal error: zmq.h: No such file or directory compilation terminated.
sbcl-1.2.14-linux-arm
(LOAD zmq-test FAIL) ASDF/FIND-SYSTEM:LOAD-SYSTEM-DEFINITION-ERROR : Error while trying to load definition for system zmq from pathname /home/testgrid/cl-test-grid/work-dir/agent/quicklisp/dists/quicklisp/software/lisp-zmq-20160208-git/zmq.asd: COMPILE-FILE-ERROR while compiling #<CL-SOURCE-FILE "cffi-toolchain" "toolchain" "c-toolchain">
(LOAD zmq-examples FAIL) ASDF/FIND-SYSTEM:LOAD-SYSTEM-DEFINITION-ERROR : Error while trying to load definition for system zmq from pathname /home/testgrid/cl-test-grid/work-dir/agent/quicklisp/dists/quicklisp/software/lisp-zmq-20160208-git/zmq.asd: COMPILE-FILE-ERROR while compiling #<CL-SOURCE-FILE "cffi-toolchain" "toolchain" "c-toolchain">
(LOAD zmq FAIL) ASDF/FIND-SYSTEM:LOAD-SYSTEM-DEFINITION-ERROR : Error while trying to load definition for system zmq from pathname /home/testgrid/cl-test-grid/work-dir/agent/quicklisp/dists/quicklisp/software/lisp-zmq-20160208-git/zmq.asd: COMPILE-FILE-ERROR while compiling #<CL-SOURCE-FILE "cffi-toolchain" "toolchain" "c-toolchain">
(LOAD zmq-test FAIL) ffi-grovel, CFFI-GROVEL:GROVEL-ERROR : External process exited with code 1. Command was: "cc" "-marm" "-I/home/testgrid/cl-test-grid/work-dir/agent/quicklisp/dists/quicklisp/software/cffi_0.16.1/" "-o" "/home/testgrid/cl-test-grid/work-dir/agent/test-runs/20160214122543-sbcl-1.2.14-linux-arm/fasl/ql/dists/quicklisp/software/lisp-zmq-20160208-git/src/grovel" "/home/testgrid/cl-test-grid/work-dir/agent/test-runs/20160214122543-sbcl-1.2.14-linux-arm/fasl/ql/dists/quicklisp/software/lisp-zmq-20160208-git/src/grovel.c" Output was: /home/testgrid/cl-test-grid/work-dir/agent/test-runs/20160214122543-sbcl-1.2.14-linux-arm/fasl/ql/dists/quicklisp/software/lisp-zmq-20160208-git/src/grovel.c:6:17: fatal error: zmq.h: No such file or directory #include <zmq.h> ^ compilation terminated.
(LOAD zmq-examples FAIL) ffi-grovel, CFFI-GROVEL:GROVEL-ERROR : External process exited with code 1. Command was: "cc" "-marm" "-I/home/testgrid/cl-test-grid/work-dir/agent/quicklisp/dists/quicklisp/software/cffi_0.16.1/" "-o" "/home/testgrid/cl-test-grid/work-dir/agent/test-runs/20160214122543-sbcl-1.2.14-linux-arm/fasl/ql/dists/quicklisp/software/lisp-zmq-20160208-git/src/grovel" "/home/testgrid/cl-test-grid/work-dir/agent/test-runs/20160214122543-sbcl-1.2.14-linux-arm/fasl/ql/dists/quicklisp/software/lisp-zmq-20160208-git/src/grovel.c" Output was: /home/testgrid/cl-test-grid/work-dir/agent/test-runs/20160214122543-sbcl-1.2.14-linux-arm/fasl/ql/dists/quicklisp/software/lisp-zmq-20160208-git/src/grovel.c:6:17: fatal error: zmq.h: No such file or directory #include <zmq.h> ^ compilation terminated.
(LOAD zmq FAIL) ffi-grovel, CFFI-GROVEL:GROVEL-ERROR : External process exited with code 1. Command was: "cc" "-marm" "-I/home/testgrid/cl-test-grid/work-dir/agent/quicklisp/dists/quicklisp/software/cffi_0.16.1/" "-o" "/home/testgrid/cl-test-grid/work-dir/agent/test-runs/20160214122543-sbcl-1.2.14-linux-arm/fasl/ql/dists/quicklisp/software/lisp-zmq-20160208-git/src/grovel" "/home/testgrid/cl-test-grid/work-dir/agent/test-runs/20160214122543-sbcl-1.2.14-linux-arm/fasl/ql/dists/quicklisp/software/lisp-zmq-20160208-git/src/grovel.c" Output was: /home/testgrid/cl-test-grid/work-dir/agent/test-runs/20160214122543-sbcl-1.2.14-linux-arm/fasl/ql/dists/quicklisp/software/lisp-zmq-20160208-git/src/grovel.c:6:17: fatal error: zmq.h: No such file or directory #include <zmq.h> ^ compilation terminated.
sbcl-1.2.3-linux-x64
(LOAD zmq-test FAIL) ASDF/FIND-SYSTEM:LOAD-SYSTEM-DEFINITION-ERROR : Error while trying to load definition for system zmq from pathname /home/hijarian/systems/cl-test-grid/work-dir/agent/quicklisp/dists/quicklisp/software/lisp-zmq-20160208-git/zmq.asd: COMPILE-FILE-ERROR while compiling #<CL-SOURCE-FILE "cffi-toolchain" "toolchain" "asdf-compat">
(LOAD zmq-examples FAIL) ASDF/FIND-SYSTEM:LOAD-SYSTEM-DEFINITION-ERROR : Error while trying to load definition for system zmq from pathname /home/hijarian/systems/cl-test-grid/work-dir/agent/quicklisp/dists/quicklisp/software/lisp-zmq-20160208-git/zmq.asd: COMPILE-FILE-ERROR while compiling #<CL-SOURCE-FILE "cffi-toolchain" "toolchain" "asdf-compat">
(LOAD zmq FAIL) ASDF/FIND-SYSTEM:LOAD-SYSTEM-DEFINITION-ERROR : Error while trying to load definition for system zmq from pathname /home/hijarian/systems/cl-test-grid/work-dir/agent/quicklisp/dists/quicklisp/software/lisp-zmq-20160208-git/zmq.asd: COMPILE-FILE-ERROR while compiling #<CL-SOURCE-FILE "cffi-toolchain" "toolchain" "asdf-compat">
(LOAD zmq-test FAIL) ffi-grovel, CFFI-GROVEL:GROVEL-ERROR : External process exited with code 1. Command was: "cc" "-m64" "-I/home/hijarian/systems/cl-test-grid/work-dir/agent/quicklisp/dists/quicklisp/software/cffi_0.16.1/" "-o" "/home/hijarian/systems/cl-test-grid/work-dir/agent/test-runs/20160309091525-sbcl-1.2.3-linux-x64/fasl/ql/dists/quicklisp/software/lisp-zmq-20160208-git/src/grovel" "/home/hijarian/systems/cl-test-grid/work-dir/agent/test-runs/20160309091525-sbcl-1.2.3-linux-x64/fasl/ql/dists/quicklisp/software/lisp-zmq-20160208-git/src/grovel.c" Output was: /home/hijarian/systems/cl-test-grid/work-dir/agent/test-runs/20160309091525-sbcl-1.2.3-linux-x64/fasl/ql/dists/quicklisp/software/lisp-zmq-20160208-git/src/grovel.c:6:17: fatal error: zmq.h: Нет такого файла или каталога compilation terminated.
(LOAD zmq-examples FAIL) ffi-grovel, CFFI-GROVEL:GROVEL-ERROR : External process exited with code 1. Command was: "cc" "-m64" "-I/home/hijarian/systems/cl-test-grid/work-dir/agent/quicklisp/dists/quicklisp/software/cffi_0.16.1/" "-o" "/home/hijarian/systems/cl-test-grid/work-dir/agent/test-runs/20160309091525-sbcl-1.2.3-linux-x64/fasl/ql/dists/quicklisp/software/lisp-zmq-20160208-git/src/grovel" "/home/hijarian/systems/cl-test-grid/work-dir/agent/test-runs/20160309091525-sbcl-1.2.3-linux-x64/fasl/ql/dists/quicklisp/software/lisp-zmq-20160208-git/src/grovel.c" Output was: /home/hijarian/systems/cl-test-grid/work-dir/agent/test-runs/20160309091525-sbcl-1.2.3-linux-x64/fasl/ql/dists/quicklisp/software/lisp-zmq-20160208-git/src/grovel.c:6:17: fatal error: zmq.h: Нет такого файла или каталога compilation terminated.
(LOAD zmq FAIL) ffi-grovel, CFFI-GROVEL:GROVEL-ERROR : External process exited with code 1. Command was: "cc" "-m64" "-I/home/hijarian/systems/cl-test-grid/work-dir/agent/quicklisp/dists/quicklisp/software/cffi_0.16.1/" "-o" "/home/hijarian/systems/cl-test-grid/work-dir/agent/test-runs/20160309091525-sbcl-1.2.3-linux-x64/fasl/ql/dists/quicklisp/software/lisp-zmq-20160208-git/src/grovel" "/home/hijarian/systems/cl-test-grid/work-dir/agent/test-runs/20160309091525-sbcl-1.2.3-linux-x64/fasl/ql/dists/quicklisp/software/lisp-zmq-20160208-git/src/grovel.c" Output was: /home/hijarian/systems/cl-test-grid/work-dir/agent/test-runs/20160309091525-sbcl-1.2.3-linux-x64/fasl/ql/dists/quicklisp/software/lisp-zmq-20160208-git/src/grovel.c:6:17: fatal error: zmq.h: Нет такого файла или каталога compilation terminated.
(LOAD zmq-test FAIL) ffi-grovel, CFFI-GROVEL:GROVEL-ERROR : External process exited with code 1. Command was: "cc" "-m64" "-I/home/hijarian/systems/cl-test-grid/work-dir/agent/quicklisp/dists/quicklisp/software/cffi_0.16.1/" "-o" "/home/hijarian/systems/cl-test-grid/work-dir/agent/test-runs/20160306151126-sbcl-1.2.3-linux-x64/fasl/ql/dists/quicklisp/software/lisp-zmq-20160208-git/src/grovel" "/home/hijarian/systems/cl-test-grid/work-dir/agent/test-runs/20160306151126-sbcl-1.2.3-linux-x64/fasl/ql/dists/quicklisp/software/lisp-zmq-20160208-git/src/grovel.c" Output was: /home/hijarian/systems/cl-test-grid/work-dir/agent/test-runs/20160306151126-sbcl-1.2.3-linux-x64/fasl/ql/dists/quicklisp/software/lisp-zmq-20160208-git/src/grovel.c:6:17: fatal error: zmq.h: Нет такого файла или каталога compilation terminated.
(LOAD zmq-examples FAIL) ffi-grovel, CFFI-GROVEL:GROVEL-ERROR : External process exited with code 1. Command was: "cc" "-m64" "-I/home/hijarian/systems/cl-test-grid/work-dir/agent/quicklisp/dists/quicklisp/software/cffi_0.16.1/" "-o" "/home/hijarian/systems/cl-test-grid/work-dir/agent/test-runs/20160306151126-sbcl-1.2.3-linux-x64/fasl/ql/dists/quicklisp/software/lisp-zmq-20160208-git/src/grovel" "/home/hijarian/systems/cl-test-grid/work-dir/agent/test-runs/20160306151126-sbcl-1.2.3-linux-x64/fasl/ql/dists/quicklisp/software/lisp-zmq-20160208-git/src/grovel.c" Output was: /home/hijarian/systems/cl-test-grid/work-dir/agent/test-runs/20160306151126-sbcl-1.2.3-linux-x64/fasl/ql/dists/quicklisp/software/lisp-zmq-20160208-git/src/grovel.c:6:17: fatal error: zmq.h: Нет такого файла или каталога compilation terminated.
(LOAD zmq FAIL) ffi-grovel, CFFI-GROVEL:GROVEL-ERROR : External process exited with code 1. Command was: "cc" "-m64" "-I/home/hijarian/systems/cl-test-grid/work-dir/agent/quicklisp/dists/quicklisp/software/cffi_0.16.1/" "-o" "/home/hijarian/systems/cl-test-grid/work-dir/agent/test-runs/20160306151126-sbcl-1.2.3-linux-x64/fasl/ql/dists/quicklisp/software/lisp-zmq-20160208-git/src/grovel" "/home/hijarian/systems/cl-test-grid/work-dir/agent/test-runs/20160306151126-sbcl-1.2.3-linux-x64/fasl/ql/dists/quicklisp/software/lisp-zmq-20160208-git/src/grovel.c" Output was: /home/hijarian/systems/cl-test-grid/work-dir/agent/test-runs/20160306151126-sbcl-1.2.3-linux-x64/fasl/ql/dists/quicklisp/software/lisp-zmq-20160208-git/src/grovel.c:6:17: fatal error: zmq.h: Нет такого файла или каталога compilation terminated.
(LOAD zmq-test FAIL) ffi-grovel, CFFI-GROVEL:GROVEL-ERROR : External process exited with code 1. Command was: "cc" "-m64" "-I/home/hijarian/systems/cl-test-grid/work-dir/agent/quicklisp/dists/quicklisp/software/cffi_0.16.1/" "-o" "/home/hijarian/systems/cl-test-grid/work-dir/agent/test-runs/20160215081554-sbcl-1.2.3-linux-x64/fasl/ql/dists/quicklisp/software/lisp-zmq-20160208-git/src/grovel" "/home/hijarian/systems/cl-test-grid/work-dir/agent/test-runs/20160215081554-sbcl-1.2.3-linux-x64/fasl/ql/dists/quicklisp/software/lisp-zmq-20160208-git/src/grovel.c" Output was: /home/hijarian/systems/cl-test-grid/work-dir/agent/test-runs/20160215081554-sbcl-1.2.3-linux-x64/fasl/ql/dists/quicklisp/software/lisp-zmq-20160208-git/src/grovel.c:6:17: fatal error: zmq.h: Нет такого файла или каталога #include <zmq.h> ^ compilation terminated.
(LOAD zmq-examples FAIL) ffi-grovel, CFFI-GROVEL:GROVEL-ERROR : External process exited with code 1. Command was: "cc" "-m64" "-I/home/hijarian/systems/cl-test-grid/work-dir/agent/quicklisp/dists/quicklisp/software/cffi_0.16.1/" "-o" "/home/hijarian/systems/cl-test-grid/work-dir/agent/test-runs/20160215081554-sbcl-1.2.3-linux-x64/fasl/ql/dists/quicklisp/software/lisp-zmq-20160208-git/src/grovel" "/home/hijarian/systems/cl-test-grid/work-dir/agent/test-runs/20160215081554-sbcl-1.2.3-linux-x64/fasl/ql/dists/quicklisp/software/lisp-zmq-20160208-git/src/grovel.c" Output was: /home/hijarian/systems/cl-test-grid/work-dir/agent/test-runs/20160215081554-sbcl-1.2.3-linux-x64/fasl/ql/dists/quicklisp/software/lisp-zmq-20160208-git/src/grovel.c:6:17: fatal error: zmq.h: Нет такого файла или каталога #include <zmq.h> ^ compilation terminated.
(LOAD zmq FAIL) ffi-grovel, CFFI-GROVEL:GROVEL-ERROR : External process exited with code 1. Command was: "cc" "-m64" "-I/home/hijarian/systems/cl-test-grid/work-dir/agent/quicklisp/dists/quicklisp/software/cffi_0.16.1/" "-o" "/home/hijarian/systems/cl-test-grid/work-dir/agent/test-runs/20160215081554-sbcl-1.2.3-linux-x64/fasl/ql/dists/quicklisp/software/lisp-zmq-20160208-git/src/grovel" "/home/hijarian/systems/cl-test-grid/work-dir/agent/test-runs/20160215081554-sbcl-1.2.3-linux-x64/fasl/ql/dists/quicklisp/software/lisp-zmq-20160208-git/src/grovel.c" Output was: /home/hijarian/systems/cl-test-grid/work-dir/agent/test-runs/20160215081554-sbcl-1.2.3-linux-x64/fasl/ql/dists/quicklisp/software/lisp-zmq-20160208-git/src/grovel.c:6:17: fatal error: zmq.h: Нет такого файла или каталога #include <zmq.h> ^ compilation terminated.
sbcl-1.2.6-linux-x86
(LOAD zmq-test FAIL) ffi-grovel, CFFI-GROVEL:GROVEL-ERROR : External process exited with code 1. Command was: "cc" "-m32" "-I/home/testgrid/cl-test-grid/work-dir/agent/quicklisp/dists/quicklisp/software/cffi_0.16.1/" "-o" "/home/testgrid/cl-test-grid/work-dir/agent/test-runs/20160213220313-sbcl-1.2.6-linux-x86/fasl/ql/dists/quicklisp/software/lisp-zmq-20160208-git/src/grovel" "/home/testgrid/cl-test-grid/work-dir/agent/test-runs/20160213220313-sbcl-1.2.6-linux-x86/fasl/ql/dists/quicklisp/software/lisp-zmq-20160208-git/src/grovel.c" Output was: /home/testgrid/cl-test-grid/work-dir/agent/test-runs/20160213220313-sbcl-1.2.6-linux-x86/fasl/ql/dists/quicklisp/software/lisp-zmq-20160208-git/src/grovel.c:6:17: fatal error: zmq.h: No such file or directory compilation terminated.
(LOAD zmq-examples FAIL) ffi-grovel, CFFI-GROVEL:GROVEL-ERROR : External process exited with code 1. Command was: "cc" "-m32" "-I/home/testgrid/cl-test-grid/work-dir/agent/quicklisp/dists/quicklisp/software/cffi_0.16.1/" "-o" "/home/testgrid/cl-test-grid/work-dir/agent/test-runs/20160213220313-sbcl-1.2.6-linux-x86/fasl/ql/dists/quicklisp/software/lisp-zmq-20160208-git/src/grovel" "/home/testgrid/cl-test-grid/work-dir/agent/test-runs/20160213220313-sbcl-1.2.6-linux-x86/fasl/ql/dists/quicklisp/software/lisp-zmq-20160208-git/src/grovel.c" Output was: /home/testgrid/cl-test-grid/work-dir/agent/test-runs/20160213220313-sbcl-1.2.6-linux-x86/fasl/ql/dists/quicklisp/software/lisp-zmq-20160208-git/src/grovel.c:6:17: fatal error: zmq.h: No such file or directory compilation terminated.
(LOAD zmq FAIL) ffi-grovel, CFFI-GROVEL:GROVEL-ERROR : External process exited with code 1. Command was: "cc" "-m32" "-I/home/testgrid/cl-test-grid/work-dir/agent/quicklisp/dists/quicklisp/software/cffi_0.16.1/" "-o" "/home/testgrid/cl-test-grid/work-dir/agent/test-runs/20160213220313-sbcl-1.2.6-linux-x86/fasl/ql/dists/quicklisp/software/lisp-zmq-20160208-git/src/grovel" "/home/testgrid/cl-test-grid/work-dir/agent/test-runs/20160213220313-sbcl-1.2.6-linux-x86/fasl/ql/dists/quicklisp/software/lisp-zmq-20160208-git/src/grovel.c" Output was: /home/testgrid/cl-test-grid/work-dir/agent/test-runs/20160213220313-sbcl-1.2.6-linux-x86/fasl/ql/dists/quicklisp/software/lisp-zmq-20160208-git/src/grovel.c:6:17: fatal error: zmq.h: No such file or directory compilation terminated.
sbcl-1.3.2.92-4077405-macosx-x64
(LOAD zmq-test FAIL) ffi-grovel, CFFI-GROVEL:GROVEL-ERROR : External process exited with code 1. Command was: "cc" "-m64" "-I" "/opt/local/include/" "-I/Users/testgrid/cl-test-grid/work-dir/agent/quicklisp/dists/quicklisp/software/cffi_0.16.1/" "-o" "/Users/testgrid/cl-test-grid/work-dir/agent/test-runs/20160220052250-sbcl-1.3.2.92-4077405-macosx-x64/fasl/ql/dists/quicklisp/software/lisp-zmq-20160208-git/src/grovel" "/Users/testgrid/cl-test-grid/work-dir/agent/test-runs/20160220052250-sbcl-1.3.2.92-4077405-macosx-x64/fasl/ql/dists/quicklisp/software/lisp-zmq-20160208-git/src/grovel.c" Output was: /Users/testgrid/cl-test-grid/work-dir/agent/test-runs/20160220052250-sbcl-1.3.2.92-4077405-macosx-x64/fasl/ql/dists/quicklisp/software/lisp-zmq-20160208-git/src/grovel.c:6:10: fatal error: 'zmq.h' file not found #include <zmq.h> ^ 1 error generated.
(LOAD zmq-examples FAIL) ffi-grovel, CFFI-GROVEL:GROVEL-ERROR : External process exited with code 1. Command was: "cc" "-m64" "-I" "/opt/local/include/" "-I/Users/testgrid/cl-test-grid/work-dir/agent/quicklisp/dists/quicklisp/software/cffi_0.16.1/" "-o" "/Users/testgrid/cl-test-grid/work-dir/agent/test-runs/20160220052250-sbcl-1.3.2.92-4077405-macosx-x64/fasl/ql/dists/quicklisp/software/lisp-zmq-20160208-git/src/grovel" "/Users/testgrid/cl-test-grid/work-dir/agent/test-runs/20160220052250-sbcl-1.3.2.92-4077405-macosx-x64/fasl/ql/dists/quicklisp/software/lisp-zmq-20160208-git/src/grovel.c" Output was: /Users/testgrid/cl-test-grid/work-dir/agent/test-runs/20160220052250-sbcl-1.3.2.92-4077405-macosx-x64/fasl/ql/dists/quicklisp/software/lisp-zmq-20160208-git/src/grovel.c:6:10: fatal error: 'zmq.h' file not found #include <zmq.h> ^ 1 error generated.
(LOAD zmq FAIL) ffi-grovel, CFFI-GROVEL:GROVEL-ERROR : External process exited with code 1. Command was: "cc" "-m64" "-I" "/opt/local/include/" "-I/Users/testgrid/cl-test-grid/work-dir/agent/quicklisp/dists/quicklisp/software/cffi_0.16.1/" "-o" "/Users/testgrid/cl-test-grid/work-dir/agent/test-runs/20160220052250-sbcl-1.3.2.92-4077405-macosx-x64/fasl/ql/dists/quicklisp/software/lisp-zmq-20160208-git/src/grovel" "/Users/testgrid/cl-test-grid/work-dir/agent/test-runs/20160220052250-sbcl-1.3.2.92-4077405-macosx-x64/fasl/ql/dists/quicklisp/software/lisp-zmq-20160208-git/src/grovel.c" Output was: /Users/testgrid/cl-test-grid/work-dir/agent/test-runs/20160220052250-sbcl-1.3.2.92-4077405-macosx-x64/fasl/ql/dists/quicklisp/software/lisp-zmq-20160208-git/src/grovel.c:6:10: fatal error: 'zmq.h' file not found #include <zmq.h> ^ 1 error generated.

Breakdown by testcases: for every failed testcase the lisp implmentations it fails on

The library does not have a testsuite adapter for CL Test Grid.

To reports overview

Generated at: 2016-04-17 01:10:27 GMT.