iolib results collected by cl-test-grid

Results on the last two Quicklisp distributions

 quicklisp 2015-04-07quicklisp 2015-03-02
abcl-1.2.1-fasl42-linux-x86
(LOAD iolib.trivial-sockets FAIL) ASDF/FIND-SYSTEM:MISSING-COMPONENT : Component "iolib/trivial-sockets" not found
(LOAD iolib.syscalls FAIL) ASDF/FIND-SYSTEM:MISSING-COMPONENT : Component "iolib/syscalls" not found
(LOAD iolib.streams FAIL) ASDF/FIND-SYSTEM:MISSING-COMPONENT : Component "iolib/streams" not found
(LOAD iolib.sockets FAIL) ASDF/FIND-SYSTEM:MISSING-COMPONENT : Component "iolib/sockets" not found
(LOAD iolib.pathnames FAIL) ASDF/FIND-SYSTEM:MISSING-COMPONENT : Component "iolib/pathnames" not found
(LOAD iolib.os FAIL) ASDF/FIND-SYSTEM:MISSING-COMPONENT : Component "iolib/os" not found
(LOAD iolib.multiplex FAIL) ASDF/FIND-SYSTEM:MISSING-COMPONENT : Component "iolib/multiplex" not found
(LOAD iolib.conf FAIL) ASDF/FIND-SYSTEM:MISSING-COMPONENT : Component "iolib/conf" not found
(LOAD iolib.common-lisp FAIL) ASDF/FIND-SYSTEM:MISSING-COMPONENT : Component "iolib/common-lisp" not found
(LOAD iolib.base FAIL) ASDF/FIND-SYSTEM:MISSING-COMPONENT : Component "iolib/base" not found
(LOAD iolib.asdf FAIL) ASDF/FIND-SYSTEM:MISSING-COMPONENT : Component "iolib/asdf" not found
(LOAD iolib-grovel FAIL) ASDF/FIND-SYSTEM:MISSING-COMPONENT : Component "iolib/grovel" not found
(LOAD iolib.trivial-sockets FAIL) ASDF/FIND-SYSTEM:MISSING-COMPONENT : Component "iolib/trivial-sockets" not found
(LOAD iolib.syscalls FAIL) ASDF/FIND-SYSTEM:MISSING-COMPONENT : Component "iolib/syscalls" not found
(LOAD iolib.streams FAIL) ASDF/FIND-SYSTEM:MISSING-COMPONENT : Component "iolib/streams" not found
(LOAD iolib.sockets FAIL) ASDF/FIND-SYSTEM:MISSING-COMPONENT : Component "iolib/sockets" not found
(LOAD iolib.pathnames FAIL) ASDF/FIND-SYSTEM:MISSING-COMPONENT : Component "iolib/pathnames" not found
(LOAD iolib.os FAIL) ASDF/FIND-SYSTEM:MISSING-COMPONENT : Component "iolib/os" not found
(LOAD iolib.multiplex FAIL) ASDF/FIND-SYSTEM:MISSING-COMPONENT : Component "iolib/multiplex" not found
(LOAD iolib.conf FAIL) ASDF/FIND-SYSTEM:MISSING-COMPONENT : Component "iolib/conf" not found
(LOAD iolib.common-lisp FAIL) ASDF/FIND-SYSTEM:MISSING-COMPONENT : Component "iolib/common-lisp" not found
(LOAD iolib.base FAIL) ASDF/FIND-SYSTEM:MISSING-COMPONENT : Component "iolib/base" not found
(LOAD iolib.asdf FAIL) ASDF/FIND-SYSTEM:MISSING-COMPONENT : Component "iolib/asdf" not found
(LOAD iolib-grovel FAIL) ASDF/FIND-SYSTEM:MISSING-COMPONENT : Component "iolib/grovel" not found
abcl-1.3.0-fasl42-linux-x86
abcl-1.3.1-fasl42-linux-x86
ccl-1.10-r16196-f96-linux-x64
(LOAD iolib.trivial-sockets FAIL) COMMON-LISP:SIMPLE-ERROR : External process exited with code 1. Command was: "g++" "-m64" "-Wno-write-strings" "-I/home/hijarian/systems/cl-test-grid/work-dir/agent/quicklisp/dists/quicklisp/software/iolib-20150302-git/src/grovel/" "-o" "/home/hijarian/systems/cl-test-grid/work-dir/agent/test-runs/20150408050757-ccl-1.10-r16196-f96-linux-x64/fasl/ql/dists/quicklisp/software/iolib-20150302-git/src/syscalls/ffi-types-unix" "/home/hijarian/systems/cl-test-grid/work-dir/agent/test-runs/20150408050757-ccl-1.10-r16196-f96-linux-x64/fasl/ql/dists/quicklisp/software/iolib-20150302-git/src/syscalls/ffi-types-unix.c" Output was: /home/hijarian/systems/cl-test-grid/work-dir/agent/test-runs/20150408050757-ccl-1.10-r16196-f96-linux-x64/fasl/ql/dists/quicklisp/software/iolib-20150302-git/src/syscalls/ffi-types-unix.c:14:17: fatal error: lfp.h: Нет такого файла или каталога #include <lfp.h> ^ compilation terminated.
(LOAD iolib.syscalls FAIL) COMMON-LISP:SIMPLE-ERROR : External process exited with code 1. Command was: "g++" "-m64" "-Wno-write-strings" "-I/home/hijarian/systems/cl-test-grid/work-dir/agent/quicklisp/dists/quicklisp/software/iolib-20150302-git/src/grovel/" "-o" "/home/hijarian/systems/cl-test-grid/work-dir/agent/test-runs/20150408050757-ccl-1.10-r16196-f96-linux-x64/fasl/ql/dists/quicklisp/software/iolib-20150302-git/src/syscalls/ffi-types-unix" "/home/hijarian/systems/cl-test-grid/work-dir/agent/test-runs/20150408050757-ccl-1.10-r16196-f96-linux-x64/fasl/ql/dists/quicklisp/software/iolib-20150302-git/src/syscalls/ffi-types-unix.c" Output was: /home/hijarian/systems/cl-test-grid/work-dir/agent/test-runs/20150408050757-ccl-1.10-r16196-f96-linux-x64/fasl/ql/dists/quicklisp/software/iolib-20150302-git/src/syscalls/ffi-types-unix.c:14:17: fatal error: lfp.h: Нет такого файла или каталога #include <lfp.h> ^ compilation terminated.
(LOAD iolib.streams FAIL) COMMON-LISP:SIMPLE-ERROR : External process exited with code 1. Command was: "g++" "-m64" "-Wno-write-strings" "-I/home/hijarian/systems/cl-test-grid/work-dir/agent/quicklisp/dists/quicklisp/software/iolib-20150302-git/src/grovel/" "-o" "/home/hijarian/systems/cl-test-grid/work-dir/agent/test-runs/20150408050757-ccl-1.10-r16196-f96-linux-x64/fasl/ql/dists/quicklisp/software/iolib-20150302-git/src/syscalls/ffi-types-unix" "/home/hijarian/systems/cl-test-grid/work-dir/agent/test-runs/20150408050757-ccl-1.10-r16196-f96-linux-x64/fasl/ql/dists/quicklisp/software/iolib-20150302-git/src/syscalls/ffi-types-unix.c" Output was: /home/hijarian/systems/cl-test-grid/work-dir/agent/test-runs/20150408050757-ccl-1.10-r16196-f96-linux-x64/fasl/ql/dists/quicklisp/software/iolib-20150302-git/src/syscalls/ffi-types-unix.c:14:17: fatal error: lfp.h: Нет такого файла или каталога #include <lfp.h> ^ compilation terminated.
(LOAD iolib.sockets FAIL) COMMON-LISP:SIMPLE-ERROR : External process exited with code 1. Command was: "g++" "-m64" "-Wno-write-strings" "-I/home/hijarian/systems/cl-test-grid/work-dir/agent/quicklisp/dists/quicklisp/software/iolib-20150302-git/src/grovel/" "-o" "/home/hijarian/systems/cl-test-grid/work-dir/agent/test-runs/20150408050757-ccl-1.10-r16196-f96-linux-x64/fasl/ql/dists/quicklisp/software/iolib-20150302-git/src/syscalls/ffi-types-unix" "/home/hijarian/systems/cl-test-grid/work-dir/agent/test-runs/20150408050757-ccl-1.10-r16196-f96-linux-x64/fasl/ql/dists/quicklisp/software/iolib-20150302-git/src/syscalls/ffi-types-unix.c" Output was: /home/hijarian/systems/cl-test-grid/work-dir/agent/test-runs/20150408050757-ccl-1.10-r16196-f96-linux-x64/fasl/ql/dists/quicklisp/software/iolib-20150302-git/src/syscalls/ffi-types-unix.c:14:17: fatal error: lfp.h: Нет такого файла или каталога #include <lfp.h> ^ compilation terminated.
(LOAD iolib.pathnames FAIL) COMMON-LISP:SIMPLE-ERROR : External process exited with code 1. Command was: "g++" "-m64" "-Wno-write-strings" "-I/home/hijarian/systems/cl-test-grid/work-dir/agent/quicklisp/dists/quicklisp/software/iolib-20150302-git/src/grovel/" "-o" "/home/hijarian/systems/cl-test-grid/work-dir/agent/test-runs/20150408050757-ccl-1.10-r16196-f96-linux-x64/fasl/ql/dists/quicklisp/software/iolib-20150302-git/src/syscalls/ffi-types-unix" "/home/hijarian/systems/cl-test-grid/work-dir/agent/test-runs/20150408050757-ccl-1.10-r16196-f96-linux-x64/fasl/ql/dists/quicklisp/software/iolib-20150302-git/src/syscalls/ffi-types-unix.c" Output was: /home/hijarian/systems/cl-test-grid/work-dir/agent/test-runs/20150408050757-ccl-1.10-r16196-f96-linux-x64/fasl/ql/dists/quicklisp/software/iolib-20150302-git/src/syscalls/ffi-types-unix.c:14:17: fatal error: lfp.h: Нет такого файла или каталога #include <lfp.h> ^ compilation terminated.
(LOAD iolib.os FAIL) COMMON-LISP:SIMPLE-ERROR : External process exited with code 1. Command was: "g++" "-m64" "-Wno-write-strings" "-I/home/hijarian/systems/cl-test-grid/work-dir/agent/quicklisp/dists/quicklisp/software/iolib-20150302-git/src/grovel/" "-o" "/home/hijarian/systems/cl-test-grid/work-dir/agent/test-runs/20150408050757-ccl-1.10-r16196-f96-linux-x64/fasl/ql/dists/quicklisp/software/iolib-20150302-git/src/syscalls/ffi-types-unix" "/home/hijarian/systems/cl-test-grid/work-dir/agent/test-runs/20150408050757-ccl-1.10-r16196-f96-linux-x64/fasl/ql/dists/quicklisp/software/iolib-20150302-git/src/syscalls/ffi-types-unix.c" Output was: /home/hijarian/systems/cl-test-grid/work-dir/agent/test-runs/20150408050757-ccl-1.10-r16196-f96-linux-x64/fasl/ql/dists/quicklisp/software/iolib-20150302-git/src/syscalls/ffi-types-unix.c:14:17: fatal error: lfp.h: Нет такого файла или каталога #include <lfp.h> ^ compilation terminated.
(LOAD iolib.multiplex FAIL) COMMON-LISP:SIMPLE-ERROR : External process exited with code 1. Command was: "g++" "-m64" "-Wno-write-strings" "-I/home/hijarian/systems/cl-test-grid/work-dir/agent/quicklisp/dists/quicklisp/software/iolib-20150302-git/src/grovel/" "-o" "/home/hijarian/systems/cl-test-grid/work-dir/agent/test-runs/20150408050757-ccl-1.10-r16196-f96-linux-x64/fasl/ql/dists/quicklisp/software/iolib-20150302-git/src/syscalls/ffi-types-unix" "/home/hijarian/systems/cl-test-grid/work-dir/agent/test-runs/20150408050757-ccl-1.10-r16196-f96-linux-x64/fasl/ql/dists/quicklisp/software/iolib-20150302-git/src/syscalls/ffi-types-unix.c" Output was: /home/hijarian/systems/cl-test-grid/work-dir/agent/test-runs/20150408050757-ccl-1.10-r16196-f96-linux-x64/fasl/ql/dists/quicklisp/software/iolib-20150302-git/src/syscalls/ffi-types-unix.c:14:17: fatal error: lfp.h: Нет такого файла или каталога #include <lfp.h> ^ compilation terminated.
(LOAD iolib.examples FAIL) COMMON-LISP:SIMPLE-ERROR : External process exited with code 1. Command was: "g++" "-m64" "-Wno-write-strings" "-I/home/hijarian/systems/cl-test-grid/work-dir/agent/quicklisp/dists/quicklisp/software/iolib-20150302-git/src/grovel/" "-o" "/home/hijarian/systems/cl-test-grid/work-dir/agent/test-runs/20150408050757-ccl-1.10-r16196-f96-linux-x64/fasl/ql/dists/quicklisp/software/iolib-20150302-git/src/syscalls/ffi-types-unix" "/home/hijarian/systems/cl-test-grid/work-dir/agent/test-runs/20150408050757-ccl-1.10-r16196-f96-linux-x64/fasl/ql/dists/quicklisp/software/iolib-20150302-git/src/syscalls/ffi-types-unix.c" Output was: /home/hijarian/systems/cl-test-grid/work-dir/agent/test-runs/20150408050757-ccl-1.10-r16196-f96-linux-x64/fasl/ql/dists/quicklisp/software/iolib-20150302-git/src/syscalls/ffi-types-unix.c:14:17: fatal error: lfp.h: Нет такого файла или каталога #include <lfp.h> ^ compilation terminated.
(LOAD iolib-tests FAIL) COMMON-LISP:SIMPLE-ERROR : External process exited with code 1. Command was: "g++" "-m64" "-Wno-write-strings" "-I/home/hijarian/systems/cl-test-grid/work-dir/agent/quicklisp/dists/quicklisp/software/iolib-20150302-git/src/grovel/" "-o" "/home/hijarian/systems/cl-test-grid/work-dir/agent/test-runs/20150408050757-ccl-1.10-r16196-f96-linux-x64/fasl/ql/dists/quicklisp/software/iolib-20150302-git/src/syscalls/ffi-types-unix" "/home/hijarian/systems/cl-test-grid/work-dir/agent/test-runs/20150408050757-ccl-1.10-r16196-f96-linux-x64/fasl/ql/dists/quicklisp/software/iolib-20150302-git/src/syscalls/ffi-types-unix.c" Output was: /home/hijarian/systems/cl-test-grid/work-dir/agent/test-runs/20150408050757-ccl-1.10-r16196-f96-linux-x64/fasl/ql/dists/quicklisp/software/iolib-20150302-git/src/syscalls/ffi-types-unix.c:14:17: fatal error: lfp.h: Нет такого файла или каталога #include <lfp.h> ^ compilation terminated.
(LOAD iolib FAIL) COMMON-LISP:SIMPLE-ERROR : External process exited with code 1. Command was: "g++" "-m64" "-Wno-write-strings" "-I/home/hijarian/systems/cl-test-grid/work-dir/agent/quicklisp/dists/quicklisp/software/iolib-20150302-git/src/grovel/" "-o" "/home/hijarian/systems/cl-test-grid/work-dir/agent/test-runs/20150408050757-ccl-1.10-r16196-f96-linux-x64/fasl/ql/dists/quicklisp/software/iolib-20150302-git/src/syscalls/ffi-types-unix" "/home/hijarian/systems/cl-test-grid/work-dir/agent/test-runs/20150408050757-ccl-1.10-r16196-f96-linux-x64/fasl/ql/dists/quicklisp/software/iolib-20150302-git/src/syscalls/ffi-types-unix.c" Output was: /home/hijarian/systems/cl-test-grid/work-dir/agent/test-runs/20150408050757-ccl-1.10-r16196-f96-linux-x64/fasl/ql/dists/quicklisp/software/iolib-20150302-git/src/syscalls/ffi-types-unix.c:14:17: fatal error: lfp.h: Нет такого файла или каталога #include <lfp.h> ^ compilation terminated.
(LOAD iolib.trivial-sockets FAIL) COMMON-LISP:SIMPLE-ERROR : External process exited with code 1. Command was: "g++" "-m64" "-Wno-write-strings" "-I/home/joram/dev/lisp/cl-test-grid/work-dir/agent/quicklisp/dists/quicklisp/software/iolib-20150302-git/src/grovel/" "-o" "/home/joram/dev/lisp/cl-test-grid/work-dir/agent/test-runs/20150316132516-ccl-1.10-r16196-f96-linux-x64/fasl/ql/dists/quicklisp/software/iolib-20150302-git/src/syscalls/ffi-types-unix" "/home/joram/dev/lisp/cl-test-grid/work-dir/agent/test-runs/20150316132516-ccl-1.10-r16196-f96-linux-x64/fasl/ql/dists/quicklisp/software/iolib-20150302-git/src/syscalls/ffi-types-unix.c" Output was: /home/joram/dev/lisp/cl-test-grid/work-dir/agent/test-runs/20150316132516-ccl-1.10-r16196-f96-linux-x64/fasl/ql/dists/quicklisp/software/iolib-20150302-git/src/syscalls/ffi-types-unix.c:14:17: fatal error: lfp.h: No such file or directory #include <lfp.h> ^ compilation terminated.
(LOAD iolib.syscalls FAIL) COMMON-LISP:SIMPLE-ERROR : External process exited with code 1. Command was: "g++" "-m64" "-Wno-write-strings" "-I/home/joram/dev/lisp/cl-test-grid/work-dir/agent/quicklisp/dists/quicklisp/software/iolib-20150302-git/src/grovel/" "-o" "/home/joram/dev/lisp/cl-test-grid/work-dir/agent/test-runs/20150316132516-ccl-1.10-r16196-f96-linux-x64/fasl/ql/dists/quicklisp/software/iolib-20150302-git/src/syscalls/ffi-types-unix" "/home/joram/dev/lisp/cl-test-grid/work-dir/agent/test-runs/20150316132516-ccl-1.10-r16196-f96-linux-x64/fasl/ql/dists/quicklisp/software/iolib-20150302-git/src/syscalls/ffi-types-unix.c" Output was: /home/joram/dev/lisp/cl-test-grid/work-dir/agent/test-runs/20150316132516-ccl-1.10-r16196-f96-linux-x64/fasl/ql/dists/quicklisp/software/iolib-20150302-git/src/syscalls/ffi-types-unix.c:14:17: fatal error: lfp.h: No such file or directory #include <lfp.h> ^ compilation terminated.
(LOAD iolib.streams FAIL) COMMON-LISP:SIMPLE-ERROR : External process exited with code 1. Command was: "g++" "-m64" "-Wno-write-strings" "-I/home/joram/dev/lisp/cl-test-grid/work-dir/agent/quicklisp/dists/quicklisp/software/iolib-20150302-git/src/grovel/" "-o" "/home/joram/dev/lisp/cl-test-grid/work-dir/agent/test-runs/20150316132516-ccl-1.10-r16196-f96-linux-x64/fasl/ql/dists/quicklisp/software/iolib-20150302-git/src/syscalls/ffi-types-unix" "/home/joram/dev/lisp/cl-test-grid/work-dir/agent/test-runs/20150316132516-ccl-1.10-r16196-f96-linux-x64/fasl/ql/dists/quicklisp/software/iolib-20150302-git/src/syscalls/ffi-types-unix.c" Output was: /home/joram/dev/lisp/cl-test-grid/work-dir/agent/test-runs/20150316132516-ccl-1.10-r16196-f96-linux-x64/fasl/ql/dists/quicklisp/software/iolib-20150302-git/src/syscalls/ffi-types-unix.c:14:17: fatal error: lfp.h: No such file or directory #include <lfp.h> ^ compilation terminated.
(LOAD iolib.sockets FAIL) COMMON-LISP:SIMPLE-ERROR : External process exited with code 1. Command was: "g++" "-m64" "-Wno-write-strings" "-I/home/joram/dev/lisp/cl-test-grid/work-dir/agent/quicklisp/dists/quicklisp/software/iolib-20150302-git/src/grovel/" "-o" "/home/joram/dev/lisp/cl-test-grid/work-dir/agent/test-runs/20150316132516-ccl-1.10-r16196-f96-linux-x64/fasl/ql/dists/quicklisp/software/iolib-20150302-git/src/syscalls/ffi-types-unix" "/home/joram/dev/lisp/cl-test-grid/work-dir/agent/test-runs/20150316132516-ccl-1.10-r16196-f96-linux-x64/fasl/ql/dists/quicklisp/software/iolib-20150302-git/src/syscalls/ffi-types-unix.c" Output was: /home/joram/dev/lisp/cl-test-grid/work-dir/agent/test-runs/20150316132516-ccl-1.10-r16196-f96-linux-x64/fasl/ql/dists/quicklisp/software/iolib-20150302-git/src/syscalls/ffi-types-unix.c:14:17: fatal error: lfp.h: No such file or directory #include <lfp.h> ^ compilation terminated.
(LOAD iolib.pathnames FAIL) COMMON-LISP:SIMPLE-ERROR : External process exited with code 1. Command was: "g++" "-m64" "-Wno-write-strings" "-I/home/joram/dev/lisp/cl-test-grid/work-dir/agent/quicklisp/dists/quicklisp/software/iolib-20150302-git/src/grovel/" "-o" "/home/joram/dev/lisp/cl-test-grid/work-dir/agent/test-runs/20150316132516-ccl-1.10-r16196-f96-linux-x64/fasl/ql/dists/quicklisp/software/iolib-20150302-git/src/syscalls/ffi-types-unix" "/home/joram/dev/lisp/cl-test-grid/work-dir/agent/test-runs/20150316132516-ccl-1.10-r16196-f96-linux-x64/fasl/ql/dists/quicklisp/software/iolib-20150302-git/src/syscalls/ffi-types-unix.c" Output was: /home/joram/dev/lisp/cl-test-grid/work-dir/agent/test-runs/20150316132516-ccl-1.10-r16196-f96-linux-x64/fasl/ql/dists/quicklisp/software/iolib-20150302-git/src/syscalls/ffi-types-unix.c:14:17: fatal error: lfp.h: No such file or directory #include <lfp.h> ^ compilation terminated.
(LOAD iolib.os FAIL) COMMON-LISP:SIMPLE-ERROR : External process exited with code 1. Command was: "g++" "-m64" "-Wno-write-strings" "-I/home/joram/dev/lisp/cl-test-grid/work-dir/agent/quicklisp/dists/quicklisp/software/iolib-20150302-git/src/grovel/" "-o" "/home/joram/dev/lisp/cl-test-grid/work-dir/agent/test-runs/20150316132516-ccl-1.10-r16196-f96-linux-x64/fasl/ql/dists/quicklisp/software/iolib-20150302-git/src/syscalls/ffi-types-unix" "/home/joram/dev/lisp/cl-test-grid/work-dir/agent/test-runs/20150316132516-ccl-1.10-r16196-f96-linux-x64/fasl/ql/dists/quicklisp/software/iolib-20150302-git/src/syscalls/ffi-types-unix.c" Output was: /home/joram/dev/lisp/cl-test-grid/work-dir/agent/test-runs/20150316132516-ccl-1.10-r16196-f96-linux-x64/fasl/ql/dists/quicklisp/software/iolib-20150302-git/src/syscalls/ffi-types-unix.c:14:17: fatal error: lfp.h: No such file or directory #include <lfp.h> ^ compilation terminated.
(LOAD iolib.multiplex FAIL) COMMON-LISP:SIMPLE-ERROR : External process exited with code 1. Command was: "g++" "-m64" "-Wno-write-strings" "-I/home/joram/dev/lisp/cl-test-grid/work-dir/agent/quicklisp/dists/quicklisp/software/iolib-20150302-git/src/grovel/" "-o" "/home/joram/dev/lisp/cl-test-grid/work-dir/agent/test-runs/20150316132516-ccl-1.10-r16196-f96-linux-x64/fasl/ql/dists/quicklisp/software/iolib-20150302-git/src/syscalls/ffi-types-unix" "/home/joram/dev/lisp/cl-test-grid/work-dir/agent/test-runs/20150316132516-ccl-1.10-r16196-f96-linux-x64/fasl/ql/dists/quicklisp/software/iolib-20150302-git/src/syscalls/ffi-types-unix.c" Output was: /home/joram/dev/lisp/cl-test-grid/work-dir/agent/test-runs/20150316132516-ccl-1.10-r16196-f96-linux-x64/fasl/ql/dists/quicklisp/software/iolib-20150302-git/src/syscalls/ffi-types-unix.c:14:17: fatal error: lfp.h: No such file or directory #include <lfp.h> ^ compilation terminated.
(LOAD iolib.examples FAIL) COMMON-LISP:SIMPLE-ERROR : External process exited with code 1. Command was: "g++" "-m64" "-Wno-write-strings" "-I/home/joram/dev/lisp/cl-test-grid/work-dir/agent/quicklisp/dists/quicklisp/software/iolib-20150302-git/src/grovel/" "-o" "/home/joram/dev/lisp/cl-test-grid/work-dir/agent/test-runs/20150316132516-ccl-1.10-r16196-f96-linux-x64/fasl/ql/dists/quicklisp/software/iolib-20150302-git/src/syscalls/ffi-types-unix" "/home/joram/dev/lisp/cl-test-grid/work-dir/agent/test-runs/20150316132516-ccl-1.10-r16196-f96-linux-x64/fasl/ql/dists/quicklisp/software/iolib-20150302-git/src/syscalls/ffi-types-unix.c" Output was: /home/joram/dev/lisp/cl-test-grid/work-dir/agent/test-runs/20150316132516-ccl-1.10-r16196-f96-linux-x64/fasl/ql/dists/quicklisp/software/iolib-20150302-git/src/syscalls/ffi-types-unix.c:14:17: fatal error: lfp.h: No such file or directory #include <lfp.h> ^ compilation terminated.
(LOAD iolib-tests FAIL) COMMON-LISP:SIMPLE-ERROR : External process exited with code 1. Command was: "g++" "-m64" "-Wno-write-strings" "-I/home/joram/dev/lisp/cl-test-grid/work-dir/agent/quicklisp/dists/quicklisp/software/iolib-20150302-git/src/grovel/" "-o" "/home/joram/dev/lisp/cl-test-grid/work-dir/agent/test-runs/20150316132516-ccl-1.10-r16196-f96-linux-x64/fasl/ql/dists/quicklisp/software/iolib-20150302-git/src/syscalls/ffi-types-unix" "/home/joram/dev/lisp/cl-test-grid/work-dir/agent/test-runs/20150316132516-ccl-1.10-r16196-f96-linux-x64/fasl/ql/dists/quicklisp/software/iolib-20150302-git/src/syscalls/ffi-types-unix.c" Output was: /home/joram/dev/lisp/cl-test-grid/work-dir/agent/test-runs/20150316132516-ccl-1.10-r16196-f96-linux-x64/fasl/ql/dists/quicklisp/software/iolib-20150302-git/src/syscalls/ffi-types-unix.c:14:17: fatal error: lfp.h: No such file or directory #include <lfp.h> ^ compilation terminated.
(LOAD iolib FAIL) COMMON-LISP:SIMPLE-ERROR : External process exited with code 1. Command was: "g++" "-m64" "-Wno-write-strings" "-I/home/joram/dev/lisp/cl-test-grid/work-dir/agent/quicklisp/dists/quicklisp/software/iolib-20150302-git/src/grovel/" "-o" "/home/joram/dev/lisp/cl-test-grid/work-dir/agent/test-runs/20150316132516-ccl-1.10-r16196-f96-linux-x64/fasl/ql/dists/quicklisp/software/iolib-20150302-git/src/syscalls/ffi-types-unix" "/home/joram/dev/lisp/cl-test-grid/work-dir/agent/test-runs/20150316132516-ccl-1.10-r16196-f96-linux-x64/fasl/ql/dists/quicklisp/software/iolib-20150302-git/src/syscalls/ffi-types-unix.c" Output was: /home/joram/dev/lisp/cl-test-grid/work-dir/agent/test-runs/20150316132516-ccl-1.10-r16196-f96-linux-x64/fasl/ql/dists/quicklisp/software/iolib-20150302-git/src/syscalls/ffi-types-unix.c:14:17: fatal error: lfp.h: No such file or directory #include <lfp.h> ^ compilation terminated.
(LOAD iolib.trivial-sockets FAIL) COMMON-LISP:SIMPLE-ERROR : External process exited with code 1. Command was: "g++" "-m64" "-Wno-write-strings" "-I/home/hijarian/systems/cl-test-grid/work-dir/agent/quicklisp/dists/quicklisp/software/iolib-20150302-git/src/grovel/" "-o" "/home/hijarian/systems/cl-test-grid/work-dir/agent/test-runs/20150303104636-ccl-1.10-r16196-f96-linux-x64/fasl/ql/dists/quicklisp/software/iolib-20150302-git/src/syscalls/ffi-types-unix" "/home/hijarian/systems/cl-test-grid/work-dir/agent/test-runs/20150303104636-ccl-1.10-r16196-f96-linux-x64/fasl/ql/dists/quicklisp/software/iolib-20150302-git/src/syscalls/ffi-types-unix.c" Output was: /home/hijarian/systems/cl-test-grid/work-dir/agent/test-runs/20150303104636-ccl-1.10-r16196-f96-linux-x64/fasl/ql/dists/quicklisp/software/iolib-20150302-git/src/syscalls/ffi-types-unix.c:14:17: fatal error: lfp.h: Нет такого файла или каталога #include <lfp.h> ^ compilation terminated.
(LOAD iolib.syscalls FAIL) COMMON-LISP:SIMPLE-ERROR : External process exited with code 1. Command was: "g++" "-m64" "-Wno-write-strings" "-I/home/hijarian/systems/cl-test-grid/work-dir/agent/quicklisp/dists/quicklisp/software/iolib-20150302-git/src/grovel/" "-o" "/home/hijarian/systems/cl-test-grid/work-dir/agent/test-runs/20150303104636-ccl-1.10-r16196-f96-linux-x64/fasl/ql/dists/quicklisp/software/iolib-20150302-git/src/syscalls/ffi-types-unix" "/home/hijarian/systems/cl-test-grid/work-dir/agent/test-runs/20150303104636-ccl-1.10-r16196-f96-linux-x64/fasl/ql/dists/quicklisp/software/iolib-20150302-git/src/syscalls/ffi-types-unix.c" Output was: /home/hijarian/systems/cl-test-grid/work-dir/agent/test-runs/20150303104636-ccl-1.10-r16196-f96-linux-x64/fasl/ql/dists/quicklisp/software/iolib-20150302-git/src/syscalls/ffi-types-unix.c:14:17: fatal error: lfp.h: Нет такого файла или каталога #include <lfp.h> ^ compilation terminated.
(LOAD iolib.streams FAIL) COMMON-LISP:SIMPLE-ERROR : External process exited with code 1. Command was: "g++" "-m64" "-Wno-write-strings" "-I/home/hijarian/systems/cl-test-grid/work-dir/agent/quicklisp/dists/quicklisp/software/iolib-20150302-git/src/grovel/" "-o" "/home/hijarian/systems/cl-test-grid/work-dir/agent/test-runs/20150303104636-ccl-1.10-r16196-f96-linux-x64/fasl/ql/dists/quicklisp/software/iolib-20150302-git/src/syscalls/ffi-types-unix" "/home/hijarian/systems/cl-test-grid/work-dir/agent/test-runs/20150303104636-ccl-1.10-r16196-f96-linux-x64/fasl/ql/dists/quicklisp/software/iolib-20150302-git/src/syscalls/ffi-types-unix.c" Output was: /home/hijarian/systems/cl-test-grid/work-dir/agent/test-runs/20150303104636-ccl-1.10-r16196-f96-linux-x64/fasl/ql/dists/quicklisp/software/iolib-20150302-git/src/syscalls/ffi-types-unix.c:14:17: fatal error: lfp.h: Нет такого файла или каталога #include <lfp.h> ^ compilation terminated.
(LOAD iolib.sockets FAIL) COMMON-LISP:SIMPLE-ERROR : External process exited with code 1. Command was: "g++" "-m64" "-Wno-write-strings" "-I/home/hijarian/systems/cl-test-grid/work-dir/agent/quicklisp/dists/quicklisp/software/iolib-20150302-git/src/grovel/" "-o" "/home/hijarian/systems/cl-test-grid/work-dir/agent/test-runs/20150303104636-ccl-1.10-r16196-f96-linux-x64/fasl/ql/dists/quicklisp/software/iolib-20150302-git/src/syscalls/ffi-types-unix" "/home/hijarian/systems/cl-test-grid/work-dir/agent/test-runs/20150303104636-ccl-1.10-r16196-f96-linux-x64/fasl/ql/dists/quicklisp/software/iolib-20150302-git/src/syscalls/ffi-types-unix.c" Output was: /home/hijarian/systems/cl-test-grid/work-dir/agent/test-runs/20150303104636-ccl-1.10-r16196-f96-linux-x64/fasl/ql/dists/quicklisp/software/iolib-20150302-git/src/syscalls/ffi-types-unix.c:14:17: fatal error: lfp.h: Нет такого файла или каталога #include <lfp.h> ^ compilation terminated.
(LOAD iolib.pathnames FAIL) COMMON-LISP:SIMPLE-ERROR : External process exited with code 1. Command was: "g++" "-m64" "-Wno-write-strings" "-I/home/hijarian/systems/cl-test-grid/work-dir/agent/quicklisp/dists/quicklisp/software/iolib-20150302-git/src/grovel/" "-o" "/home/hijarian/systems/cl-test-grid/work-dir/agent/test-runs/20150303104636-ccl-1.10-r16196-f96-linux-x64/fasl/ql/dists/quicklisp/software/iolib-20150302-git/src/syscalls/ffi-types-unix" "/home/hijarian/systems/cl-test-grid/work-dir/agent/test-runs/20150303104636-ccl-1.10-r16196-f96-linux-x64/fasl/ql/dists/quicklisp/software/iolib-20150302-git/src/syscalls/ffi-types-unix.c" Output was: /home/hijarian/systems/cl-test-grid/work-dir/agent/test-runs/20150303104636-ccl-1.10-r16196-f96-linux-x64/fasl/ql/dists/quicklisp/software/iolib-20150302-git/src/syscalls/ffi-types-unix.c:14:17: fatal error: lfp.h: Нет такого файла или каталога #include <lfp.h> ^ compilation terminated.
(LOAD iolib.os FAIL) COMMON-LISP:SIMPLE-ERROR : External process exited with code 1. Command was: "g++" "-m64" "-Wno-write-strings" "-I/home/hijarian/systems/cl-test-grid/work-dir/agent/quicklisp/dists/quicklisp/software/iolib-20150302-git/src/grovel/" "-o" "/home/hijarian/systems/cl-test-grid/work-dir/agent/test-runs/20150303104636-ccl-1.10-r16196-f96-linux-x64/fasl/ql/dists/quicklisp/software/iolib-20150302-git/src/syscalls/ffi-types-unix" "/home/hijarian/systems/cl-test-grid/work-dir/agent/test-runs/20150303104636-ccl-1.10-r16196-f96-linux-x64/fasl/ql/dists/quicklisp/software/iolib-20150302-git/src/syscalls/ffi-types-unix.c" Output was: /home/hijarian/systems/cl-test-grid/work-dir/agent/test-runs/20150303104636-ccl-1.10-r16196-f96-linux-x64/fasl/ql/dists/quicklisp/software/iolib-20150302-git/src/syscalls/ffi-types-unix.c:14:17: fatal error: lfp.h: Нет такого файла или каталога #include <lfp.h> ^ compilation terminated.
(LOAD iolib.multiplex FAIL) COMMON-LISP:SIMPLE-ERROR : External process exited with code 1. Command was: "g++" "-m64" "-Wno-write-strings" "-I/home/hijarian/systems/cl-test-grid/work-dir/agent/quicklisp/dists/quicklisp/software/iolib-20150302-git/src/grovel/" "-o" "/home/hijarian/systems/cl-test-grid/work-dir/agent/test-runs/20150303104636-ccl-1.10-r16196-f96-linux-x64/fasl/ql/dists/quicklisp/software/iolib-20150302-git/src/syscalls/ffi-types-unix" "/home/hijarian/systems/cl-test-grid/work-dir/agent/test-runs/20150303104636-ccl-1.10-r16196-f96-linux-x64/fasl/ql/dists/quicklisp/software/iolib-20150302-git/src/syscalls/ffi-types-unix.c" Output was: /home/hijarian/systems/cl-test-grid/work-dir/agent/test-runs/20150303104636-ccl-1.10-r16196-f96-linux-x64/fasl/ql/dists/quicklisp/software/iolib-20150302-git/src/syscalls/ffi-types-unix.c:14:17: fatal error: lfp.h: Нет такого файла или каталога #include <lfp.h> ^ compilation terminated.
(LOAD iolib.examples FAIL) COMMON-LISP:SIMPLE-ERROR : External process exited with code 1. Command was: "g++" "-m64" "-Wno-write-strings" "-I/home/hijarian/systems/cl-test-grid/work-dir/agent/quicklisp/dists/quicklisp/software/iolib-20150302-git/src/grovel/" "-o" "/home/hijarian/systems/cl-test-grid/work-dir/agent/test-runs/20150303104636-ccl-1.10-r16196-f96-linux-x64/fasl/ql/dists/quicklisp/software/iolib-20150302-git/src/syscalls/ffi-types-unix" "/home/hijarian/systems/cl-test-grid/work-dir/agent/test-runs/20150303104636-ccl-1.10-r16196-f96-linux-x64/fasl/ql/dists/quicklisp/software/iolib-20150302-git/src/syscalls/ffi-types-unix.c" Output was: /home/hijarian/systems/cl-test-grid/work-dir/agent/test-runs/20150303104636-ccl-1.10-r16196-f96-linux-x64/fasl/ql/dists/quicklisp/software/iolib-20150302-git/src/syscalls/ffi-types-unix.c:14:17: fatal error: lfp.h: Нет такого файла или каталога #include <lfp.h> ^ compilation terminated.
(LOAD iolib-tests FAIL) COMMON-LISP:SIMPLE-ERROR : External process exited with code 1. Command was: "g++" "-m64" "-Wno-write-strings" "-I/home/hijarian/systems/cl-test-grid/work-dir/agent/quicklisp/dists/quicklisp/software/iolib-20150302-git/src/grovel/" "-o" "/home/hijarian/systems/cl-test-grid/work-dir/agent/test-runs/20150303104636-ccl-1.10-r16196-f96-linux-x64/fasl/ql/dists/quicklisp/software/iolib-20150302-git/src/syscalls/ffi-types-unix" "/home/hijarian/systems/cl-test-grid/work-dir/agent/test-runs/20150303104636-ccl-1.10-r16196-f96-linux-x64/fasl/ql/dists/quicklisp/software/iolib-20150302-git/src/syscalls/ffi-types-unix.c" Output was: /home/hijarian/systems/cl-test-grid/work-dir/agent/test-runs/20150303104636-ccl-1.10-r16196-f96-linux-x64/fasl/ql/dists/quicklisp/software/iolib-20150302-git/src/syscalls/ffi-types-unix.c:14:17: fatal error: lfp.h: Нет такого файла или каталога #include <lfp.h> ^ compilation terminated.
(LOAD iolib FAIL) COMMON-LISP:SIMPLE-ERROR : External process exited with code 1. Command was: "g++" "-m64" "-Wno-write-strings" "-I/home/hijarian/systems/cl-test-grid/work-dir/agent/quicklisp/dists/quicklisp/software/iolib-20150302-git/src/grovel/" "-o" "/home/hijarian/systems/cl-test-grid/work-dir/agent/test-runs/20150303104636-ccl-1.10-r16196-f96-linux-x64/fasl/ql/dists/quicklisp/software/iolib-20150302-git/src/syscalls/ffi-types-unix" "/home/hijarian/systems/cl-test-grid/work-dir/agent/test-runs/20150303104636-ccl-1.10-r16196-f96-linux-x64/fasl/ql/dists/quicklisp/software/iolib-20150302-git/src/syscalls/ffi-types-unix.c" Output was: /home/hijarian/systems/cl-test-grid/work-dir/agent/test-runs/20150303104636-ccl-1.10-r16196-f96-linux-x64/fasl/ql/dists/quicklisp/software/iolib-20150302-git/src/syscalls/ffi-types-unix.c:14:17: fatal error: lfp.h: Нет такого файла или каталога #include <lfp.h> ^ compilation terminated.
ccl-1.10-r16196-f96-linux-x86
ccl-1.8-r15286m-f95-linux-x86
(LOAD iolib.trivial-sockets FAIL) ASDF:LOAD-SYSTEM-DEFINITION-ERROR : Error while trying to load definition for system swap-bytes from pathname /home/testgrid/cl-test-grid/work-dir/agent/quicklisp/dists/quicklisp/software/swap-bytes-20140713-git/swap-bytes.asd: You need ASDF >= 2.32 to load this system correctly.
(LOAD iolib.syscalls FAIL) ASDF:MISSING-COMPONENT : Component "iolib/syscalls" not found
(LOAD iolib.streams FAIL) ASDF:MISSING-COMPONENT : Component "iolib/streams" not found
(LOAD iolib.sockets FAIL) ASDF:LOAD-SYSTEM-DEFINITION-ERROR : Error while trying to load definition for system swap-bytes from pathname /home/testgrid/cl-test-grid/work-dir/agent/quicklisp/dists/quicklisp/software/swap-bytes-20140713-git/swap-bytes.asd: You need ASDF >= 2.32 to load this system correctly.
(LOAD iolib.pathnames FAIL) ASDF:MISSING-COMPONENT : Component "iolib/pathnames" not found
(LOAD iolib.os FAIL) ASDF:MISSING-COMPONENT : Component "iolib/os" not found
(LOAD iolib.multiplex FAIL) ASDF:MISSING-COMPONENT : Component "iolib/multiplex" not found
(LOAD iolib.examples FAIL) ASDF:LOAD-SYSTEM-DEFINITION-ERROR : Error while trying to load definition for system iolib from pathname /home/testgrid/cl-test-grid/work-dir/agent/quicklisp/dists/quicklisp/software/iolib-20150302-git/iolib.asd: You need ASDF >= 2.31.1 to load this system correctly.
(LOAD iolib.conf FAIL) ASDF:MISSING-COMPONENT : Component "iolib/conf" not found
(LOAD iolib.common-lisp FAIL) ASDF:MISSING-COMPONENT : Component "iolib/common-lisp" not found
(LOAD iolib.base FAIL) ASDF:MISSING-COMPONENT : Component "iolib/base" not found
(LOAD iolib.asdf FAIL) ASDF:MISSING-COMPONENT : Component "iolib/asdf" not found
(LOAD iolib-tests FAIL) ASDF:LOAD-SYSTEM-DEFINITION-ERROR : Error while trying to load definition for system iolib from pathname /home/testgrid/cl-test-grid/work-dir/agent/quicklisp/dists/quicklisp/software/iolib-20150302-git/iolib.asd: You need ASDF >= 2.31.1 to load this system correctly.
(LOAD iolib-grovel FAIL) ASDF:MISSING-COMPONENT : Component "iolib/grovel" not found
(LOAD iolib FAIL) ASDF:LOAD-SYSTEM-DEFINITION-ERROR : Error while trying to load definition for system iolib from pathname /home/testgrid/cl-test-grid/work-dir/agent/quicklisp/dists/quicklisp/software/iolib-20150302-git/iolib.asd: You need ASDF >= 2.31.1 to load this system correctly.
(LOAD iolib.trivial-sockets FAIL) ASDF:LOAD-SYSTEM-DEFINITION-ERROR : Error while trying to load definition for system swap-bytes from pathname /home/testgrid/cl-test-grid/work-dir/agent/quicklisp/dists/quicklisp/software/swap-bytes-20140713-git/swap-bytes.asd: You need ASDF >= 2.32 to load this system correctly.
(LOAD iolib.syscalls FAIL) ASDF:MISSING-COMPONENT : Component "iolib/syscalls" not found
(LOAD iolib.streams FAIL) ASDF:MISSING-COMPONENT : Component "iolib/streams" not found
(LOAD iolib.sockets FAIL) ASDF:LOAD-SYSTEM-DEFINITION-ERROR : Error while trying to load definition for system swap-bytes from pathname /home/testgrid/cl-test-grid/work-dir/agent/quicklisp/dists/quicklisp/software/swap-bytes-20140713-git/swap-bytes.asd: You need ASDF >= 2.32 to load this system correctly.
(LOAD iolib.pathnames FAIL) ASDF:MISSING-COMPONENT : Component "iolib/pathnames" not found
(LOAD iolib.os FAIL) ASDF:MISSING-COMPONENT : Component "iolib/os" not found
(LOAD iolib.multiplex FAIL) ASDF:MISSING-COMPONENT : Component "iolib/multiplex" not found
(LOAD iolib.examples FAIL) ASDF:LOAD-SYSTEM-DEFINITION-ERROR : Error while trying to load definition for system iolib from pathname /home/testgrid/cl-test-grid/work-dir/agent/quicklisp/dists/quicklisp/software/iolib-20150302-git/iolib.asd: You need ASDF >= 2.31.1 to load this system correctly.
(LOAD iolib.conf FAIL) ASDF:MISSING-COMPONENT : Component "iolib/conf" not found
(LOAD iolib.common-lisp FAIL) ASDF:MISSING-COMPONENT : Component "iolib/common-lisp" not found
(LOAD iolib.base FAIL) ASDF:MISSING-COMPONENT : Component "iolib/base" not found
(LOAD iolib.asdf FAIL) ASDF:MISSING-COMPONENT : Component "iolib/asdf" not found
(LOAD iolib-tests FAIL) ASDF:LOAD-SYSTEM-DEFINITION-ERROR : Error while trying to load definition for system iolib from pathname /home/testgrid/cl-test-grid/work-dir/agent/quicklisp/dists/quicklisp/software/iolib-20150302-git/iolib.asd: You need ASDF >= 2.31.1 to load this system correctly.
(LOAD iolib-grovel FAIL) ASDF:MISSING-COMPONENT : Component "iolib/grovel" not found
(LOAD iolib FAIL) ASDF:LOAD-SYSTEM-DEFINITION-ERROR : Error while trying to load definition for system iolib from pathname /home/testgrid/cl-test-grid/work-dir/agent/quicklisp/dists/quicklisp/software/iolib-20150302-git/iolib.asd: You need ASDF >= 2.31.1 to load this system correctly.
ccl-1.9-r15756-f96-linux-x86
(LOAD iolib.trivial-sockets FAIL) ASDF/FIND-SYSTEM:MISSING-COMPONENT : Component "iolib/trivial-sockets" not found
(LOAD iolib.syscalls FAIL) ASDF/FIND-SYSTEM:MISSING-COMPONENT : Component "iolib/syscalls" not found
(LOAD iolib.streams FAIL) ASDF/FIND-SYSTEM:MISSING-COMPONENT : Component "iolib/streams" not found
(LOAD iolib.sockets FAIL) ASDF/FIND-SYSTEM:MISSING-COMPONENT : Component "iolib/sockets" not found
(LOAD iolib.pathnames FAIL) ASDF/FIND-SYSTEM:MISSING-COMPONENT : Component "iolib/pathnames" not found
(LOAD iolib.os FAIL) ASDF/FIND-SYSTEM:MISSING-COMPONENT : Component "iolib/os" not found
(LOAD iolib.multiplex FAIL) ASDF/FIND-SYSTEM:MISSING-COMPONENT : Component "iolib/multiplex" not found
(LOAD iolib.conf FAIL) ASDF/FIND-SYSTEM:MISSING-COMPONENT : Component "iolib/conf" not found
(LOAD iolib.common-lisp FAIL) ASDF/FIND-SYSTEM:MISSING-COMPONENT : Component "iolib/common-lisp" not found
(LOAD iolib.base FAIL) ASDF/FIND-SYSTEM:MISSING-COMPONENT : Component "iolib/base" not found
(LOAD iolib.asdf FAIL) ASDF/FIND-SYSTEM:MISSING-COMPONENT : Component "iolib/asdf" not found
(LOAD iolib-grovel FAIL) ASDF/FIND-SYSTEM:MISSING-COMPONENT : Component "iolib/grovel" not found
(LOAD iolib.trivial-sockets FAIL) ASDF/FIND-SYSTEM:MISSING-COMPONENT : Component "iolib/trivial-sockets" not found
(LOAD iolib.syscalls FAIL) ASDF/FIND-SYSTEM:MISSING-COMPONENT : Component "iolib/syscalls" not found
(LOAD iolib.streams FAIL) ASDF/FIND-SYSTEM:MISSING-COMPONENT : Component "iolib/streams" not found
(LOAD iolib.sockets FAIL) ASDF/FIND-SYSTEM:MISSING-COMPONENT : Component "iolib/sockets" not found
(LOAD iolib.pathnames FAIL) ASDF/FIND-SYSTEM:MISSING-COMPONENT : Component "iolib/pathnames" not found
(LOAD iolib.os FAIL) ASDF/FIND-SYSTEM:MISSING-COMPONENT : Component "iolib/os" not found
(LOAD iolib.multiplex FAIL) ASDF/FIND-SYSTEM:MISSING-COMPONENT : Component "iolib/multiplex" not found
(LOAD iolib.conf FAIL) ASDF/FIND-SYSTEM:MISSING-COMPONENT : Component "iolib/conf" not found
(LOAD iolib.common-lisp FAIL) ASDF/FIND-SYSTEM:MISSING-COMPONENT : Component "iolib/common-lisp" not found
(LOAD iolib.base FAIL) ASDF/FIND-SYSTEM:MISSING-COMPONENT : Component "iolib/base" not found
(LOAD iolib.asdf FAIL) ASDF/FIND-SYSTEM:MISSING-COMPONENT : Component "iolib/asdf" not found
(LOAD iolib-grovel FAIL) ASDF/FIND-SYSTEM:MISSING-COMPONENT : Component "iolib/grovel" not found
clisp-2.49-unix-x64
(LOAD iolib.trivial-sockets FAIL) ASDF:LOAD-SYSTEM-DEFINITION-ERROR : Error while trying to load definition for system swap-bytes from pathname /home/hijarian/systems/cl-test-grid/work-dir/agent/quicklisp/dists/quicklisp/software/swap-bytes-20140713-git/swap-bytes.asd: You need ASDF >= 2.32 to load this system correctly.
(LOAD iolib.syscalls FAIL) ASDF:MISSING-COMPONENT : Component "iolib/syscalls" not found
(LOAD iolib.streams FAIL) ASDF:MISSING-COMPONENT : Component "iolib/streams" not found
(LOAD iolib.sockets FAIL) ASDF:LOAD-SYSTEM-DEFINITION-ERROR : Error while trying to load definition for system swap-bytes from pathname /home/hijarian/systems/cl-test-grid/work-dir/agent/quicklisp/dists/quicklisp/software/swap-bytes-20140713-git/swap-bytes.asd: You need ASDF >= 2.32 to load this system correctly.
(LOAD iolib.pathnames FAIL) ASDF:MISSING-COMPONENT : Component "iolib/pathnames" not found
(LOAD iolib.os FAIL) ASDF:MISSING-COMPONENT : Component "iolib/os" not found
(LOAD iolib.multiplex FAIL) ASDF:MISSING-COMPONENT : Component "iolib/multiplex" not found
(LOAD iolib.examples FAIL) ASDF:LOAD-SYSTEM-DEFINITION-ERROR : Error while trying to load definition for system iolib from pathname /home/hijarian/systems/cl-test-grid/work-dir/agent/quicklisp/dists/quicklisp/software/iolib-20150302-git/iolib.asd: You need ASDF >= 2.31.1 to load this system correctly.
(LOAD iolib.conf FAIL) ASDF:MISSING-COMPONENT : Component "iolib/conf" not found
(LOAD iolib.common-lisp FAIL) ASDF:MISSING-COMPONENT : Component "iolib/common-lisp" not found
(LOAD iolib.base FAIL) ASDF:MISSING-COMPONENT : Component "iolib/base" not found
(LOAD iolib.asdf FAIL) ASDF:MISSING-COMPONENT : Component "iolib/asdf" not found
(LOAD iolib-tests FAIL) ASDF:LOAD-SYSTEM-DEFINITION-ERROR : Error while trying to load definition for system iolib from pathname /home/hijarian/systems/cl-test-grid/work-dir/agent/quicklisp/dists/quicklisp/software/iolib-20150302-git/iolib.asd: You need ASDF >= 2.31.1 to load this system correctly.
(LOAD iolib-grovel FAIL) ASDF:MISSING-COMPONENT : Component "iolib/grovel" not found
(LOAD iolib FAIL) ASDF:LOAD-SYSTEM-DEFINITION-ERROR : Error while trying to load definition for system iolib from pathname /home/hijarian/systems/cl-test-grid/work-dir/agent/quicklisp/dists/quicklisp/software/iolib-20150302-git/iolib.asd: You need ASDF >= 2.31.1 to load this system correctly.
(LOAD iolib.trivial-sockets FAIL) ASDF:LOAD-SYSTEM-DEFINITION-ERROR : Error while trying to load definition for system swap-bytes from pathname /home/joram/dev/lisp/cl-test-grid/work-dir/agent/quicklisp/dists/quicklisp/software/swap-bytes-20140713-git/swap-bytes.asd: You need ASDF >= 2.32 to load this system correctly.
(LOAD iolib.syscalls FAIL) ASDF:MISSING-COMPONENT : Component "iolib/syscalls" not found
(LOAD iolib.streams FAIL) ASDF:MISSING-COMPONENT : Component "iolib/streams" not found
(LOAD iolib.sockets FAIL) ASDF:LOAD-SYSTEM-DEFINITION-ERROR : Error while trying to load definition for system swap-bytes from pathname /home/joram/dev/lisp/cl-test-grid/work-dir/agent/quicklisp/dists/quicklisp/software/swap-bytes-20140713-git/swap-bytes.asd: You need ASDF >= 2.32 to load this system correctly.
(LOAD iolib.pathnames FAIL) ASDF:MISSING-COMPONENT : Component "iolib/pathnames" not found
(LOAD iolib.os FAIL) ASDF:MISSING-COMPONENT : Component "iolib/os" not found
(LOAD iolib.multiplex FAIL) ASDF:MISSING-COMPONENT : Component "iolib/multiplex" not found
(LOAD iolib.examples FAIL) ASDF:LOAD-SYSTEM-DEFINITION-ERROR : Error while trying to load definition for system iolib from pathname /home/joram/dev/lisp/cl-test-grid/work-dir/agent/quicklisp/dists/quicklisp/software/iolib-20150302-git/iolib.asd: You need ASDF >= 2.31.1 to load this system correctly.
(LOAD iolib.conf FAIL) ASDF:MISSING-COMPONENT : Component "iolib/conf" not found
(LOAD iolib.common-lisp FAIL) ASDF:MISSING-COMPONENT : Component "iolib/common-lisp" not found
(LOAD iolib.base FAIL) ASDF:MISSING-COMPONENT : Component "iolib/base" not found
(LOAD iolib.asdf FAIL) ASDF:MISSING-COMPONENT : Component "iolib/asdf" not found
(LOAD iolib-tests FAIL) ASDF:LOAD-SYSTEM-DEFINITION-ERROR : Error while trying to load definition for system iolib from pathname /home/joram/dev/lisp/cl-test-grid/work-dir/agent/quicklisp/dists/quicklisp/software/iolib-20150302-git/iolib.asd: You need ASDF >= 2.31.1 to load this system correctly.
(LOAD iolib-grovel FAIL) ASDF:MISSING-COMPONENT : Component "iolib/grovel" not found
(LOAD iolib FAIL) ASDF:LOAD-SYSTEM-DEFINITION-ERROR : Error while trying to load definition for system iolib from pathname /home/joram/dev/lisp/cl-test-grid/work-dir/agent/quicklisp/dists/quicklisp/software/iolib-20150302-git/iolib.asd: You need ASDF >= 2.31.1 to load this system correctly.
(LOAD iolib.trivial-sockets FAIL) ASDF:LOAD-SYSTEM-DEFINITION-ERROR : Error while trying to load definition for system swap-bytes from pathname /home/hijarian/systems/cl-test-grid/work-dir/agent/quicklisp/dists/quicklisp/software/swap-bytes-20140713-git/swap-bytes.asd: You need ASDF >= 2.32 to load this system correctly.
(LOAD iolib.syscalls FAIL) ASDF:MISSING-COMPONENT : Component "iolib/syscalls" not found
(LOAD iolib.streams FAIL) ASDF:MISSING-COMPONENT : Component "iolib/streams" not found
(LOAD iolib.sockets FAIL) ASDF:LOAD-SYSTEM-DEFINITION-ERROR : Error while trying to load definition for system swap-bytes from pathname /home/hijarian/systems/cl-test-grid/work-dir/agent/quicklisp/dists/quicklisp/software/swap-bytes-20140713-git/swap-bytes.asd: You need ASDF >= 2.32 to load this system correctly.
(LOAD iolib.pathnames FAIL) ASDF:MISSING-COMPONENT : Component "iolib/pathnames" not found
(LOAD iolib.os FAIL) ASDF:MISSING-COMPONENT : Component "iolib/os" not found
(LOAD iolib.multiplex FAIL) ASDF:MISSING-COMPONENT : Component "iolib/multiplex" not found
(LOAD iolib.examples FAIL) ASDF:LOAD-SYSTEM-DEFINITION-ERROR : Error while trying to load definition for system iolib from pathname /home/hijarian/systems/cl-test-grid/work-dir/agent/quicklisp/dists/quicklisp/software/iolib-20150302-git/iolib.asd: You need ASDF >= 2.31.1 to load this system correctly.
(LOAD iolib.conf FAIL) ASDF:MISSING-COMPONENT : Component "iolib/conf" not found
(LOAD iolib.common-lisp FAIL) ASDF:MISSING-COMPONENT : Component "iolib/common-lisp" not found
(LOAD iolib.base FAIL) ASDF:MISSING-COMPONENT : Component "iolib/base" not found
(LOAD iolib.asdf FAIL) ASDF:MISSING-COMPONENT : Component "iolib/asdf" not found
(LOAD iolib-tests FAIL) ASDF:LOAD-SYSTEM-DEFINITION-ERROR : Error while trying to load definition for system iolib from pathname /home/hijarian/systems/cl-test-grid/work-dir/agent/quicklisp/dists/quicklisp/software/iolib-20150302-git/iolib.asd: You need ASDF >= 2.31.1 to load this system correctly.
(LOAD iolib-grovel FAIL) ASDF:MISSING-COMPONENT : Component "iolib/grovel" not found
(LOAD iolib FAIL) ASDF:LOAD-SYSTEM-DEFINITION-ERROR : Error while trying to load definition for system iolib from pathname /home/hijarian/systems/cl-test-grid/work-dir/agent/quicklisp/dists/quicklisp/software/iolib-20150302-git/iolib.asd: You need ASDF >= 2.31.1 to load this system correctly.
clisp-2.49-unix-x86
(LOAD iolib.trivial-sockets FAIL) ASDF:LOAD-SYSTEM-DEFINITION-ERROR : Error while trying to load definition for system swap-bytes from pathname /home/testgrid/cl-test-grid/work-dir/agent/quicklisp/dists/quicklisp/software/swap-bytes-20140713-git/swap-bytes.asd: You need ASDF >= 2.32 to load this system correctly.
(LOAD iolib.syscalls FAIL) ASDF:MISSING-COMPONENT : Component "iolib/syscalls" not found
(LOAD iolib.streams FAIL) ASDF:MISSING-COMPONENT : Component "iolib/streams" not found
(LOAD iolib.sockets FAIL) ASDF:LOAD-SYSTEM-DEFINITION-ERROR : Error while trying to load definition for system swap-bytes from pathname /home/testgrid/cl-test-grid/work-dir/agent/quicklisp/dists/quicklisp/software/swap-bytes-20140713-git/swap-bytes.asd: You need ASDF >= 2.32 to load this system correctly.
(LOAD iolib.pathnames FAIL) ASDF:MISSING-COMPONENT : Component "iolib/pathnames" not found
(LOAD iolib.os FAIL) ASDF:MISSING-COMPONENT : Component "iolib/os" not found
(LOAD iolib.multiplex FAIL) ASDF:MISSING-COMPONENT : Component "iolib/multiplex" not found
(LOAD iolib.examples FAIL) ASDF:LOAD-SYSTEM-DEFINITION-ERROR : Error while trying to load definition for system iolib from pathname /home/testgrid/cl-test-grid/work-dir/agent/quicklisp/dists/quicklisp/software/iolib-20150302-git/iolib.asd: You need ASDF >= 2.31.1 to load this system correctly.
(LOAD iolib.conf FAIL) ASDF:MISSING-COMPONENT : Component "iolib/conf" not found
(LOAD iolib.common-lisp FAIL) ASDF:MISSING-COMPONENT : Component "iolib/common-lisp" not found
(LOAD iolib.base FAIL) ASDF:MISSING-COMPONENT : Component "iolib/base" not found
(LOAD iolib.asdf FAIL) ASDF:MISSING-COMPONENT : Component "iolib/asdf" not found
(LOAD iolib-tests FAIL) ASDF:LOAD-SYSTEM-DEFINITION-ERROR : Error while trying to load definition for system iolib from pathname /home/testgrid/cl-test-grid/work-dir/agent/quicklisp/dists/quicklisp/software/iolib-20150302-git/iolib.asd: You need ASDF >= 2.31.1 to load this system correctly.
(LOAD iolib-grovel FAIL) ASDF:MISSING-COMPONENT : Component "iolib/grovel" not found
(LOAD iolib FAIL) ASDF:LOAD-SYSTEM-DEFINITION-ERROR : Error while trying to load definition for system iolib from pathname /home/testgrid/cl-test-grid/work-dir/agent/quicklisp/dists/quicklisp/software/iolib-20150302-git/iolib.asd: You need ASDF >= 2.31.1 to load this system correctly.
(LOAD iolib.trivial-sockets FAIL) ASDF:LOAD-SYSTEM-DEFINITION-ERROR : Error while trying to load definition for system swap-bytes from pathname /home/testgrid/cl-test-grid/work-dir/agent/quicklisp/dists/quicklisp/software/swap-bytes-20140713-git/swap-bytes.asd: You need ASDF >= 2.32 to load this system correctly.
(LOAD iolib.syscalls FAIL) ASDF:MISSING-COMPONENT : Component "iolib/syscalls" not found
(LOAD iolib.streams FAIL) ASDF:MISSING-COMPONENT : Component "iolib/streams" not found
(LOAD iolib.sockets FAIL) ASDF:LOAD-SYSTEM-DEFINITION-ERROR : Error while trying to load definition for system swap-bytes from pathname /home/testgrid/cl-test-grid/work-dir/agent/quicklisp/dists/quicklisp/software/swap-bytes-20140713-git/swap-bytes.asd: You need ASDF >= 2.32 to load this system correctly.
(LOAD iolib.pathnames FAIL) ASDF:MISSING-COMPONENT : Component "iolib/pathnames" not found
(LOAD iolib.os FAIL) ASDF:MISSING-COMPONENT : Component "iolib/os" not found
(LOAD iolib.multiplex FAIL) ASDF:MISSING-COMPONENT : Component "iolib/multiplex" not found
(LOAD iolib.examples FAIL) ASDF:LOAD-SYSTEM-DEFINITION-ERROR : Error while trying to load definition for system iolib from pathname /home/testgrid/cl-test-grid/work-dir/agent/quicklisp/dists/quicklisp/software/iolib-20150302-git/iolib.asd: You need ASDF >= 2.31.1 to load this system correctly.
(LOAD iolib.conf FAIL) ASDF:MISSING-COMPONENT : Component "iolib/conf" not found
(LOAD iolib.common-lisp FAIL) ASDF:MISSING-COMPONENT : Component "iolib/common-lisp" not found
(LOAD iolib.base FAIL) ASDF:MISSING-COMPONENT : Component "iolib/base" not found
(LOAD iolib.asdf FAIL) ASDF:MISSING-COMPONENT : Component "iolib/asdf" not found
(LOAD iolib-tests FAIL) ASDF:LOAD-SYSTEM-DEFINITION-ERROR : Error while trying to load definition for system iolib from pathname /home/testgrid/cl-test-grid/work-dir/agent/quicklisp/dists/quicklisp/software/iolib-20150302-git/iolib.asd: You need ASDF >= 2.31.1 to load this system correctly.
(LOAD iolib-grovel FAIL) ASDF:MISSING-COMPONENT : Component "iolib/grovel" not found
(LOAD iolib FAIL) ASDF:LOAD-SYSTEM-DEFINITION-ERROR : Error while trying to load definition for system iolib from pathname /home/testgrid/cl-test-grid/work-dir/agent/quicklisp/dists/quicklisp/software/iolib-20150302-git/iolib.asd: You need ASDF >= 2.31.1 to load this system correctly.
cmu-snapshot-2013-04__20d_unicode_-linux-x86
(LOAD iolib.trivial-sockets FAIL) ASDF/FIND-SYSTEM:MISSING-COMPONENT : Component "iolib/trivial-sockets" not found
(LOAD iolib.syscalls FAIL) ASDF/FIND-SYSTEM:MISSING-COMPONENT : Component "iolib/syscalls" not found
(LOAD iolib.streams FAIL) ASDF/FIND-SYSTEM:MISSING-COMPONENT : Component "iolib/streams" not found
(LOAD iolib.sockets FAIL) ASDF/FIND-SYSTEM:MISSING-COMPONENT : Component "iolib/sockets" not found
(LOAD iolib.pathnames FAIL) ASDF/FIND-SYSTEM:MISSING-COMPONENT : Component "iolib/pathnames" not found
(LOAD iolib.os FAIL) ASDF/FIND-SYSTEM:MISSING-COMPONENT : Component "iolib/os" not found
(LOAD iolib.multiplex FAIL) ASDF/FIND-SYSTEM:MISSING-COMPONENT : Component "iolib/multiplex" not found
(LOAD iolib.conf FAIL) ASDF/FIND-SYSTEM:MISSING-COMPONENT : Component "iolib/conf" not found
(LOAD iolib.common-lisp FAIL) ASDF/FIND-SYSTEM:MISSING-COMPONENT : Component "iolib/common-lisp" not found
(LOAD iolib.base FAIL) ASDF/FIND-SYSTEM:MISSING-COMPONENT : Component "iolib/base" not found
(LOAD iolib.asdf FAIL) ASDF/FIND-SYSTEM:MISSING-COMPONENT : Component "iolib/asdf" not found
(LOAD iolib-grovel FAIL) ASDF/FIND-SYSTEM:MISSING-COMPONENT : Component "iolib/grovel" not found
(LOAD iolib.trivial-sockets FAIL) ASDF/FIND-SYSTEM:MISSING-COMPONENT : Component "iolib/trivial-sockets" not found
(LOAD iolib.syscalls FAIL) ASDF/FIND-SYSTEM:MISSING-COMPONENT : Component "iolib/syscalls" not found
(LOAD iolib.streams FAIL) ASDF/FIND-SYSTEM:MISSING-COMPONENT : Component "iolib/streams" not found
(LOAD iolib.sockets FAIL) ASDF/FIND-SYSTEM:MISSING-COMPONENT : Component "iolib/sockets" not found
(LOAD iolib.pathnames FAIL) ASDF/FIND-SYSTEM:MISSING-COMPONENT : Component "iolib/pathnames" not found
(LOAD iolib.os FAIL) ASDF/FIND-SYSTEM:MISSING-COMPONENT : Component "iolib/os" not found
(LOAD iolib.multiplex FAIL) ASDF/FIND-SYSTEM:MISSING-COMPONENT : Component "iolib/multiplex" not found
(LOAD iolib.conf FAIL) ASDF/FIND-SYSTEM:MISSING-COMPONENT : Component "iolib/conf" not found
(LOAD iolib.common-lisp FAIL) ASDF/FIND-SYSTEM:MISSING-COMPONENT : Component "iolib/common-lisp" not found
(LOAD iolib.base FAIL) ASDF/FIND-SYSTEM:MISSING-COMPONENT : Component "iolib/base" not found
(LOAD iolib.asdf FAIL) ASDF/FIND-SYSTEM:MISSING-COMPONENT : Component "iolib/asdf" not found
(LOAD iolib-grovel FAIL) ASDF/FIND-SYSTEM:MISSING-COMPONENT : Component "iolib/grovel" not found
cmu-snapshot-2014-01__20e_unicode_-linux-x86
cmu-snapshot-2014-05-dirty__20e_unicode_-linux-x86
cmu-snapshot-2014-12___20f_unicode_-linux-x86
ecl-13.5.1-76a84246-linux-x64-bytecode
(LOAD iolib.trivial-sockets FAIL) ASDF/FIND-SYSTEM:LOAD-SYSTEM-DEFINITION-ERROR : Error while trying to load definition for system iolib from pathname /home/hijarian/systems/cl-test-grid/work-dir/agent/quicklisp/dists/quicklisp/software/iolib-20150302-git/iolib.asd: The variable C::*CC-FLAGS* is unbound.
(LOAD iolib.syscalls FAIL) ASDF/FIND-SYSTEM:LOAD-SYSTEM-DEFINITION-ERROR : Error while trying to load definition for system iolib from pathname /home/hijarian/systems/cl-test-grid/work-dir/agent/quicklisp/dists/quicklisp/software/iolib-20150302-git/iolib.asd: The variable C::*CC-FLAGS* is unbound.
(LOAD iolib.streams FAIL) ASDF/FIND-SYSTEM:LOAD-SYSTEM-DEFINITION-ERROR : Error while trying to load definition for system iolib from pathname /home/hijarian/systems/cl-test-grid/work-dir/agent/quicklisp/dists/quicklisp/software/iolib-20150302-git/iolib.asd: The variable C::*CC-FLAGS* is unbound.
(LOAD iolib.sockets FAIL) ASDF/FIND-SYSTEM:LOAD-SYSTEM-DEFINITION-ERROR : Error while trying to load definition for system iolib from pathname /home/hijarian/systems/cl-test-grid/work-dir/agent/quicklisp/dists/quicklisp/software/iolib-20150302-git/iolib.asd: The variable C::*CC-FLAGS* is unbound.
(LOAD iolib.pathnames FAIL) ASDF/FIND-SYSTEM:LOAD-SYSTEM-DEFINITION-ERROR : Error while trying to load definition for system iolib from pathname /home/hijarian/systems/cl-test-grid/work-dir/agent/quicklisp/dists/quicklisp/software/iolib-20150302-git/iolib.asd: The variable C::*CC-FLAGS* is unbound.
(LOAD iolib.os FAIL) ASDF/FIND-SYSTEM:LOAD-SYSTEM-DEFINITION-ERROR : Error while trying to load definition for system iolib from pathname /home/hijarian/systems/cl-test-grid/work-dir/agent/quicklisp/dists/quicklisp/software/iolib-20150302-git/iolib.asd: The variable C::*CC-FLAGS* is unbound.
(LOAD iolib.multiplex FAIL) ASDF/FIND-SYSTEM:LOAD-SYSTEM-DEFINITION-ERROR : Error while trying to load definition for system iolib from pathname /home/hijarian/systems/cl-test-grid/work-dir/agent/quicklisp/dists/quicklisp/software/iolib-20150302-git/iolib.asd: The variable C::*CC-FLAGS* is unbound.
(LOAD iolib.examples FAIL) ASDF/FIND-SYSTEM:LOAD-SYSTEM-DEFINITION-ERROR : Error while trying to load definition for system iolib from pathname /home/hijarian/systems/cl-test-grid/work-dir/agent/quicklisp/dists/quicklisp/software/iolib-20150302-git/iolib.asd: The variable C::*CC-FLAGS* is unbound.
(LOAD iolib.conf FAIL) ASDF/FIND-SYSTEM:LOAD-SYSTEM-DEFINITION-ERROR : Error while trying to load definition for system iolib from pathname /home/hijarian/systems/cl-test-grid/work-dir/agent/quicklisp/dists/quicklisp/software/iolib-20150302-git/iolib.asd: The variable C::*CC-FLAGS* is unbound.
(LOAD iolib.common-lisp FAIL) ASDF/FIND-SYSTEM:LOAD-SYSTEM-DEFINITION-ERROR : Error while trying to load definition for system iolib from pathname /home/hijarian/systems/cl-test-grid/work-dir/agent/quicklisp/dists/quicklisp/software/iolib-20150302-git/iolib.asd: The variable C::*CC-FLAGS* is unbound.
(LOAD iolib.base FAIL) ASDF/FIND-SYSTEM:LOAD-SYSTEM-DEFINITION-ERROR : Error while trying to load definition for system iolib from pathname /home/hijarian/systems/cl-test-grid/work-dir/agent/quicklisp/dists/quicklisp/software/iolib-20150302-git/iolib.asd: The variable C::*CC-FLAGS* is unbound.
(LOAD iolib.asdf FAIL) ASDF/FIND-SYSTEM:LOAD-SYSTEM-DEFINITION-ERROR : Error while trying to load definition for system iolib from pathname /home/hijarian/systems/cl-test-grid/work-dir/agent/quicklisp/dists/quicklisp/software/iolib-20150302-git/iolib.asd: The variable C::*CC-FLAGS* is unbound.
(LOAD iolib-tests FAIL) ASDF/FIND-SYSTEM:LOAD-SYSTEM-DEFINITION-ERROR : Error while trying to load definition for system iolib from pathname /home/hijarian/systems/cl-test-grid/work-dir/agent/quicklisp/dists/quicklisp/software/iolib-20150302-git/iolib.asd: The variable C::*CC-FLAGS* is unbound.
(LOAD iolib-grovel FAIL) ASDF/FIND-SYSTEM:LOAD-SYSTEM-DEFINITION-ERROR : Error while trying to load definition for system iolib from pathname /home/hijarian/systems/cl-test-grid/work-dir/agent/quicklisp/dists/quicklisp/software/iolib-20150302-git/iolib.asd: The variable C::*CC-FLAGS* is unbound.
(LOAD iolib FAIL) ASDF/FIND-SYSTEM:LOAD-SYSTEM-DEFINITION-ERROR : Error while trying to load definition for system iolib from pathname /home/hijarian/systems/cl-test-grid/work-dir/agent/quicklisp/dists/quicklisp/software/iolib-20150302-git/iolib.asd: The variable C::*CC-FLAGS* is unbound.
(LOAD iolib.trivial-sockets FAIL) ASDF/FIND-SYSTEM:LOAD-SYSTEM-DEFINITION-ERROR : Error while trying to load definition for system iolib from pathname /home/hijarian/systems/cl-test-grid/work-dir/agent/quicklisp/dists/quicklisp/software/iolib-20150302-git/iolib.asd: The variable C::*CC-FLAGS* is unbound.
(LOAD iolib.syscalls FAIL) ASDF/FIND-SYSTEM:LOAD-SYSTEM-DEFINITION-ERROR : Error while trying to load definition for system iolib from pathname /home/hijarian/systems/cl-test-grid/work-dir/agent/quicklisp/dists/quicklisp/software/iolib-20150302-git/iolib.asd: The variable C::*CC-FLAGS* is unbound.
(LOAD iolib.streams FAIL) ASDF/FIND-SYSTEM:LOAD-SYSTEM-DEFINITION-ERROR : Error while trying to load definition for system iolib from pathname /home/hijarian/systems/cl-test-grid/work-dir/agent/quicklisp/dists/quicklisp/software/iolib-20150302-git/iolib.asd: The variable C::*CC-FLAGS* is unbound.
(LOAD iolib.sockets FAIL) ASDF/FIND-SYSTEM:LOAD-SYSTEM-DEFINITION-ERROR : Error while trying to load definition for system iolib from pathname /home/hijarian/systems/cl-test-grid/work-dir/agent/quicklisp/dists/quicklisp/software/iolib-20150302-git/iolib.asd: The variable C::*CC-FLAGS* is unbound.
(LOAD iolib.pathnames FAIL) ASDF/FIND-SYSTEM:LOAD-SYSTEM-DEFINITION-ERROR : Error while trying to load definition for system iolib from pathname /home/hijarian/systems/cl-test-grid/work-dir/agent/quicklisp/dists/quicklisp/software/iolib-20150302-git/iolib.asd: The variable C::*CC-FLAGS* is unbound.
(LOAD iolib.os FAIL) ASDF/FIND-SYSTEM:LOAD-SYSTEM-DEFINITION-ERROR : Error while trying to load definition for system iolib from pathname /home/hijarian/systems/cl-test-grid/work-dir/agent/quicklisp/dists/quicklisp/software/iolib-20150302-git/iolib.asd: The variable C::*CC-FLAGS* is unbound.
(LOAD iolib.multiplex FAIL) ASDF/FIND-SYSTEM:LOAD-SYSTEM-DEFINITION-ERROR : Error while trying to load definition for system iolib from pathname /home/hijarian/systems/cl-test-grid/work-dir/agent/quicklisp/dists/quicklisp/software/iolib-20150302-git/iolib.asd: The variable C::*CC-FLAGS* is unbound.
(LOAD iolib.examples FAIL) ASDF/FIND-SYSTEM:LOAD-SYSTEM-DEFINITION-ERROR : Error while trying to load definition for system iolib from pathname /home/hijarian/systems/cl-test-grid/work-dir/agent/quicklisp/dists/quicklisp/software/iolib-20150302-git/iolib.asd: The variable C::*CC-FLAGS* is unbound.
(LOAD iolib.conf FAIL) ASDF/FIND-SYSTEM:LOAD-SYSTEM-DEFINITION-ERROR : Error while trying to load definition for system iolib from pathname /home/hijarian/systems/cl-test-grid/work-dir/agent/quicklisp/dists/quicklisp/software/iolib-20150302-git/iolib.asd: The variable C::*CC-FLAGS* is unbound.
(LOAD iolib.common-lisp FAIL) ASDF/FIND-SYSTEM:LOAD-SYSTEM-DEFINITION-ERROR : Error while trying to load definition for system iolib from pathname /home/hijarian/systems/cl-test-grid/work-dir/agent/quicklisp/dists/quicklisp/software/iolib-20150302-git/iolib.asd: The variable C::*CC-FLAGS* is unbound.
(LOAD iolib.base FAIL) ASDF/FIND-SYSTEM:LOAD-SYSTEM-DEFINITION-ERROR : Error while trying to load definition for system iolib from pathname /home/hijarian/systems/cl-test-grid/work-dir/agent/quicklisp/dists/quicklisp/software/iolib-20150302-git/iolib.asd: The variable C::*CC-FLAGS* is unbound.
(LOAD iolib.asdf FAIL) ASDF/FIND-SYSTEM:LOAD-SYSTEM-DEFINITION-ERROR : Error while trying to load definition for system iolib from pathname /home/hijarian/systems/cl-test-grid/work-dir/agent/quicklisp/dists/quicklisp/software/iolib-20150302-git/iolib.asd: The variable C::*CC-FLAGS* is unbound.
(LOAD iolib-tests FAIL) ASDF/FIND-SYSTEM:LOAD-SYSTEM-DEFINITION-ERROR : Error while trying to load definition for system iolib from pathname /home/hijarian/systems/cl-test-grid/work-dir/agent/quicklisp/dists/quicklisp/software/iolib-20150302-git/iolib.asd: The variable C::*CC-FLAGS* is unbound.
(LOAD iolib-grovel FAIL) ASDF/FIND-SYSTEM:LOAD-SYSTEM-DEFINITION-ERROR : Error while trying to load definition for system iolib from pathname /home/hijarian/systems/cl-test-grid/work-dir/agent/quicklisp/dists/quicklisp/software/iolib-20150302-git/iolib.asd: The variable C::*CC-FLAGS* is unbound.
(LOAD iolib FAIL) ASDF/FIND-SYSTEM:LOAD-SYSTEM-DEFINITION-ERROR : Error while trying to load definition for system iolib from pathname /home/hijarian/systems/cl-test-grid/work-dir/agent/quicklisp/dists/quicklisp/software/iolib-20150302-git/iolib.asd: The variable C::*CC-FLAGS* is unbound.
ecl-13.5.1-76a84246-linux-x64-lisp-to-c
(LOAD iolib.trivial-sockets FAIL) COMMON-LISP:SIMPLE-ERROR : External process exited with code 1. Command was: "g++" "-m64" "-Wno-write-strings" " -D_GNU_SOURCE -D_FILE_OFFSET_BITS=64 -g -O2 -fPIC -D_THREAD_SAFE -Dlinux" "-I/home/hijarian/systems/cl-test-grid/work-dir/agent/quicklisp/dists/quicklisp/software/iolib-20150302-git/src/grovel/" "-o" "/home/hijarian/systems/cl-test-grid/work-dir/agent/test-runs/20150409051151-ecl-13.5.1-76a84246-linux-x64-lisp-to-c/fasl/ql/dists/quicklisp/software/iolib-20150302-git/src/syscalls/ffi-types-unix" "/home/hijarian/systems/cl-test-grid/work-dir/agent/test-runs/20150409051151-ecl-13.5.1-76a84246-linux-x64-lisp-to-c/fasl/ql/dists/quicklisp/software/iolib-20150302-git/src/syscalls/ffi-types-unix.c" Output was: <see above>
(LOAD iolib.syscalls FAIL) COMMON-LISP:SIMPLE-ERROR : External process exited with code 1. Command was: "g++" "-m64" "-Wno-write-strings" " -D_GNU_SOURCE -D_FILE_OFFSET_BITS=64 -g -O2 -fPIC -D_THREAD_SAFE -Dlinux" "-I/home/hijarian/systems/cl-test-grid/work-dir/agent/quicklisp/dists/quicklisp/software/iolib-20150302-git/src/grovel/" "-o" "/home/hijarian/systems/cl-test-grid/work-dir/agent/test-runs/20150409051151-ecl-13.5.1-76a84246-linux-x64-lisp-to-c/fasl/ql/dists/quicklisp/software/iolib-20150302-git/src/syscalls/ffi-types-unix" "/home/hijarian/systems/cl-test-grid/work-dir/agent/test-runs/20150409051151-ecl-13.5.1-76a84246-linux-x64-lisp-to-c/fasl/ql/dists/quicklisp/software/iolib-20150302-git/src/syscalls/ffi-types-unix.c" Output was: <see above>
(LOAD iolib.streams FAIL) COMMON-LISP:SIMPLE-ERROR : External process exited with code 1. Command was: "g++" "-m64" "-Wno-write-strings" " -D_GNU_SOURCE -D_FILE_OFFSET_BITS=64 -g -O2 -fPIC -D_THREAD_SAFE -Dlinux" "-I/home/hijarian/systems/cl-test-grid/work-dir/agent/quicklisp/dists/quicklisp/software/iolib-20150302-git/src/grovel/" "-o" "/home/hijarian/systems/cl-test-grid/work-dir/agent/test-runs/20150409051151-ecl-13.5.1-76a84246-linux-x64-lisp-to-c/fasl/ql/dists/quicklisp/software/iolib-20150302-git/src/syscalls/ffi-types-unix" "/home/hijarian/systems/cl-test-grid/work-dir/agent/test-runs/20150409051151-ecl-13.5.1-76a84246-linux-x64-lisp-to-c/fasl/ql/dists/quicklisp/software/iolib-20150302-git/src/syscalls/ffi-types-unix.c" Output was: <see above>
(LOAD iolib.sockets FAIL) COMMON-LISP:SIMPLE-ERROR : External process exited with code 1. Command was: "g++" "-m64" "-Wno-write-strings" " -D_GNU_SOURCE -D_FILE_OFFSET_BITS=64 -g -O2 -fPIC -D_THREAD_SAFE -Dlinux" "-I/home/hijarian/systems/cl-test-grid/work-dir/agent/quicklisp/dists/quicklisp/software/iolib-20150302-git/src/grovel/" "-o" "/home/hijarian/systems/cl-test-grid/work-dir/agent/test-runs/20150409051151-ecl-13.5.1-76a84246-linux-x64-lisp-to-c/fasl/ql/dists/quicklisp/software/iolib-20150302-git/src/syscalls/ffi-types-unix" "/home/hijarian/systems/cl-test-grid/work-dir/agent/test-runs/20150409051151-ecl-13.5.1-76a84246-linux-x64-lisp-to-c/fasl/ql/dists/quicklisp/software/iolib-20150302-git/src/syscalls/ffi-types-unix.c" Output was: <see above>
(LOAD iolib.pathnames FAIL) COMMON-LISP:SIMPLE-ERROR : External process exited with code 1. Command was: "g++" "-m64" "-Wno-write-strings" " -D_GNU_SOURCE -D_FILE_OFFSET_BITS=64 -g -O2 -fPIC -D_THREAD_SAFE -Dlinux" "-I/home/hijarian/systems/cl-test-grid/work-dir/agent/quicklisp/dists/quicklisp/software/iolib-20150302-git/src/grovel/" "-o" "/home/hijarian/systems/cl-test-grid/work-dir/agent/test-runs/20150409051151-ecl-13.5.1-76a84246-linux-x64-lisp-to-c/fasl/ql/dists/quicklisp/software/iolib-20150302-git/src/syscalls/ffi-types-unix" "/home/hijarian/systems/cl-test-grid/work-dir/agent/test-runs/20150409051151-ecl-13.5.1-76a84246-linux-x64-lisp-to-c/fasl/ql/dists/quicklisp/software/iolib-20150302-git/src/syscalls/ffi-types-unix.c" Output was: <see above>
(LOAD iolib.os FAIL) COMMON-LISP:SIMPLE-ERROR : External process exited with code 1. Command was: "g++" "-m64" "-Wno-write-strings" " -D_GNU_SOURCE -D_FILE_OFFSET_BITS=64 -g -O2 -fPIC -D_THREAD_SAFE -Dlinux" "-I/home/hijarian/systems/cl-test-grid/work-dir/agent/quicklisp/dists/quicklisp/software/iolib-20150302-git/src/grovel/" "-o" "/home/hijarian/systems/cl-test-grid/work-dir/agent/test-runs/20150409051151-ecl-13.5.1-76a84246-linux-x64-lisp-to-c/fasl/ql/dists/quicklisp/software/iolib-20150302-git/src/syscalls/ffi-types-unix" "/home/hijarian/systems/cl-test-grid/work-dir/agent/test-runs/20150409051151-ecl-13.5.1-76a84246-linux-x64-lisp-to-c/fasl/ql/dists/quicklisp/software/iolib-20150302-git/src/syscalls/ffi-types-unix.c" Output was: <see above>
(LOAD iolib.multiplex FAIL) COMMON-LISP:SIMPLE-ERROR : External process exited with code 1. Command was: "g++" "-m64" "-Wno-write-strings" " -D_GNU_SOURCE -D_FILE_OFFSET_BITS=64 -g -O2 -fPIC -D_THREAD_SAFE -Dlinux" "-I/home/hijarian/systems/cl-test-grid/work-dir/agent/quicklisp/dists/quicklisp/software/iolib-20150302-git/src/grovel/" "-o" "/home/hijarian/systems/cl-test-grid/work-dir/agent/test-runs/20150409051151-ecl-13.5.1-76a84246-linux-x64-lisp-to-c/fasl/ql/dists/quicklisp/software/iolib-20150302-git/src/syscalls/ffi-types-unix" "/home/hijarian/systems/cl-test-grid/work-dir/agent/test-runs/20150409051151-ecl-13.5.1-76a84246-linux-x64-lisp-to-c/fasl/ql/dists/quicklisp/software/iolib-20150302-git/src/syscalls/ffi-types-unix.c" Output was: <see above>
(LOAD iolib.examples FAIL) COMMON-LISP:SIMPLE-ERROR : External process exited with code 1. Command was: "g++" "-m64" "-Wno-write-strings" " -D_GNU_SOURCE -D_FILE_OFFSET_BITS=64 -g -O2 -fPIC -D_THREAD_SAFE -Dlinux" "-I/home/hijarian/systems/cl-test-grid/work-dir/agent/quicklisp/dists/quicklisp/software/iolib-20150302-git/src/grovel/" "-o" "/home/hijarian/systems/cl-test-grid/work-dir/agent/test-runs/20150409051151-ecl-13.5.1-76a84246-linux-x64-lisp-to-c/fasl/ql/dists/quicklisp/software/iolib-20150302-git/src/syscalls/ffi-types-unix" "/home/hijarian/systems/cl-test-grid/work-dir/agent/test-runs/20150409051151-ecl-13.5.1-76a84246-linux-x64-lisp-to-c/fasl/ql/dists/quicklisp/software/iolib-20150302-git/src/syscalls/ffi-types-unix.c" Output was: <see above>
(LOAD iolib-tests FAIL) COMMON-LISP:SIMPLE-ERROR : External process exited with code 1. Command was: "g++" "-m64" "-Wno-write-strings" " -D_GNU_SOURCE -D_FILE_OFFSET_BITS=64 -g -O2 -fPIC -D_THREAD_SAFE -Dlinux" "-I/home/hijarian/systems/cl-test-grid/work-dir/agent/quicklisp/dists/quicklisp/software/iolib-20150302-git/src/grovel/" "-o" "/home/hijarian/systems/cl-test-grid/work-dir/agent/test-runs/20150409051151-ecl-13.5.1-76a84246-linux-x64-lisp-to-c/fasl/ql/dists/quicklisp/software/iolib-20150302-git/src/syscalls/ffi-types-unix" "/home/hijarian/systems/cl-test-grid/work-dir/agent/test-runs/20150409051151-ecl-13.5.1-76a84246-linux-x64-lisp-to-c/fasl/ql/dists/quicklisp/software/iolib-20150302-git/src/syscalls/ffi-types-unix.c" Output was: <see above>
(LOAD iolib FAIL) COMMON-LISP:SIMPLE-ERROR : External process exited with code 1. Command was: "g++" "-m64" "-Wno-write-strings" " -D_GNU_SOURCE -D_FILE_OFFSET_BITS=64 -g -O2 -fPIC -D_THREAD_SAFE -Dlinux" "-I/home/hijarian/systems/cl-test-grid/work-dir/agent/quicklisp/dists/quicklisp/software/iolib-20150302-git/src/grovel/" "-o" "/home/hijarian/systems/cl-test-grid/work-dir/agent/test-runs/20150409051151-ecl-13.5.1-76a84246-linux-x64-lisp-to-c/fasl/ql/dists/quicklisp/software/iolib-20150302-git/src/syscalls/ffi-types-unix" "/home/hijarian/systems/cl-test-grid/work-dir/agent/test-runs/20150409051151-ecl-13.5.1-76a84246-linux-x64-lisp-to-c/fasl/ql/dists/quicklisp/software/iolib-20150302-git/src/syscalls/ffi-types-unix.c" Output was: <see above>
(LOAD iolib.trivial-sockets FAIL) COMMON-LISP:SIMPLE-ERROR : External process exited with code 1. Command was: "g++" "-m64" "-Wno-write-strings" " -D_GNU_SOURCE -D_FILE_OFFSET_BITS=64 -g -O2 -fPIC -D_THREAD_SAFE -Dlinux" "-I/home/hijarian/systems/cl-test-grid/work-dir/agent/quicklisp/dists/quicklisp/software/iolib-20150302-git/src/grovel/" "-o" "/home/hijarian/systems/cl-test-grid/work-dir/agent/test-runs/20150303152413-ecl-13.5.1-76a84246-linux-x64-lisp-to-c/fasl/ql/dists/quicklisp/software/iolib-20150302-git/src/syscalls/ffi-types-unix" "/home/hijarian/systems/cl-test-grid/work-dir/agent/test-runs/20150303152413-ecl-13.5.1-76a84246-linux-x64-lisp-to-c/fasl/ql/dists/quicklisp/software/iolib-20150302-git/src/syscalls/ffi-types-unix.c" Output was: <see above>
(LOAD iolib.syscalls FAIL) COMMON-LISP:SIMPLE-ERROR : External process exited with code 1. Command was: "g++" "-m64" "-Wno-write-strings" " -D_GNU_SOURCE -D_FILE_OFFSET_BITS=64 -g -O2 -fPIC -D_THREAD_SAFE -Dlinux" "-I/home/hijarian/systems/cl-test-grid/work-dir/agent/quicklisp/dists/quicklisp/software/iolib-20150302-git/src/grovel/" "-o" "/home/hijarian/systems/cl-test-grid/work-dir/agent/test-runs/20150303152413-ecl-13.5.1-76a84246-linux-x64-lisp-to-c/fasl/ql/dists/quicklisp/software/iolib-20150302-git/src/syscalls/ffi-types-unix" "/home/hijarian/systems/cl-test-grid/work-dir/agent/test-runs/20150303152413-ecl-13.5.1-76a84246-linux-x64-lisp-to-c/fasl/ql/dists/quicklisp/software/iolib-20150302-git/src/syscalls/ffi-types-unix.c" Output was: <see above>
(LOAD iolib.streams FAIL) COMMON-LISP:SIMPLE-ERROR : External process exited with code 1. Command was: "g++" "-m64" "-Wno-write-strings" " -D_GNU_SOURCE -D_FILE_OFFSET_BITS=64 -g -O2 -fPIC -D_THREAD_SAFE -Dlinux" "-I/home/hijarian/systems/cl-test-grid/work-dir/agent/quicklisp/dists/quicklisp/software/iolib-20150302-git/src/grovel/" "-o" "/home/hijarian/systems/cl-test-grid/work-dir/agent/test-runs/20150303152413-ecl-13.5.1-76a84246-linux-x64-lisp-to-c/fasl/ql/dists/quicklisp/software/iolib-20150302-git/src/syscalls/ffi-types-unix" "/home/hijarian/systems/cl-test-grid/work-dir/agent/test-runs/20150303152413-ecl-13.5.1-76a84246-linux-x64-lisp-to-c/fasl/ql/dists/quicklisp/software/iolib-20150302-git/src/syscalls/ffi-types-unix.c" Output was: <see above>
(LOAD iolib.sockets FAIL) COMMON-LISP:SIMPLE-ERROR : External process exited with code 1. Command was: "g++" "-m64" "-Wno-write-strings" " -D_GNU_SOURCE -D_FILE_OFFSET_BITS=64 -g -O2 -fPIC -D_THREAD_SAFE -Dlinux" "-I/home/hijarian/systems/cl-test-grid/work-dir/agent/quicklisp/dists/quicklisp/software/iolib-20150302-git/src/grovel/" "-o" "/home/hijarian/systems/cl-test-grid/work-dir/agent/test-runs/20150303152413-ecl-13.5.1-76a84246-linux-x64-lisp-to-c/fasl/ql/dists/quicklisp/software/iolib-20150302-git/src/syscalls/ffi-types-unix" "/home/hijarian/systems/cl-test-grid/work-dir/agent/test-runs/20150303152413-ecl-13.5.1-76a84246-linux-x64-lisp-to-c/fasl/ql/dists/quicklisp/software/iolib-20150302-git/src/syscalls/ffi-types-unix.c" Output was: <see above>
(LOAD iolib.pathnames FAIL) COMMON-LISP:SIMPLE-ERROR : External process exited with code 1. Command was: "g++" "-m64" "-Wno-write-strings" " -D_GNU_SOURCE -D_FILE_OFFSET_BITS=64 -g -O2 -fPIC -D_THREAD_SAFE -Dlinux" "-I/home/hijarian/systems/cl-test-grid/work-dir/agent/quicklisp/dists/quicklisp/software/iolib-20150302-git/src/grovel/" "-o" "/home/hijarian/systems/cl-test-grid/work-dir/agent/test-runs/20150303152413-ecl-13.5.1-76a84246-linux-x64-lisp-to-c/fasl/ql/dists/quicklisp/software/iolib-20150302-git/src/syscalls/ffi-types-unix" "/home/hijarian/systems/cl-test-grid/work-dir/agent/test-runs/20150303152413-ecl-13.5.1-76a84246-linux-x64-lisp-to-c/fasl/ql/dists/quicklisp/software/iolib-20150302-git/src/syscalls/ffi-types-unix.c" Output was: <see above>
(LOAD iolib.os FAIL) COMMON-LISP:SIMPLE-ERROR : External process exited with code 1. Command was: "g++" "-m64" "-Wno-write-strings" " -D_GNU_SOURCE -D_FILE_OFFSET_BITS=64 -g -O2 -fPIC -D_THREAD_SAFE -Dlinux" "-I/home/hijarian/systems/cl-test-grid/work-dir/agent/quicklisp/dists/quicklisp/software/iolib-20150302-git/src/grovel/" "-o" "/home/hijarian/systems/cl-test-grid/work-dir/agent/test-runs/20150303152413-ecl-13.5.1-76a84246-linux-x64-lisp-to-c/fasl/ql/dists/quicklisp/software/iolib-20150302-git/src/syscalls/ffi-types-unix" "/home/hijarian/systems/cl-test-grid/work-dir/agent/test-runs/20150303152413-ecl-13.5.1-76a84246-linux-x64-lisp-to-c/fasl/ql/dists/quicklisp/software/iolib-20150302-git/src/syscalls/ffi-types-unix.c" Output was: <see above>
(LOAD iolib.multiplex FAIL) COMMON-LISP:SIMPLE-ERROR : External process exited with code 1. Command was: "g++" "-m64" "-Wno-write-strings" " -D_GNU_SOURCE -D_FILE_OFFSET_BITS=64 -g -O2 -fPIC -D_THREAD_SAFE -Dlinux" "-I/home/hijarian/systems/cl-test-grid/work-dir/agent/quicklisp/dists/quicklisp/software/iolib-20150302-git/src/grovel/" "-o" "/home/hijarian/systems/cl-test-grid/work-dir/agent/test-runs/20150303152413-ecl-13.5.1-76a84246-linux-x64-lisp-to-c/fasl/ql/dists/quicklisp/software/iolib-20150302-git/src/syscalls/ffi-types-unix" "/home/hijarian/systems/cl-test-grid/work-dir/agent/test-runs/20150303152413-ecl-13.5.1-76a84246-linux-x64-lisp-to-c/fasl/ql/dists/quicklisp/software/iolib-20150302-git/src/syscalls/ffi-types-unix.c" Output was: <see above>
(LOAD iolib.examples FAIL) COMMON-LISP:SIMPLE-ERROR : External process exited with code 1. Command was: "g++" "-m64" "-Wno-write-strings" " -D_GNU_SOURCE -D_FILE_OFFSET_BITS=64 -g -O2 -fPIC -D_THREAD_SAFE -Dlinux" "-I/home/hijarian/systems/cl-test-grid/work-dir/agent/quicklisp/dists/quicklisp/software/iolib-20150302-git/src/grovel/" "-o" "/home/hijarian/systems/cl-test-grid/work-dir/agent/test-runs/20150303152413-ecl-13.5.1-76a84246-linux-x64-lisp-to-c/fasl/ql/dists/quicklisp/software/iolib-20150302-git/src/syscalls/ffi-types-unix" "/home/hijarian/systems/cl-test-grid/work-dir/agent/test-runs/20150303152413-ecl-13.5.1-76a84246-linux-x64-lisp-to-c/fasl/ql/dists/quicklisp/software/iolib-20150302-git/src/syscalls/ffi-types-unix.c" Output was: <see above>
(LOAD iolib-tests FAIL) COMMON-LISP:SIMPLE-ERROR : External process exited with code 1. Command was: "g++" "-m64" "-Wno-write-strings" " -D_GNU_SOURCE -D_FILE_OFFSET_BITS=64 -g -O2 -fPIC -D_THREAD_SAFE -Dlinux" "-I/home/hijarian/systems/cl-test-grid/work-dir/agent/quicklisp/dists/quicklisp/software/iolib-20150302-git/src/grovel/" "-o" "/home/hijarian/systems/cl-test-grid/work-dir/agent/test-runs/20150303152413-ecl-13.5.1-76a84246-linux-x64-lisp-to-c/fasl/ql/dists/quicklisp/software/iolib-20150302-git/src/syscalls/ffi-types-unix" "/home/hijarian/systems/cl-test-grid/work-dir/agent/test-runs/20150303152413-ecl-13.5.1-76a84246-linux-x64-lisp-to-c/fasl/ql/dists/quicklisp/software/iolib-20150302-git/src/syscalls/ffi-types-unix.c" Output was: <see above>
(LOAD iolib FAIL) COMMON-LISP:SIMPLE-ERROR : External process exited with code 1. Command was: "g++" "-m64" "-Wno-write-strings" " -D_GNU_SOURCE -D_FILE_OFFSET_BITS=64 -g -O2 -fPIC -D_THREAD_SAFE -Dlinux" "-I/home/hijarian/systems/cl-test-grid/work-dir/agent/quicklisp/dists/quicklisp/software/iolib-20150302-git/src/grovel/" "-o" "/home/hijarian/systems/cl-test-grid/work-dir/agent/test-runs/20150303152413-ecl-13.5.1-76a84246-linux-x64-lisp-to-c/fasl/ql/dists/quicklisp/software/iolib-20150302-git/src/syscalls/ffi-types-unix" "/home/hijarian/systems/cl-test-grid/work-dir/agent/test-runs/20150303152413-ecl-13.5.1-76a84246-linux-x64-lisp-to-c/fasl/ql/dists/quicklisp/software/iolib-20150302-git/src/syscalls/ffi-types-unix.c" Output was: <see above>
ecl-13.5.1-unknown-linux-i686-bytecode
(LOAD iolib.trivial-sockets FAIL) ASDF/FIND-SYSTEM:MISSING-COMPONENT : Component "iolib/trivial-sockets" not found
(LOAD iolib.syscalls FAIL) ASDF/FIND-SYSTEM:MISSING-COMPONENT : Component "iolib/syscalls" not found
(LOAD iolib.streams FAIL) ASDF/FIND-SYSTEM:MISSING-COMPONENT : Component "iolib/streams" not found
(LOAD iolib.sockets FAIL) ASDF/FIND-SYSTEM:MISSING-COMPONENT : Component "iolib/sockets" not found
(LOAD iolib.pathnames FAIL) ASDF/FIND-SYSTEM:MISSING-COMPONENT : Component "iolib/pathnames" not found
(LOAD iolib.os FAIL) ASDF/FIND-SYSTEM:MISSING-COMPONENT : Component "iolib/os" not found
(LOAD iolib.multiplex FAIL) ASDF/FIND-SYSTEM:MISSING-COMPONENT : Component "iolib/multiplex" not found
(LOAD iolib.examples FAIL) ASDF/FIND-SYSTEM:LOAD-SYSTEM-DEFINITION-ERROR : Error while trying to load definition for system iolib from pathname /home/testgrid/cl-test-grid/work-dir/agent/quicklisp/dists/quicklisp/software/iolib-20150302-git/iolib.asd: The variable C::*CC-FLAGS* is unbound.
(LOAD iolib.conf FAIL) ASDF/FIND-SYSTEM:MISSING-COMPONENT : Component "iolib/conf" not found
(LOAD iolib.common-lisp FAIL) ASDF/FIND-SYSTEM:MISSING-COMPONENT : Component "iolib/common-lisp" not found
(LOAD iolib.base FAIL) ASDF/FIND-SYSTEM:MISSING-COMPONENT : Component "iolib/base" not found
(LOAD iolib.asdf FAIL) ASDF/FIND-SYSTEM:MISSING-COMPONENT : Component "iolib/asdf" not found
(LOAD iolib-tests FAIL) ASDF/FIND-SYSTEM:LOAD-SYSTEM-DEFINITION-ERROR : Error while trying to load definition for system iolib from pathname /home/testgrid/cl-test-grid/work-dir/agent/quicklisp/dists/quicklisp/software/iolib-20150302-git/iolib.asd: The variable C::*CC-FLAGS* is unbound.
(LOAD iolib-grovel FAIL) ASDF/FIND-SYSTEM:MISSING-COMPONENT : Component "iolib/grovel" not found
(LOAD iolib FAIL) ASDF/FIND-SYSTEM:LOAD-SYSTEM-DEFINITION-ERROR : Error while trying to load definition for system iolib from pathname /home/testgrid/cl-test-grid/work-dir/agent/quicklisp/dists/quicklisp/software/iolib-20150302-git/iolib.asd: The variable C::*CC-FLAGS* is unbound.
(LOAD iolib.trivial-sockets FAIL) ASDF/FIND-SYSTEM:MISSING-COMPONENT : Component "iolib/trivial-sockets" not found
(LOAD iolib.syscalls FAIL) ASDF/FIND-SYSTEM:MISSING-COMPONENT : Component "iolib/syscalls" not found
(LOAD iolib.streams FAIL) ASDF/FIND-SYSTEM:MISSING-COMPONENT : Component "iolib/streams" not found
(LOAD iolib.sockets FAIL) ASDF/FIND-SYSTEM:MISSING-COMPONENT : Component "iolib/sockets" not found
(LOAD iolib.pathnames FAIL) ASDF/FIND-SYSTEM:MISSING-COMPONENT : Component "iolib/pathnames" not found
(LOAD iolib.os FAIL) ASDF/FIND-SYSTEM:MISSING-COMPONENT : Component "iolib/os" not found
(LOAD iolib.multiplex FAIL) ASDF/FIND-SYSTEM:MISSING-COMPONENT : Component "iolib/multiplex" not found
(LOAD iolib.examples FAIL) ASDF/FIND-SYSTEM:LOAD-SYSTEM-DEFINITION-ERROR : Error while trying to load definition for system iolib from pathname /home/testgrid/cl-test-grid/work-dir/agent/quicklisp/dists/quicklisp/software/iolib-20150302-git/iolib.asd: The variable C::*CC-FLAGS* is unbound.
(LOAD iolib.conf FAIL) ASDF/FIND-SYSTEM:MISSING-COMPONENT : Component "iolib/conf" not found
(LOAD iolib.common-lisp FAIL) ASDF/FIND-SYSTEM:MISSING-COMPONENT : Component "iolib/common-lisp" not found
(LOAD iolib.base FAIL) ASDF/FIND-SYSTEM:MISSING-COMPONENT : Component "iolib/base" not found
(LOAD iolib.asdf FAIL) ASDF/FIND-SYSTEM:MISSING-COMPONENT : Component "iolib/asdf" not found
(LOAD iolib-tests FAIL) ASDF/FIND-SYSTEM:LOAD-SYSTEM-DEFINITION-ERROR : Error while trying to load definition for system iolib from pathname /home/testgrid/cl-test-grid/work-dir/agent/quicklisp/dists/quicklisp/software/iolib-20150302-git/iolib.asd: The variable C::*CC-FLAGS* is unbound.
(LOAD iolib-grovel FAIL) ASDF/FIND-SYSTEM:MISSING-COMPONENT : Component "iolib/grovel" not found
(LOAD iolib FAIL) ASDF/FIND-SYSTEM:LOAD-SYSTEM-DEFINITION-ERROR : Error while trying to load definition for system iolib from pathname /home/testgrid/cl-test-grid/work-dir/agent/quicklisp/dists/quicklisp/software/iolib-20150302-git/iolib.asd: The variable C::*CC-FLAGS* is unbound.
ecl-13.5.1-unknown-linux-i686-lisp-to-c
(LOAD iolib.trivial-sockets FAIL) ASDF/FIND-SYSTEM:MISSING-COMPONENT : Component "iolib/trivial-sockets" not found
(LOAD iolib.syscalls FAIL) ASDF/FIND-SYSTEM:MISSING-COMPONENT : Component "iolib/syscalls" not found
(LOAD iolib.streams FAIL) ASDF/FIND-SYSTEM:MISSING-COMPONENT : Component "iolib/streams" not found
(LOAD iolib.sockets FAIL) ASDF/FIND-SYSTEM:MISSING-COMPONENT : Component "iolib/sockets" not found
(LOAD iolib.pathnames FAIL) ASDF/FIND-SYSTEM:MISSING-COMPONENT : Component "iolib/pathnames" not found
(LOAD iolib.os FAIL) ASDF/FIND-SYSTEM:MISSING-COMPONENT : Component "iolib/os" not found
(LOAD iolib.multiplex FAIL) ASDF/FIND-SYSTEM:MISSING-COMPONENT : Component "iolib/multiplex" not found
(LOAD iolib.examples FAIL) COMMON-LISP:SIMPLE-ERROR : %CLOSE-FOREIGN-LIBRARY unimplemented.
(LOAD iolib.conf FAIL) ASDF/FIND-SYSTEM:MISSING-COMPONENT : Component "iolib/conf" not found
(LOAD iolib.common-lisp FAIL) ASDF/FIND-SYSTEM:MISSING-COMPONENT : Component "iolib/common-lisp" not found
(LOAD iolib.base FAIL) ASDF/FIND-SYSTEM:MISSING-COMPONENT : Component "iolib/base" not found
(LOAD iolib.asdf FAIL) ASDF/FIND-SYSTEM:MISSING-COMPONENT : Component "iolib/asdf" not found
(LOAD iolib-tests FAIL) COMMON-LISP:SIMPLE-ERROR : %CLOSE-FOREIGN-LIBRARY unimplemented.
(LOAD iolib-grovel FAIL) ASDF/FIND-SYSTEM:MISSING-COMPONENT : Component "iolib/grovel" not found
(LOAD iolib FAIL) COMMON-LISP:SIMPLE-ERROR : %CLOSE-FOREIGN-LIBRARY unimplemented.
(LOAD iolib.trivial-sockets FAIL) ASDF/FIND-SYSTEM:MISSING-COMPONENT : Component "iolib/trivial-sockets" not found
(LOAD iolib.syscalls FAIL) ASDF/FIND-SYSTEM:MISSING-COMPONENT : Component "iolib/syscalls" not found
(LOAD iolib.streams FAIL) ASDF/FIND-SYSTEM:MISSING-COMPONENT : Component "iolib/streams" not found
(LOAD iolib.sockets FAIL) ASDF/FIND-SYSTEM:MISSING-COMPONENT : Component "iolib/sockets" not found
(LOAD iolib.pathnames FAIL) ASDF/FIND-SYSTEM:MISSING-COMPONENT : Component "iolib/pathnames" not found
(LOAD iolib.os FAIL) ASDF/FIND-SYSTEM:MISSING-COMPONENT : Component "iolib/os" not found
(LOAD iolib.multiplex FAIL) ASDF/FIND-SYSTEM:MISSING-COMPONENT : Component "iolib/multiplex" not found
(LOAD iolib.examples FAIL) COMMON-LISP:SIMPLE-ERROR : %CLOSE-FOREIGN-LIBRARY unimplemented.
(LOAD iolib.conf FAIL) ASDF/FIND-SYSTEM:MISSING-COMPONENT : Component "iolib/conf" not found
(LOAD iolib.common-lisp FAIL) ASDF/FIND-SYSTEM:MISSING-COMPONENT : Component "iolib/common-lisp" not found
(LOAD iolib.base FAIL) ASDF/FIND-SYSTEM:MISSING-COMPONENT : Component "iolib/base" not found
(LOAD iolib.asdf FAIL) ASDF/FIND-SYSTEM:MISSING-COMPONENT : Component "iolib/asdf" not found
(LOAD iolib-tests FAIL) COMMON-LISP:SIMPLE-ERROR : %CLOSE-FOREIGN-LIBRARY unimplemented.
(LOAD iolib-grovel FAIL) ASDF/FIND-SYSTEM:MISSING-COMPONENT : Component "iolib/grovel" not found
(LOAD iolib FAIL) COMMON-LISP:SIMPLE-ERROR : %CLOSE-FOREIGN-LIBRARY unimplemented.
ecl-15.2.21-ee989b97-linux-i686-bytecode
(LOAD iolib.trivial-sockets FAIL) ASDF/FIND-SYSTEM:LOAD-SYSTEM-DEFINITION-ERROR : Error while trying to load definition for system iolib from pathname /home/testgrid/cl-test-grid/work-dir/agent/quicklisp/dists/quicklisp/software/iolib-20150302-git/iolib.asd: The variable C::*CC-FLAGS* is unbound.
(LOAD iolib.syscalls FAIL) ASDF/FIND-SYSTEM:LOAD-SYSTEM-DEFINITION-ERROR : Error while trying to load definition for system iolib from pathname /home/testgrid/cl-test-grid/work-dir/agent/quicklisp/dists/quicklisp/software/iolib-20150302-git/iolib.asd: The variable C::*CC-FLAGS* is unbound.
(LOAD iolib.streams FAIL) ASDF/FIND-SYSTEM:LOAD-SYSTEM-DEFINITION-ERROR : Error while trying to load definition for system iolib from pathname /home/testgrid/cl-test-grid/work-dir/agent/quicklisp/dists/quicklisp/software/iolib-20150302-git/iolib.asd: The variable C::*CC-FLAGS* is unbound.
(LOAD iolib.sockets FAIL) ASDF/FIND-SYSTEM:LOAD-SYSTEM-DEFINITION-ERROR : Error while trying to load definition for system iolib from pathname /home/testgrid/cl-test-grid/work-dir/agent/quicklisp/dists/quicklisp/software/iolib-20150302-git/iolib.asd: The variable C::*CC-FLAGS* is unbound.
(LOAD iolib.pathnames FAIL) ASDF/FIND-SYSTEM:LOAD-SYSTEM-DEFINITION-ERROR : Error while trying to load definition for system iolib from pathname /home/testgrid/cl-test-grid/work-dir/agent/quicklisp/dists/quicklisp/software/iolib-20150302-git/iolib.asd: The variable C::*CC-FLAGS* is unbound.
(LOAD iolib.os FAIL) ASDF/FIND-SYSTEM:LOAD-SYSTEM-DEFINITION-ERROR : Error while trying to load definition for system iolib from pathname /home/testgrid/cl-test-grid/work-dir/agent/quicklisp/dists/quicklisp/software/iolib-20150302-git/iolib.asd: The variable C::*CC-FLAGS* is unbound.
(LOAD iolib.multiplex FAIL) ASDF/FIND-SYSTEM:LOAD-SYSTEM-DEFINITION-ERROR : Error while trying to load definition for system iolib from pathname /home/testgrid/cl-test-grid/work-dir/agent/quicklisp/dists/quicklisp/software/iolib-20150302-git/iolib.asd: The variable C::*CC-FLAGS* is unbound.
(LOAD iolib.examples FAIL) ASDF/FIND-SYSTEM:LOAD-SYSTEM-DEFINITION-ERROR : Error while trying to load definition for system iolib from pathname /home/testgrid/cl-test-grid/work-dir/agent/quicklisp/dists/quicklisp/software/iolib-20150302-git/iolib.asd: The variable C::*CC-FLAGS* is unbound.
(LOAD iolib.conf FAIL) ASDF/FIND-SYSTEM:LOAD-SYSTEM-DEFINITION-ERROR : Error while trying to load definition for system iolib from pathname /home/testgrid/cl-test-grid/work-dir/agent/quicklisp/dists/quicklisp/software/iolib-20150302-git/iolib.asd: The variable C::*CC-FLAGS* is unbound.
(LOAD iolib.common-lisp FAIL) ASDF/FIND-SYSTEM:LOAD-SYSTEM-DEFINITION-ERROR : Error while trying to load definition for system iolib from pathname /home/testgrid/cl-test-grid/work-dir/agent/quicklisp/dists/quicklisp/software/iolib-20150302-git/iolib.asd: The variable C::*CC-FLAGS* is unbound.
(LOAD iolib.base FAIL) ASDF/FIND-SYSTEM:LOAD-SYSTEM-DEFINITION-ERROR : Error while trying to load definition for system iolib from pathname /home/testgrid/cl-test-grid/work-dir/agent/quicklisp/dists/quicklisp/software/iolib-20150302-git/iolib.asd: The variable C::*CC-FLAGS* is unbound.
(LOAD iolib.asdf FAIL) ASDF/FIND-SYSTEM:LOAD-SYSTEM-DEFINITION-ERROR : Error while trying to load definition for system iolib from pathname /home/testgrid/cl-test-grid/work-dir/agent/quicklisp/dists/quicklisp/software/iolib-20150302-git/iolib.asd: The variable C::*CC-FLAGS* is unbound.
(LOAD iolib-tests FAIL) ASDF/FIND-SYSTEM:LOAD-SYSTEM-DEFINITION-ERROR : Error while trying to load definition for system iolib from pathname /home/testgrid/cl-test-grid/work-dir/agent/quicklisp/dists/quicklisp/software/iolib-20150302-git/iolib.asd: The variable C::*CC-FLAGS* is unbound.
(LOAD iolib-grovel FAIL) ASDF/FIND-SYSTEM:LOAD-SYSTEM-DEFINITION-ERROR : Error while trying to load definition for system iolib from pathname /home/testgrid/cl-test-grid/work-dir/agent/quicklisp/dists/quicklisp/software/iolib-20150302-git/iolib.asd: The variable C::*CC-FLAGS* is unbound.
(LOAD iolib FAIL) ASDF/FIND-SYSTEM:LOAD-SYSTEM-DEFINITION-ERROR : Error while trying to load definition for system iolib from pathname /home/testgrid/cl-test-grid/work-dir/agent/quicklisp/dists/quicklisp/software/iolib-20150302-git/iolib.asd: The variable C::*CC-FLAGS* is unbound.
(LOAD iolib.trivial-sockets FAIL) ASDF/FIND-SYSTEM:LOAD-SYSTEM-DEFINITION-ERROR : Error while trying to load definition for system iolib from pathname /home/testgrid/cl-test-grid/work-dir/agent/quicklisp/dists/quicklisp/software/iolib-20150302-git/iolib.asd: The variable C::*CC-FLAGS* is unbound.
(LOAD iolib.syscalls FAIL) ASDF/FIND-SYSTEM:LOAD-SYSTEM-DEFINITION-ERROR : Error while trying to load definition for system iolib from pathname /home/testgrid/cl-test-grid/work-dir/agent/quicklisp/dists/quicklisp/software/iolib-20150302-git/iolib.asd: The variable C::*CC-FLAGS* is unbound.
(LOAD iolib.streams FAIL) ASDF/FIND-SYSTEM:LOAD-SYSTEM-DEFINITION-ERROR : Error while trying to load definition for system iolib from pathname /home/testgrid/cl-test-grid/work-dir/agent/quicklisp/dists/quicklisp/software/iolib-20150302-git/iolib.asd: The variable C::*CC-FLAGS* is unbound.
(LOAD iolib.sockets FAIL) ASDF/FIND-SYSTEM:LOAD-SYSTEM-DEFINITION-ERROR : Error while trying to load definition for system iolib from pathname /home/testgrid/cl-test-grid/work-dir/agent/quicklisp/dists/quicklisp/software/iolib-20150302-git/iolib.asd: The variable C::*CC-FLAGS* is unbound.
(LOAD iolib.pathnames FAIL) ASDF/FIND-SYSTEM:LOAD-SYSTEM-DEFINITION-ERROR : Error while trying to load definition for system iolib from pathname /home/testgrid/cl-test-grid/work-dir/agent/quicklisp/dists/quicklisp/software/iolib-20150302-git/iolib.asd: The variable C::*CC-FLAGS* is unbound.
(LOAD iolib.os FAIL) ASDF/FIND-SYSTEM:LOAD-SYSTEM-DEFINITION-ERROR : Error while trying to load definition for system iolib from pathname /home/testgrid/cl-test-grid/work-dir/agent/quicklisp/dists/quicklisp/software/iolib-20150302-git/iolib.asd: The variable C::*CC-FLAGS* is unbound.
(LOAD iolib.multiplex FAIL) ASDF/FIND-SYSTEM:LOAD-SYSTEM-DEFINITION-ERROR : Error while trying to load definition for system iolib from pathname /home/testgrid/cl-test-grid/work-dir/agent/quicklisp/dists/quicklisp/software/iolib-20150302-git/iolib.asd: The variable C::*CC-FLAGS* is unbound.
(LOAD iolib.examples FAIL) ASDF/FIND-SYSTEM:LOAD-SYSTEM-DEFINITION-ERROR : Error while trying to load definition for system iolib from pathname /home/testgrid/cl-test-grid/work-dir/agent/quicklisp/dists/quicklisp/software/iolib-20150302-git/iolib.asd: The variable C::*CC-FLAGS* is unbound.
(LOAD iolib.conf FAIL) ASDF/FIND-SYSTEM:LOAD-SYSTEM-DEFINITION-ERROR : Error while trying to load definition for system iolib from pathname /home/testgrid/cl-test-grid/work-dir/agent/quicklisp/dists/quicklisp/software/iolib-20150302-git/iolib.asd: The variable C::*CC-FLAGS* is unbound.
(LOAD iolib.common-lisp FAIL) ASDF/FIND-SYSTEM:LOAD-SYSTEM-DEFINITION-ERROR : Error while trying to load definition for system iolib from pathname /home/testgrid/cl-test-grid/work-dir/agent/quicklisp/dists/quicklisp/software/iolib-20150302-git/iolib.asd: The variable C::*CC-FLAGS* is unbound.
(LOAD iolib.base FAIL) ASDF/FIND-SYSTEM:LOAD-SYSTEM-DEFINITION-ERROR : Error while trying to load definition for system iolib from pathname /home/testgrid/cl-test-grid/work-dir/agent/quicklisp/dists/quicklisp/software/iolib-20150302-git/iolib.asd: The variable C::*CC-FLAGS* is unbound.
(LOAD iolib.asdf FAIL) ASDF/FIND-SYSTEM:LOAD-SYSTEM-DEFINITION-ERROR : Error while trying to load definition for system iolib from pathname /home/testgrid/cl-test-grid/work-dir/agent/quicklisp/dists/quicklisp/software/iolib-20150302-git/iolib.asd: The variable C::*CC-FLAGS* is unbound.
(LOAD iolib-tests FAIL) ASDF/FIND-SYSTEM:LOAD-SYSTEM-DEFINITION-ERROR : Error while trying to load definition for system iolib from pathname /home/testgrid/cl-test-grid/work-dir/agent/quicklisp/dists/quicklisp/software/iolib-20150302-git/iolib.asd: The variable C::*CC-FLAGS* is unbound.
(LOAD iolib-grovel FAIL) ASDF/FIND-SYSTEM:LOAD-SYSTEM-DEFINITION-ERROR : Error while trying to load definition for system iolib from pathname /home/testgrid/cl-test-grid/work-dir/agent/quicklisp/dists/quicklisp/software/iolib-20150302-git/iolib.asd: The variable C::*CC-FLAGS* is unbound.
(LOAD iolib FAIL) ASDF/FIND-SYSTEM:LOAD-SYSTEM-DEFINITION-ERROR : Error while trying to load definition for system iolib from pathname /home/testgrid/cl-test-grid/work-dir/agent/quicklisp/dists/quicklisp/software/iolib-20150302-git/iolib.asd: The variable C::*CC-FLAGS* is unbound.
ecl-15.2.21-ee989b97-linux-i686-lisp-to-c
(LOAD iolib.trivial-sockets FAIL) COMMON-LISP:SIMPLE-ERROR : %CLOSE-FOREIGN-LIBRARY unimplemented.
(LOAD iolib.syscalls FAIL) COMMON-LISP:SIMPLE-ERROR : %CLOSE-FOREIGN-LIBRARY unimplemented.
(LOAD iolib.streams FAIL) COMMON-LISP:SIMPLE-ERROR : %CLOSE-FOREIGN-LIBRARY unimplemented.
(LOAD iolib.sockets FAIL) COMMON-LISP:SIMPLE-ERROR : %CLOSE-FOREIGN-LIBRARY unimplemented.
(LOAD iolib.pathnames FAIL) COMMON-LISP:SIMPLE-ERROR : %CLOSE-FOREIGN-LIBRARY unimplemented.
(LOAD iolib.os FAIL) COMMON-LISP:SIMPLE-ERROR : %CLOSE-FOREIGN-LIBRARY unimplemented.
(LOAD iolib.multiplex FAIL) COMMON-LISP:SIMPLE-ERROR : %CLOSE-FOREIGN-LIBRARY unimplemented.
(LOAD iolib.examples FAIL) COMMON-LISP:SIMPLE-ERROR : %CLOSE-FOREIGN-LIBRARY unimplemented.
(LOAD iolib-tests FAIL) COMMON-LISP:SIMPLE-ERROR : %CLOSE-FOREIGN-LIBRARY unimplemented.
(LOAD iolib FAIL) COMMON-LISP:SIMPLE-ERROR : %CLOSE-FOREIGN-LIBRARY unimplemented.
(LOAD iolib.trivial-sockets FAIL) COMMON-LISP:SIMPLE-ERROR : %CLOSE-FOREIGN-LIBRARY unimplemented.
(LOAD iolib.syscalls FAIL) COMMON-LISP:SIMPLE-ERROR : %CLOSE-FOREIGN-LIBRARY unimplemented.
(LOAD iolib.streams FAIL) COMMON-LISP:SIMPLE-ERROR : %CLOSE-FOREIGN-LIBRARY unimplemented.
(LOAD iolib.sockets FAIL) COMMON-LISP:SIMPLE-ERROR : %CLOSE-FOREIGN-LIBRARY unimplemented.
(LOAD iolib.pathnames FAIL) COMMON-LISP:SIMPLE-ERROR : %CLOSE-FOREIGN-LIBRARY unimplemented.
(LOAD iolib.os FAIL) COMMON-LISP:SIMPLE-ERROR : %CLOSE-FOREIGN-LIBRARY unimplemented.
(LOAD iolib.multiplex FAIL) COMMON-LISP:SIMPLE-ERROR : %CLOSE-FOREIGN-LIBRARY unimplemented.
(LOAD iolib.examples FAIL) COMMON-LISP:SIMPLE-ERROR : %CLOSE-FOREIGN-LIBRARY unimplemented.
(LOAD iolib-tests FAIL) COMMON-LISP:SIMPLE-ERROR : %CLOSE-FOREIGN-LIBRARY unimplemented.
(LOAD iolib FAIL) COMMON-LISP:SIMPLE-ERROR : %CLOSE-FOREIGN-LIBRARY unimplemented.
sbcl-1.0.58-linux-x86
(LOAD iolib.trivial-sockets FAIL) ASDF:LOAD-SYSTEM-DEFINITION-ERROR : Error while trying to load definition for system swap-bytes from pathname /home/testgrid/cl-test-grid/work-dir/agent/quicklisp/dists/quicklisp/software/swap-bytes-20140713-git/swap-bytes.asd: READ error during COMPILE-FILE: You need ASDF >= 2.32 to load this system correctly. (in form starting at line: 1, column: 0, file-position: 0)
(LOAD iolib.syscalls FAIL) ASDF:MISSING-COMPONENT : Component "iolib/syscalls" not found
(LOAD iolib.streams FAIL) ASDF:MISSING-COMPONENT : Component "iolib/streams" not found
(LOAD iolib.sockets FAIL) ASDF:LOAD-SYSTEM-DEFINITION-ERROR : Error while trying to load definition for system swap-bytes from pathname /home/testgrid/cl-test-grid/work-dir/agent/quicklisp/dists/quicklisp/software/swap-bytes-20140713-git/swap-bytes.asd: READ error during COMPILE-FILE: You need ASDF >= 2.32 to load this system correctly. (in form starting at line: 1, column: 0, file-position: 0)
(LOAD iolib.pathnames FAIL) ASDF:MISSING-COMPONENT : Component "iolib/pathnames" not found
(LOAD iolib.os FAIL) ASDF:MISSING-COMPONENT : Component "iolib/os" not found
(LOAD iolib.multiplex FAIL) ASDF:MISSING-COMPONENT : Component "iolib/multiplex" not found
(LOAD iolib.examples FAIL) ASDF:LOAD-SYSTEM-DEFINITION-ERROR : Error while trying to load definition for system iolib from pathname /home/testgrid/cl-test-grid/work-dir/agent/quicklisp/dists/quicklisp/software/iolib-20150302-git/iolib.asd: You need ASDF >= 2.31.1 to load this system correctly.
(LOAD iolib.conf FAIL) ASDF:MISSING-COMPONENT : Component "iolib/conf" not found
(LOAD iolib.common-lisp FAIL) ASDF:MISSING-COMPONENT : Component "iolib/common-lisp" not found
(LOAD iolib.base FAIL) ASDF:MISSING-COMPONENT : Component "iolib/base" not found
(LOAD iolib.asdf FAIL) ASDF:MISSING-COMPONENT : Component "iolib/asdf" not found
(LOAD iolib-tests FAIL) ASDF:LOAD-SYSTEM-DEFINITION-ERROR : Error while trying to load definition for system iolib from pathname /home/testgrid/cl-test-grid/work-dir/agent/quicklisp/dists/quicklisp/software/iolib-20150302-git/iolib.asd: You need ASDF >= 2.31.1 to load this system correctly.
(LOAD iolib-grovel FAIL) ASDF:MISSING-COMPONENT : Component "iolib/grovel" not found
(LOAD iolib FAIL) ASDF:LOAD-SYSTEM-DEFINITION-ERROR : Error while trying to load definition for system iolib from pathname /home/testgrid/cl-test-grid/work-dir/agent/quicklisp/dists/quicklisp/software/iolib-20150302-git/iolib.asd: You need ASDF >= 2.31.1 to load this system correctly.
(LOAD iolib.trivial-sockets FAIL) ASDF:LOAD-SYSTEM-DEFINITION-ERROR : Error while trying to load definition for system swap-bytes from pathname /home/testgrid/cl-test-grid/work-dir/agent/quicklisp/dists/quicklisp/software/swap-bytes-20140713-git/swap-bytes.asd: READ error during COMPILE-FILE: You need ASDF >= 2.32 to load this system correctly. (in form starting at line: 1, column: 0, file-position: 0)
(LOAD iolib.syscalls FAIL) ASDF:MISSING-COMPONENT : Component "iolib/syscalls" not found
(LOAD iolib.streams FAIL) ASDF:MISSING-COMPONENT : Component "iolib/streams" not found
(LOAD iolib.sockets FAIL) ASDF:LOAD-SYSTEM-DEFINITION-ERROR : Error while trying to load definition for system swap-bytes from pathname /home/testgrid/cl-test-grid/work-dir/agent/quicklisp/dists/quicklisp/software/swap-bytes-20140713-git/swap-bytes.asd: READ error during COMPILE-FILE: You need ASDF >= 2.32 to load this system correctly. (in form starting at line: 1, column: 0, file-position: 0)
(LOAD iolib.pathnames FAIL) ASDF:MISSING-COMPONENT : Component "iolib/pathnames" not found
(LOAD iolib.os FAIL) ASDF:MISSING-COMPONENT : Component "iolib/os" not found
(LOAD iolib.multiplex FAIL) ASDF:MISSING-COMPONENT : Component "iolib/multiplex" not found
(LOAD iolib.examples FAIL) ASDF:LOAD-SYSTEM-DEFINITION-ERROR : Error while trying to load definition for system iolib from pathname /home/testgrid/cl-test-grid/work-dir/agent/quicklisp/dists/quicklisp/software/iolib-20150302-git/iolib.asd: You need ASDF >= 2.31.1 to load this system correctly.
(LOAD iolib.conf FAIL) ASDF:MISSING-COMPONENT : Component "iolib/conf" not found
(LOAD iolib.common-lisp FAIL) ASDF:MISSING-COMPONENT : Component "iolib/common-lisp" not found
(LOAD iolib.base FAIL) ASDF:MISSING-COMPONENT : Component "iolib/base" not found
(LOAD iolib.asdf FAIL) ASDF:MISSING-COMPONENT : Component "iolib/asdf" not found
(LOAD iolib-tests FAIL) ASDF:LOAD-SYSTEM-DEFINITION-ERROR : Error while trying to load definition for system iolib from pathname /home/testgrid/cl-test-grid/work-dir/agent/quicklisp/dists/quicklisp/software/iolib-20150302-git/iolib.asd: You need ASDF >= 2.31.1 to load this system correctly.
(LOAD iolib-grovel FAIL) ASDF:MISSING-COMPONENT : Component "iolib/grovel" not found
(LOAD iolib FAIL) ASDF:LOAD-SYSTEM-DEFINITION-ERROR : Error while trying to load definition for system iolib from pathname /home/testgrid/cl-test-grid/work-dir/agent/quicklisp/dists/quicklisp/software/iolib-20150302-git/iolib.asd: You need ASDF >= 2.31.1 to load this system correctly.
sbcl-1.1.11-linux-x86
(LOAD iolib.trivial-sockets FAIL) ASDF/FIND-SYSTEM:MISSING-COMPONENT : Component "iolib/trivial-sockets" not found
(LOAD iolib.syscalls FAIL) ASDF/FIND-SYSTEM:MISSING-COMPONENT : Component "iolib/syscalls" not found
(LOAD iolib.streams FAIL) ASDF/FIND-SYSTEM:MISSING-COMPONENT : Component "iolib/streams" not found
(LOAD iolib.sockets FAIL) ASDF/FIND-SYSTEM:MISSING-COMPONENT : Component "iolib/sockets" not found
(LOAD iolib.pathnames FAIL) ASDF/FIND-SYSTEM:MISSING-COMPONENT : Component "iolib/pathnames" not found
(LOAD iolib.os FAIL) ASDF/FIND-SYSTEM:MISSING-COMPONENT : Component "iolib/os" not found
(LOAD iolib.multiplex FAIL) ASDF/FIND-SYSTEM:MISSING-COMPONENT : Component "iolib/multiplex" not found
(LOAD iolib.conf FAIL) ASDF/FIND-SYSTEM:MISSING-COMPONENT : Component "iolib/conf" not found
(LOAD iolib.common-lisp FAIL) ASDF/FIND-SYSTEM:MISSING-COMPONENT : Component "iolib/common-lisp" not found
(LOAD iolib.base FAIL) ASDF/FIND-SYSTEM:MISSING-COMPONENT : Component "iolib/base" not found
(LOAD iolib.asdf FAIL) ASDF/FIND-SYSTEM:MISSING-COMPONENT : Component "iolib/asdf" not found
(LOAD iolib-grovel FAIL) ASDF/FIND-SYSTEM:MISSING-COMPONENT : Component "iolib/grovel" not found
(LOAD iolib.trivial-sockets FAIL) ASDF/FIND-SYSTEM:MISSING-COMPONENT : Component "iolib/trivial-sockets" not found
(LOAD iolib.syscalls FAIL) ASDF/FIND-SYSTEM:MISSING-COMPONENT : Component "iolib/syscalls" not found
(LOAD iolib.streams FAIL) ASDF/FIND-SYSTEM:MISSING-COMPONENT : Component "iolib/streams" not found
(LOAD iolib.sockets FAIL) ASDF/FIND-SYSTEM:MISSING-COMPONENT : Component "iolib/sockets" not found
(LOAD iolib.pathnames FAIL) ASDF/FIND-SYSTEM:MISSING-COMPONENT : Component "iolib/pathnames" not found
(LOAD iolib.os FAIL) ASDF/FIND-SYSTEM:MISSING-COMPONENT : Component "iolib/os" not found
(LOAD iolib.multiplex FAIL) ASDF/FIND-SYSTEM:MISSING-COMPONENT : Component "iolib/multiplex" not found
(LOAD iolib.conf FAIL) ASDF/FIND-SYSTEM:MISSING-COMPONENT : Component "iolib/conf" not found
(LOAD iolib.common-lisp FAIL) ASDF/FIND-SYSTEM:MISSING-COMPONENT : Component "iolib/common-lisp" not found
(LOAD iolib.base FAIL) ASDF/FIND-SYSTEM:MISSING-COMPONENT : Component "iolib/base" not found
(LOAD iolib.asdf FAIL) ASDF/FIND-SYSTEM:MISSING-COMPONENT : Component "iolib/asdf" not found
(LOAD iolib-grovel FAIL) ASDF/FIND-SYSTEM:MISSING-COMPONENT : Component "iolib/grovel" not found
sbcl-1.1.16-linux-x86
(LOAD iolib.trivial-sockets FAIL) ASDF/FIND-SYSTEM:MISSING-COMPONENT : Component "iolib/trivial-sockets" not found
(LOAD iolib.syscalls FAIL) ASDF/FIND-SYSTEM:MISSING-COMPONENT : Component "iolib/syscalls" not found
(LOAD iolib.streams FAIL) ASDF/FIND-SYSTEM:MISSING-COMPONENT : Component "iolib/streams" not found
(LOAD iolib.sockets FAIL) ASDF/FIND-SYSTEM:MISSING-COMPONENT : Component "iolib/sockets" not found
(LOAD iolib.pathnames FAIL) ASDF/FIND-SYSTEM:MISSING-COMPONENT : Component "iolib/pathnames" not found
(LOAD iolib.os FAIL) ASDF/FIND-SYSTEM:MISSING-COMPONENT : Component "iolib/os" not found
(LOAD iolib.multiplex FAIL) ASDF/FIND-SYSTEM:MISSING-COMPONENT : Component "iolib/multiplex" not found
(LOAD iolib.conf FAIL) ASDF/FIND-SYSTEM:MISSING-COMPONENT : Component "iolib/conf" not found
(LOAD iolib.common-lisp FAIL) ASDF/FIND-SYSTEM:MISSING-COMPONENT : Component "iolib/common-lisp" not found
(LOAD iolib.base FAIL) ASDF/FIND-SYSTEM:MISSING-COMPONENT : Component "iolib/base" not found
(LOAD iolib.asdf FAIL) ASDF/FIND-SYSTEM:MISSING-COMPONENT : Component "iolib/asdf" not found
(LOAD iolib-grovel FAIL) ASDF/FIND-SYSTEM:MISSING-COMPONENT : Component "iolib/grovel" not found
(LOAD iolib.trivial-sockets FAIL) ASDF/FIND-SYSTEM:MISSING-COMPONENT : Component "iolib/trivial-sockets" not found
(LOAD iolib.syscalls FAIL) ASDF/FIND-SYSTEM:MISSING-COMPONENT : Component "iolib/syscalls" not found
(LOAD iolib.streams FAIL) ASDF/FIND-SYSTEM:MISSING-COMPONENT : Component "iolib/streams" not found
(LOAD iolib.sockets FAIL) ASDF/FIND-SYSTEM:MISSING-COMPONENT : Component "iolib/sockets" not found
(LOAD iolib.pathnames FAIL) ASDF/FIND-SYSTEM:MISSING-COMPONENT : Component "iolib/pathnames" not found
(LOAD iolib.os FAIL) ASDF/FIND-SYSTEM:MISSING-COMPONENT : Component "iolib/os" not found
(LOAD iolib.multiplex FAIL) ASDF/FIND-SYSTEM:MISSING-COMPONENT : Component "iolib/multiplex" not found
(LOAD iolib.conf FAIL) ASDF/FIND-SYSTEM:MISSING-COMPONENT : Component "iolib/conf" not found
(LOAD iolib.common-lisp FAIL) ASDF/FIND-SYSTEM:MISSING-COMPONENT : Component "iolib/common-lisp" not found
(LOAD iolib.base FAIL) ASDF/FIND-SYSTEM:MISSING-COMPONENT : Component "iolib/base" not found
(LOAD iolib.asdf FAIL) ASDF/FIND-SYSTEM:MISSING-COMPONENT : Component "iolib/asdf" not found
(LOAD iolib-grovel FAIL) ASDF/FIND-SYSTEM:MISSING-COMPONENT : Component "iolib/grovel" not found
sbcl-1.2.3-linux-x64
(LOAD iolib.trivial-sockets FAIL) COMMON-LISP:SIMPLE-ERROR : External process exited with code 1. Command was: "g++" "-m64" "-Wno-write-strings" "-I/home/hijarian/systems/cl-test-grid/work-dir/agent/quicklisp/dists/quicklisp/software/iolib-20150302-git/src/grovel/" "-o" "/home/hijarian/systems/cl-test-grid/work-dir/agent/test-runs/20150408075038-sbcl-1.2.3-linux-x64/fasl/ql/dists/quicklisp/software/iolib-20150302-git/src/syscalls/ffi-types-unix" "/home/hijarian/systems/cl-test-grid/work-dir/agent/test-runs/20150408075038-sbcl-1.2.3-linux-x64/fasl/ql/dists/quicklisp/software/iolib-20150302-git/src/syscalls/ffi-types-unix.c" Output was: /home/hijarian/systems/cl-test-grid/work-dir/agent/test-runs/20150408075038-sbcl-1.2.3-linux-x64/fasl/ql/dists/quicklisp/software/iolib-20150302-git/src/syscalls/ffi-types-unix.c:14:17: fatal error: lfp.h: Нет такого файла или каталога #include <lfp.h> ^ compilation terminated.
(LOAD iolib.syscalls FAIL) COMMON-LISP:SIMPLE-ERROR : External process exited with code 1. Command was: "g++" "-m64" "-Wno-write-strings" "-I/home/hijarian/systems/cl-test-grid/work-dir/agent/quicklisp/dists/quicklisp/software/iolib-20150302-git/src/grovel/" "-o" "/home/hijarian/systems/cl-test-grid/work-dir/agent/test-runs/20150408075038-sbcl-1.2.3-linux-x64/fasl/ql/dists/quicklisp/software/iolib-20150302-git/src/syscalls/ffi-types-unix" "/home/hijarian/systems/cl-test-grid/work-dir/agent/test-runs/20150408075038-sbcl-1.2.3-linux-x64/fasl/ql/dists/quicklisp/software/iolib-20150302-git/src/syscalls/ffi-types-unix.c" Output was: /home/hijarian/systems/cl-test-grid/work-dir/agent/test-runs/20150408075038-sbcl-1.2.3-linux-x64/fasl/ql/dists/quicklisp/software/iolib-20150302-git/src/syscalls/ffi-types-unix.c:14:17: fatal error: lfp.h: Нет такого файла или каталога #include <lfp.h> ^ compilation terminated.
(LOAD iolib.streams FAIL) COMMON-LISP:SIMPLE-ERROR : External process exited with code 1. Command was: "g++" "-m64" "-Wno-write-strings" "-I/home/hijarian/systems/cl-test-grid/work-dir/agent/quicklisp/dists/quicklisp/software/iolib-20150302-git/src/grovel/" "-o" "/home/hijarian/systems/cl-test-grid/work-dir/agent/test-runs/20150408075038-sbcl-1.2.3-linux-x64/fasl/ql/dists/quicklisp/software/iolib-20150302-git/src/syscalls/ffi-types-unix" "/home/hijarian/systems/cl-test-grid/work-dir/agent/test-runs/20150408075038-sbcl-1.2.3-linux-x64/fasl/ql/dists/quicklisp/software/iolib-20150302-git/src/syscalls/ffi-types-unix.c" Output was: /home/hijarian/systems/cl-test-grid/work-dir/agent/test-runs/20150408075038-sbcl-1.2.3-linux-x64/fasl/ql/dists/quicklisp/software/iolib-20150302-git/src/syscalls/ffi-types-unix.c:14:17: fatal error: lfp.h: Нет такого файла или каталога #include <lfp.h> ^ compilation terminated.
(LOAD iolib.sockets FAIL) COMMON-LISP:SIMPLE-ERROR : External process exited with code 1. Command was: "g++" "-m64" "-Wno-write-strings" "-I/home/hijarian/systems/cl-test-grid/work-dir/agent/quicklisp/dists/quicklisp/software/iolib-20150302-git/src/grovel/" "-o" "/home/hijarian/systems/cl-test-grid/work-dir/agent/test-runs/20150408075038-sbcl-1.2.3-linux-x64/fasl/ql/dists/quicklisp/software/iolib-20150302-git/src/syscalls/ffi-types-unix" "/home/hijarian/systems/cl-test-grid/work-dir/agent/test-runs/20150408075038-sbcl-1.2.3-linux-x64/fasl/ql/dists/quicklisp/software/iolib-20150302-git/src/syscalls/ffi-types-unix.c" Output was: /home/hijarian/systems/cl-test-grid/work-dir/agent/test-runs/20150408075038-sbcl-1.2.3-linux-x64/fasl/ql/dists/quicklisp/software/iolib-20150302-git/src/syscalls/ffi-types-unix.c:14:17: fatal error: lfp.h: Нет такого файла или каталога #include <lfp.h> ^ compilation terminated.
(LOAD iolib.pathnames FAIL) COMMON-LISP:SIMPLE-ERROR : External process exited with code 1. Command was: "g++" "-m64" "-Wno-write-strings" "-I/home/hijarian/systems/cl-test-grid/work-dir/agent/quicklisp/dists/quicklisp/software/iolib-20150302-git/src/grovel/" "-o" "/home/hijarian/systems/cl-test-grid/work-dir/agent/test-runs/20150408075038-sbcl-1.2.3-linux-x64/fasl/ql/dists/quicklisp/software/iolib-20150302-git/src/syscalls/ffi-types-unix" "/home/hijarian/systems/cl-test-grid/work-dir/agent/test-runs/20150408075038-sbcl-1.2.3-linux-x64/fasl/ql/dists/quicklisp/software/iolib-20150302-git/src/syscalls/ffi-types-unix.c" Output was: /home/hijarian/systems/cl-test-grid/work-dir/agent/test-runs/20150408075038-sbcl-1.2.3-linux-x64/fasl/ql/dists/quicklisp/software/iolib-20150302-git/src/syscalls/ffi-types-unix.c:14:17: fatal error: lfp.h: Нет такого файла или каталога #include <lfp.h> ^ compilation terminated.
(LOAD iolib.os FAIL) COMMON-LISP:SIMPLE-ERROR : External process exited with code 1. Command was: "g++" "-m64" "-Wno-write-strings" "-I/home/hijarian/systems/cl-test-grid/work-dir/agent/quicklisp/dists/quicklisp/software/iolib-20150302-git/src/grovel/" "-o" "/home/hijarian/systems/cl-test-grid/work-dir/agent/test-runs/20150408075038-sbcl-1.2.3-linux-x64/fasl/ql/dists/quicklisp/software/iolib-20150302-git/src/syscalls/ffi-types-unix" "/home/hijarian/systems/cl-test-grid/work-dir/agent/test-runs/20150408075038-sbcl-1.2.3-linux-x64/fasl/ql/dists/quicklisp/software/iolib-20150302-git/src/syscalls/ffi-types-unix.c" Output was: /home/hijarian/systems/cl-test-grid/work-dir/agent/test-runs/20150408075038-sbcl-1.2.3-linux-x64/fasl/ql/dists/quicklisp/software/iolib-20150302-git/src/syscalls/ffi-types-unix.c:14:17: fatal error: lfp.h: Нет такого файла или каталога #include <lfp.h> ^ compilation terminated.
(LOAD iolib.multiplex FAIL) COMMON-LISP:SIMPLE-ERROR : External process exited with code 1. Command was: "g++" "-m64" "-Wno-write-strings" "-I/home/hijarian/systems/cl-test-grid/work-dir/agent/quicklisp/dists/quicklisp/software/iolib-20150302-git/src/grovel/" "-o" "/home/hijarian/systems/cl-test-grid/work-dir/agent/test-runs/20150408075038-sbcl-1.2.3-linux-x64/fasl/ql/dists/quicklisp/software/iolib-20150302-git/src/syscalls/ffi-types-unix" "/home/hijarian/systems/cl-test-grid/work-dir/agent/test-runs/20150408075038-sbcl-1.2.3-linux-x64/fasl/ql/dists/quicklisp/software/iolib-20150302-git/src/syscalls/ffi-types-unix.c" Output was: /home/hijarian/systems/cl-test-grid/work-dir/agent/test-runs/20150408075038-sbcl-1.2.3-linux-x64/fasl/ql/dists/quicklisp/software/iolib-20150302-git/src/syscalls/ffi-types-unix.c:14:17: fatal error: lfp.h: Нет такого файла или каталога #include <lfp.h> ^ compilation terminated.
(LOAD iolib.examples FAIL) COMMON-LISP:SIMPLE-ERROR : External process exited with code 1. Command was: "g++" "-m64" "-Wno-write-strings" "-I/home/hijarian/systems/cl-test-grid/work-dir/agent/quicklisp/dists/quicklisp/software/iolib-20150302-git/src/grovel/" "-o" "/home/hijarian/systems/cl-test-grid/work-dir/agent/test-runs/20150408075038-sbcl-1.2.3-linux-x64/fasl/ql/dists/quicklisp/software/iolib-20150302-git/src/syscalls/ffi-types-unix" "/home/hijarian/systems/cl-test-grid/work-dir/agent/test-runs/20150408075038-sbcl-1.2.3-linux-x64/fasl/ql/dists/quicklisp/software/iolib-20150302-git/src/syscalls/ffi-types-unix.c" Output was: /home/hijarian/systems/cl-test-grid/work-dir/agent/test-runs/20150408075038-sbcl-1.2.3-linux-x64/fasl/ql/dists/quicklisp/software/iolib-20150302-git/src/syscalls/ffi-types-unix.c:14:17: fatal error: lfp.h: Нет такого файла или каталога #include <lfp.h> ^ compilation terminated.
(LOAD iolib-tests FAIL) COMMON-LISP:SIMPLE-ERROR : External process exited with code 1. Command was: "g++" "-m64" "-Wno-write-strings" "-I/home/hijarian/systems/cl-test-grid/work-dir/agent/quicklisp/dists/quicklisp/software/iolib-20150302-git/src/grovel/" "-o" "/home/hijarian/systems/cl-test-grid/work-dir/agent/test-runs/20150408075038-sbcl-1.2.3-linux-x64/fasl/ql/dists/quicklisp/software/iolib-20150302-git/src/syscalls/ffi-types-unix" "/home/hijarian/systems/cl-test-grid/work-dir/agent/test-runs/20150408075038-sbcl-1.2.3-linux-x64/fasl/ql/dists/quicklisp/software/iolib-20150302-git/src/syscalls/ffi-types-unix.c" Output was: /home/hijarian/systems/cl-test-grid/work-dir/agent/test-runs/20150408075038-sbcl-1.2.3-linux-x64/fasl/ql/dists/quicklisp/software/iolib-20150302-git/src/syscalls/ffi-types-unix.c:14:17: fatal error: lfp.h: Нет такого файла или каталога #include <lfp.h> ^ compilation terminated.
(LOAD iolib FAIL) COMMON-LISP:SIMPLE-ERROR : External process exited with code 1. Command was: "g++" "-m64" "-Wno-write-strings" "-I/home/hijarian/systems/cl-test-grid/work-dir/agent/quicklisp/dists/quicklisp/software/iolib-20150302-git/src/grovel/" "-o" "/home/hijarian/systems/cl-test-grid/work-dir/agent/test-runs/20150408075038-sbcl-1.2.3-linux-x64/fasl/ql/dists/quicklisp/software/iolib-20150302-git/src/syscalls/ffi-types-unix" "/home/hijarian/systems/cl-test-grid/work-dir/agent/test-runs/20150408075038-sbcl-1.2.3-linux-x64/fasl/ql/dists/quicklisp/software/iolib-20150302-git/src/syscalls/ffi-types-unix.c" Output was: /home/hijarian/systems/cl-test-grid/work-dir/agent/test-runs/20150408075038-sbcl-1.2.3-linux-x64/fasl/ql/dists/quicklisp/software/iolib-20150302-git/src/syscalls/ffi-types-unix.c:14:17: fatal error: lfp.h: Нет такого файла или каталога #include <lfp.h> ^ compilation terminated.
(LOAD iolib.trivial-sockets FAIL) COMMON-LISP:SIMPLE-ERROR : External process exited with code 1. Command was: "g++" "-m64" "-Wno-write-strings" "-I/home/hijarian/systems/cl-test-grid/work-dir/agent/quicklisp/dists/quicklisp/software/iolib-20150302-git/src/grovel/" "-o" "/home/hijarian/systems/cl-test-grid/work-dir/agent/test-runs/20150303132800-sbcl-1.2.3-linux-x64/fasl/ql/dists/quicklisp/software/iolib-20150302-git/src/syscalls/ffi-types-unix" "/home/hijarian/systems/cl-test-grid/work-dir/agent/test-runs/20150303132800-sbcl-1.2.3-linux-x64/fasl/ql/dists/quicklisp/software/iolib-20150302-git/src/syscalls/ffi-types-unix.c" Output was: /home/hijarian/systems/cl-test-grid/work-dir/agent/test-runs/20150303132800-sbcl-1.2.3-linux-x64/fasl/ql/dists/quicklisp/software/iolib-20150302-git/src/syscalls/ffi-types-unix.c:14:17: fatal error: lfp.h: Нет такого файла или каталога #include <lfp.h> ^ compilation terminated.
(LOAD iolib.syscalls FAIL) COMMON-LISP:SIMPLE-ERROR : External process exited with code 1. Command was: "g++" "-m64" "-Wno-write-strings" "-I/home/hijarian/systems/cl-test-grid/work-dir/agent/quicklisp/dists/quicklisp/software/iolib-20150302-git/src/grovel/" "-o" "/home/hijarian/systems/cl-test-grid/work-dir/agent/test-runs/20150303132800-sbcl-1.2.3-linux-x64/fasl/ql/dists/quicklisp/software/iolib-20150302-git/src/syscalls/ffi-types-unix" "/home/hijarian/systems/cl-test-grid/work-dir/agent/test-runs/20150303132800-sbcl-1.2.3-linux-x64/fasl/ql/dists/quicklisp/software/iolib-20150302-git/src/syscalls/ffi-types-unix.c" Output was: /home/hijarian/systems/cl-test-grid/work-dir/agent/test-runs/20150303132800-sbcl-1.2.3-linux-x64/fasl/ql/dists/quicklisp/software/iolib-20150302-git/src/syscalls/ffi-types-unix.c:14:17: fatal error: lfp.h: Нет такого файла или каталога #include <lfp.h> ^ compilation terminated.
(LOAD iolib.streams FAIL) COMMON-LISP:SIMPLE-ERROR : External process exited with code 1. Command was: "g++" "-m64" "-Wno-write-strings" "-I/home/hijarian/systems/cl-test-grid/work-dir/agent/quicklisp/dists/quicklisp/software/iolib-20150302-git/src/grovel/" "-o" "/home/hijarian/systems/cl-test-grid/work-dir/agent/test-runs/20150303132800-sbcl-1.2.3-linux-x64/fasl/ql/dists/quicklisp/software/iolib-20150302-git/src/syscalls/ffi-types-unix" "/home/hijarian/systems/cl-test-grid/work-dir/agent/test-runs/20150303132800-sbcl-1.2.3-linux-x64/fasl/ql/dists/quicklisp/software/iolib-20150302-git/src/syscalls/ffi-types-unix.c" Output was: /home/hijarian/systems/cl-test-grid/work-dir/agent/test-runs/20150303132800-sbcl-1.2.3-linux-x64/fasl/ql/dists/quicklisp/software/iolib-20150302-git/src/syscalls/ffi-types-unix.c:14:17: fatal error: lfp.h: Нет такого файла или каталога #include <lfp.h> ^ compilation terminated.
(LOAD iolib.sockets FAIL) COMMON-LISP:SIMPLE-ERROR : External process exited with code 1. Command was: "g++" "-m64" "-Wno-write-strings" "-I/home/hijarian/systems/cl-test-grid/work-dir/agent/quicklisp/dists/quicklisp/software/iolib-20150302-git/src/grovel/" "-o" "/home/hijarian/systems/cl-test-grid/work-dir/agent/test-runs/20150303132800-sbcl-1.2.3-linux-x64/fasl/ql/dists/quicklisp/software/iolib-20150302-git/src/syscalls/ffi-types-unix" "/home/hijarian/systems/cl-test-grid/work-dir/agent/test-runs/20150303132800-sbcl-1.2.3-linux-x64/fasl/ql/dists/quicklisp/software/iolib-20150302-git/src/syscalls/ffi-types-unix.c" Output was: /home/hijarian/systems/cl-test-grid/work-dir/agent/test-runs/20150303132800-sbcl-1.2.3-linux-x64/fasl/ql/dists/quicklisp/software/iolib-20150302-git/src/syscalls/ffi-types-unix.c:14:17: fatal error: lfp.h: Нет такого файла или каталога #include <lfp.h> ^ compilation terminated.
(LOAD iolib.pathnames FAIL) COMMON-LISP:SIMPLE-ERROR : External process exited with code 1. Command was: "g++" "-m64" "-Wno-write-strings" "-I/home/hijarian/systems/cl-test-grid/work-dir/agent/quicklisp/dists/quicklisp/software/iolib-20150302-git/src/grovel/" "-o" "/home/hijarian/systems/cl-test-grid/work-dir/agent/test-runs/20150303132800-sbcl-1.2.3-linux-x64/fasl/ql/dists/quicklisp/software/iolib-20150302-git/src/syscalls/ffi-types-unix" "/home/hijarian/systems/cl-test-grid/work-dir/agent/test-runs/20150303132800-sbcl-1.2.3-linux-x64/fasl/ql/dists/quicklisp/software/iolib-20150302-git/src/syscalls/ffi-types-unix.c" Output was: /home/hijarian/systems/cl-test-grid/work-dir/agent/test-runs/20150303132800-sbcl-1.2.3-linux-x64/fasl/ql/dists/quicklisp/software/iolib-20150302-git/src/syscalls/ffi-types-unix.c:14:17: fatal error: lfp.h: Нет такого файла или каталога #include <lfp.h> ^ compilation terminated.
(LOAD iolib.os FAIL) COMMON-LISP:SIMPLE-ERROR : External process exited with code 1. Command was: "g++" "-m64" "-Wno-write-strings" "-I/home/hijarian/systems/cl-test-grid/work-dir/agent/quicklisp/dists/quicklisp/software/iolib-20150302-git/src/grovel/" "-o" "/home/hijarian/systems/cl-test-grid/work-dir/agent/test-runs/20150303132800-sbcl-1.2.3-linux-x64/fasl/ql/dists/quicklisp/software/iolib-20150302-git/src/syscalls/ffi-types-unix" "/home/hijarian/systems/cl-test-grid/work-dir/agent/test-runs/20150303132800-sbcl-1.2.3-linux-x64/fasl/ql/dists/quicklisp/software/iolib-20150302-git/src/syscalls/ffi-types-unix.c" Output was: /home/hijarian/systems/cl-test-grid/work-dir/agent/test-runs/20150303132800-sbcl-1.2.3-linux-x64/fasl/ql/dists/quicklisp/software/iolib-20150302-git/src/syscalls/ffi-types-unix.c:14:17: fatal error: lfp.h: Нет такого файла или каталога #include <lfp.h> ^ compilation terminated.
(LOAD iolib.multiplex FAIL) COMMON-LISP:SIMPLE-ERROR : External process exited with code 1. Command was: "g++" "-m64" "-Wno-write-strings" "-I/home/hijarian/systems/cl-test-grid/work-dir/agent/quicklisp/dists/quicklisp/software/iolib-20150302-git/src/grovel/" "-o" "/home/hijarian/systems/cl-test-grid/work-dir/agent/test-runs/20150303132800-sbcl-1.2.3-linux-x64/fasl/ql/dists/quicklisp/software/iolib-20150302-git/src/syscalls/ffi-types-unix" "/home/hijarian/systems/cl-test-grid/work-dir/agent/test-runs/20150303132800-sbcl-1.2.3-linux-x64/fasl/ql/dists/quicklisp/software/iolib-20150302-git/src/syscalls/ffi-types-unix.c" Output was: /home/hijarian/systems/cl-test-grid/work-dir/agent/test-runs/20150303132800-sbcl-1.2.3-linux-x64/fasl/ql/dists/quicklisp/software/iolib-20150302-git/src/syscalls/ffi-types-unix.c:14:17: fatal error: lfp.h: Нет такого файла или каталога #include <lfp.h> ^ compilation terminated.
(LOAD iolib.examples FAIL) COMMON-LISP:SIMPLE-ERROR : External process exited with code 1. Command was: "g++" "-m64" "-Wno-write-strings" "-I/home/hijarian/systems/cl-test-grid/work-dir/agent/quicklisp/dists/quicklisp/software/iolib-20150302-git/src/grovel/" "-o" "/home/hijarian/systems/cl-test-grid/work-dir/agent/test-runs/20150303132800-sbcl-1.2.3-linux-x64/fasl/ql/dists/quicklisp/software/iolib-20150302-git/src/syscalls/ffi-types-unix" "/home/hijarian/systems/cl-test-grid/work-dir/agent/test-runs/20150303132800-sbcl-1.2.3-linux-x64/fasl/ql/dists/quicklisp/software/iolib-20150302-git/src/syscalls/ffi-types-unix.c" Output was: /home/hijarian/systems/cl-test-grid/work-dir/agent/test-runs/20150303132800-sbcl-1.2.3-linux-x64/fasl/ql/dists/quicklisp/software/iolib-20150302-git/src/syscalls/ffi-types-unix.c:14:17: fatal error: lfp.h: Нет такого файла или каталога #include <lfp.h> ^ compilation terminated.
(LOAD iolib-tests FAIL) COMMON-LISP:SIMPLE-ERROR : External process exited with code 1. Command was: "g++" "-m64" "-Wno-write-strings" "-I/home/hijarian/systems/cl-test-grid/work-dir/agent/quicklisp/dists/quicklisp/software/iolib-20150302-git/src/grovel/" "-o" "/home/hijarian/systems/cl-test-grid/work-dir/agent/test-runs/20150303132800-sbcl-1.2.3-linux-x64/fasl/ql/dists/quicklisp/software/iolib-20150302-git/src/syscalls/ffi-types-unix" "/home/hijarian/systems/cl-test-grid/work-dir/agent/test-runs/20150303132800-sbcl-1.2.3-linux-x64/fasl/ql/dists/quicklisp/software/iolib-20150302-git/src/syscalls/ffi-types-unix.c" Output was: /home/hijarian/systems/cl-test-grid/work-dir/agent/test-runs/20150303132800-sbcl-1.2.3-linux-x64/fasl/ql/dists/quicklisp/software/iolib-20150302-git/src/syscalls/ffi-types-unix.c:14:17: fatal error: lfp.h: Нет такого файла или каталога #include <lfp.h> ^ compilation terminated.
(LOAD iolib FAIL) COMMON-LISP:SIMPLE-ERROR : External process exited with code 1. Command was: "g++" "-m64" "-Wno-write-strings" "-I/home/hijarian/systems/cl-test-grid/work-dir/agent/quicklisp/dists/quicklisp/software/iolib-20150302-git/src/grovel/" "-o" "/home/hijarian/systems/cl-test-grid/work-dir/agent/test-runs/20150303132800-sbcl-1.2.3-linux-x64/fasl/ql/dists/quicklisp/software/iolib-20150302-git/src/syscalls/ffi-types-unix" "/home/hijarian/systems/cl-test-grid/work-dir/agent/test-runs/20150303132800-sbcl-1.2.3-linux-x64/fasl/ql/dists/quicklisp/software/iolib-20150302-git/src/syscalls/ffi-types-unix.c" Output was: /home/hijarian/systems/cl-test-grid/work-dir/agent/test-runs/20150303132800-sbcl-1.2.3-linux-x64/fasl/ql/dists/quicklisp/software/iolib-20150302-git/src/syscalls/ffi-types-unix.c:14:17: fatal error: lfp.h: Нет такого файла или каталога #include <lfp.h> ^ compilation terminated.
sbcl-1.2.6-linux-x86
sbcl-1.2.8-linux-x64
(LOAD iolib.trivial-sockets FAIL) COMMON-LISP:SIMPLE-ERROR : External process exited with code 1. Command was: "g++" "-m64" "-Wno-write-strings" "-I/home/joram/dev/lisp/cl-test-grid/work-dir/agent/quicklisp/dists/quicklisp/software/iolib-20150302-git/src/grovel/" "-o" "/home/joram/dev/lisp/cl-test-grid/work-dir/agent/test-runs/20150316154043-sbcl-1.2.8-linux-x64/fasl/ql/dists/quicklisp/software/iolib-20150302-git/src/syscalls/ffi-types-unix" "/home/joram/dev/lisp/cl-test-grid/work-dir/agent/test-runs/20150316154043-sbcl-1.2.8-linux-x64/fasl/ql/dists/quicklisp/software/iolib-20150302-git/src/syscalls/ffi-types-unix.c" Output was: /home/joram/dev/lisp/cl-test-grid/work-dir/agent/test-runs/20150316154043-sbcl-1.2.8-linux-x64/fasl/ql/dists/quicklisp/software/iolib-20150302-git/src/syscalls/ffi-types-unix.c:14:17: fatal error: lfp.h: No such file or directory #include <lfp.h> ^ compilation terminated.
(LOAD iolib.syscalls FAIL) COMMON-LISP:SIMPLE-ERROR : External process exited with code 1. Command was: "g++" "-m64" "-Wno-write-strings" "-I/home/joram/dev/lisp/cl-test-grid/work-dir/agent/quicklisp/dists/quicklisp/software/iolib-20150302-git/src/grovel/" "-o" "/home/joram/dev/lisp/cl-test-grid/work-dir/agent/test-runs/20150316154043-sbcl-1.2.8-linux-x64/fasl/ql/dists/quicklisp/software/iolib-20150302-git/src/syscalls/ffi-types-unix" "/home/joram/dev/lisp/cl-test-grid/work-dir/agent/test-runs/20150316154043-sbcl-1.2.8-linux-x64/fasl/ql/dists/quicklisp/software/iolib-20150302-git/src/syscalls/ffi-types-unix.c" Output was: /home/joram/dev/lisp/cl-test-grid/work-dir/agent/test-runs/20150316154043-sbcl-1.2.8-linux-x64/fasl/ql/dists/quicklisp/software/iolib-20150302-git/src/syscalls/ffi-types-unix.c:14:17: fatal error: lfp.h: No such file or directory #include <lfp.h> ^ compilation terminated.
(LOAD iolib.streams FAIL) COMMON-LISP:SIMPLE-ERROR : External process exited with code 1. Command was: "g++" "-m64" "-Wno-write-strings" "-I/home/joram/dev/lisp/cl-test-grid/work-dir/agent/quicklisp/dists/quicklisp/software/iolib-20150302-git/src/grovel/" "-o" "/home/joram/dev/lisp/cl-test-grid/work-dir/agent/test-runs/20150316154043-sbcl-1.2.8-linux-x64/fasl/ql/dists/quicklisp/software/iolib-20150302-git/src/syscalls/ffi-types-unix" "/home/joram/dev/lisp/cl-test-grid/work-dir/agent/test-runs/20150316154043-sbcl-1.2.8-linux-x64/fasl/ql/dists/quicklisp/software/iolib-20150302-git/src/syscalls/ffi-types-unix.c" Output was: /home/joram/dev/lisp/cl-test-grid/work-dir/agent/test-runs/20150316154043-sbcl-1.2.8-linux-x64/fasl/ql/dists/quicklisp/software/iolib-20150302-git/src/syscalls/ffi-types-unix.c:14:17: fatal error: lfp.h: No such file or directory #include <lfp.h> ^ compilation terminated.
(LOAD iolib.sockets FAIL) COMMON-LISP:SIMPLE-ERROR : External process exited with code 1. Command was: "g++" "-m64" "-Wno-write-strings" "-I/home/joram/dev/lisp/cl-test-grid/work-dir/agent/quicklisp/dists/quicklisp/software/iolib-20150302-git/src/grovel/" "-o" "/home/joram/dev/lisp/cl-test-grid/work-dir/agent/test-runs/20150316154043-sbcl-1.2.8-linux-x64/fasl/ql/dists/quicklisp/software/iolib-20150302-git/src/syscalls/ffi-types-unix" "/home/joram/dev/lisp/cl-test-grid/work-dir/agent/test-runs/20150316154043-sbcl-1.2.8-linux-x64/fasl/ql/dists/quicklisp/software/iolib-20150302-git/src/syscalls/ffi-types-unix.c" Output was: /home/joram/dev/lisp/cl-test-grid/work-dir/agent/test-runs/20150316154043-sbcl-1.2.8-linux-x64/fasl/ql/dists/quicklisp/software/iolib-20150302-git/src/syscalls/ffi-types-unix.c:14:17: fatal error: lfp.h: No such file or directory #include <lfp.h> ^ compilation terminated.
(LOAD iolib.pathnames FAIL) COMMON-LISP:SIMPLE-ERROR : External process exited with code 1. Command was: "g++" "-m64" "-Wno-write-strings" "-I/home/joram/dev/lisp/cl-test-grid/work-dir/agent/quicklisp/dists/quicklisp/software/iolib-20150302-git/src/grovel/" "-o" "/home/joram/dev/lisp/cl-test-grid/work-dir/agent/test-runs/20150316154043-sbcl-1.2.8-linux-x64/fasl/ql/dists/quicklisp/software/iolib-20150302-git/src/syscalls/ffi-types-unix" "/home/joram/dev/lisp/cl-test-grid/work-dir/agent/test-runs/20150316154043-sbcl-1.2.8-linux-x64/fasl/ql/dists/quicklisp/software/iolib-20150302-git/src/syscalls/ffi-types-unix.c" Output was: /home/joram/dev/lisp/cl-test-grid/work-dir/agent/test-runs/20150316154043-sbcl-1.2.8-linux-x64/fasl/ql/dists/quicklisp/software/iolib-20150302-git/src/syscalls/ffi-types-unix.c:14:17: fatal error: lfp.h: No such file or directory #include <lfp.h> ^ compilation terminated.
(LOAD iolib.os FAIL) COMMON-LISP:SIMPLE-ERROR : External process exited with code 1. Command was: "g++" "-m64" "-Wno-write-strings" "-I/home/joram/dev/lisp/cl-test-grid/work-dir/agent/quicklisp/dists/quicklisp/software/iolib-20150302-git/src/grovel/" "-o" "/home/joram/dev/lisp/cl-test-grid/work-dir/agent/test-runs/20150316154043-sbcl-1.2.8-linux-x64/fasl/ql/dists/quicklisp/software/iolib-20150302-git/src/syscalls/ffi-types-unix" "/home/joram/dev/lisp/cl-test-grid/work-dir/agent/test-runs/20150316154043-sbcl-1.2.8-linux-x64/fasl/ql/dists/quicklisp/software/iolib-20150302-git/src/syscalls/ffi-types-unix.c" Output was: /home/joram/dev/lisp/cl-test-grid/work-dir/agent/test-runs/20150316154043-sbcl-1.2.8-linux-x64/fasl/ql/dists/quicklisp/software/iolib-20150302-git/src/syscalls/ffi-types-unix.c:14:17: fatal error: lfp.h: No such file or directory #include <lfp.h> ^ compilation terminated.
(LOAD iolib.multiplex FAIL) COMMON-LISP:SIMPLE-ERROR : External process exited with code 1. Command was: "g++" "-m64" "-Wno-write-strings" "-I/home/joram/dev/lisp/cl-test-grid/work-dir/agent/quicklisp/dists/quicklisp/software/iolib-20150302-git/src/grovel/" "-o" "/home/joram/dev/lisp/cl-test-grid/work-dir/agent/test-runs/20150316154043-sbcl-1.2.8-linux-x64/fasl/ql/dists/quicklisp/software/iolib-20150302-git/src/syscalls/ffi-types-unix" "/home/joram/dev/lisp/cl-test-grid/work-dir/agent/test-runs/20150316154043-sbcl-1.2.8-linux-x64/fasl/ql/dists/quicklisp/software/iolib-20150302-git/src/syscalls/ffi-types-unix.c" Output was: /home/joram/dev/lisp/cl-test-grid/work-dir/agent/test-runs/20150316154043-sbcl-1.2.8-linux-x64/fasl/ql/dists/quicklisp/software/iolib-20150302-git/src/syscalls/ffi-types-unix.c:14:17: fatal error: lfp.h: No such file or directory #include <lfp.h> ^ compilation terminated.
(LOAD iolib.examples FAIL) COMMON-LISP:SIMPLE-ERROR : External process exited with code 1. Command was: "g++" "-m64" "-Wno-write-strings" "-I/home/joram/dev/lisp/cl-test-grid/work-dir/agent/quicklisp/dists/quicklisp/software/iolib-20150302-git/src/grovel/" "-o" "/home/joram/dev/lisp/cl-test-grid/work-dir/agent/test-runs/20150316154043-sbcl-1.2.8-linux-x64/fasl/ql/dists/quicklisp/software/iolib-20150302-git/src/syscalls/ffi-types-unix" "/home/joram/dev/lisp/cl-test-grid/work-dir/agent/test-runs/20150316154043-sbcl-1.2.8-linux-x64/fasl/ql/dists/quicklisp/software/iolib-20150302-git/src/syscalls/ffi-types-unix.c" Output was: /home/joram/dev/lisp/cl-test-grid/work-dir/agent/test-runs/20150316154043-sbcl-1.2.8-linux-x64/fasl/ql/dists/quicklisp/software/iolib-20150302-git/src/syscalls/ffi-types-unix.c:14:17: fatal error: lfp.h: No such file or directory #include <lfp.h> ^ compilation terminated.
(LOAD iolib-tests FAIL) COMMON-LISP:SIMPLE-ERROR : External process exited with code 1. Command was: "g++" "-m64" "-Wno-write-strings" "-I/home/joram/dev/lisp/cl-test-grid/work-dir/agent/quicklisp/dists/quicklisp/software/iolib-20150302-git/src/grovel/" "-o" "/home/joram/dev/lisp/cl-test-grid/work-dir/agent/test-runs/20150316154043-sbcl-1.2.8-linux-x64/fasl/ql/dists/quicklisp/software/iolib-20150302-git/src/syscalls/ffi-types-unix" "/home/joram/dev/lisp/cl-test-grid/work-dir/agent/test-runs/20150316154043-sbcl-1.2.8-linux-x64/fasl/ql/dists/quicklisp/software/iolib-20150302-git/src/syscalls/ffi-types-unix.c" Output was: /home/joram/dev/lisp/cl-test-grid/work-dir/agent/test-runs/20150316154043-sbcl-1.2.8-linux-x64/fasl/ql/dists/quicklisp/software/iolib-20150302-git/src/syscalls/ffi-types-unix.c:14:17: fatal error: lfp.h: No such file or directory #include <lfp.h> ^ compilation terminated.
(LOAD iolib FAIL) COMMON-LISP:SIMPLE-ERROR : External process exited with code 1. Command was: "g++" "-m64" "-Wno-write-strings" "-I/home/joram/dev/lisp/cl-test-grid/work-dir/agent/quicklisp/dists/quicklisp/software/iolib-20150302-git/src/grovel/" "-o" "/home/joram/dev/lisp/cl-test-grid/work-dir/agent/test-runs/20150316154043-sbcl-1.2.8-linux-x64/fasl/ql/dists/quicklisp/software/iolib-20150302-git/src/syscalls/ffi-types-unix" "/home/joram/dev/lisp/cl-test-grid/work-dir/agent/test-runs/20150316154043-sbcl-1.2.8-linux-x64/fasl/ql/dists/quicklisp/software/iolib-20150302-git/src/syscalls/ffi-types-unix.c" Output was: /home/joram/dev/lisp/cl-test-grid/work-dir/agent/test-runs/20150316154043-sbcl-1.2.8-linux-x64/fasl/ql/dists/quicklisp/software/iolib-20150302-git/src/syscalls/ffi-types-unix.c:14:17: fatal error: lfp.h: No such file or directory #include <lfp.h> ^ compilation terminated.

Breakdown by testcases: for every failed testcase the lisp implmentations it fails on

The library does not have a testsuite adapter for CL Test Grid.

To reports overview

Generated at: 2015-04-17 13:41:48 GMT.