hunchentoot-single-signon results collected by cl-test-grid

Results on the last two Quicklisp distributions

 quicklisp 2015-06-08quicklisp 2015-05-05
abcl-1.2.1-fasl42-linux-x86
(LOAD hunchentoot-single-signon FAIL) ffi-grovel, CFFI-GROVEL:GROVEL-ERROR : External process exited with code 1. Command was: "cc" "-m32" "-I/home/testgrid/cl-test-grid/work-dir/agent/quicklisp/dists/quicklisp/software/cffi_0.15.0/" "-o" "/home/testgrid/cl-test-grid/work-dir/agent/test-runs/20150613074742-abcl-1.2.1-fasl42-linux-x86/fasl/ql/dists/quicklisp/software/cl-gss-20150302-git/src/gss-grovel" "/home/testgrid/cl-test-grid/work-dir/agent/test-runs/20150613074742-abcl-1.2.1-fasl42-linux-x86/fasl/ql/dists/quicklisp/software/cl-gss-20150302-git/src/gss-grovel.c" Output was: /home/testgrid/cl-test-grid/work-dir/agent/test-runs/20150613074742-abcl-1.2.1-fasl42-linux-x86/fasl/ql/dists/quicklisp/software/cl-gss-20150302-git/src/gss-grovel.c:6:27: fatal error: gssapi/gssapi.h: No such file or directory compilation terminated.
(LOAD hunchentoot-single-signon FAIL) ffi-grovel, CFFI-GROVEL:GROVEL-ERROR : External process exited with code 1. Command was: "cc" "-m32" "-I/home/testgrid/cl-test-grid/work-dir/agent/quicklisp/dists/quicklisp/software/cffi_0.14.0/" "-o" "/home/testgrid/cl-test-grid/work-dir/agent/test-runs/20150510230903-abcl-1.2.1-fasl42-linux-x86/fasl/ql/dists/quicklisp/software/cl-gss-20150302-git/src/gss-grovel" "/home/testgrid/cl-test-grid/work-dir/agent/test-runs/20150510230903-abcl-1.2.1-fasl42-linux-x86/fasl/ql/dists/quicklisp/software/cl-gss-20150302-git/src/gss-grovel.c" Output was: /home/testgrid/cl-test-grid/work-dir/agent/test-runs/20150510230903-abcl-1.2.1-fasl42-linux-x86/fasl/ql/dists/quicklisp/software/cl-gss-20150302-git/src/gss-grovel.c:6:27: fatal error: gssapi/gssapi.h: No such file or directory compilation terminated.
abcl-1.3.0-fasl42-linux-x86
(LOAD hunchentoot-single-signon FAIL) ffi-grovel, CFFI-GROVEL:GROVEL-ERROR : External process exited with code 1. Command was: "cc" "-m32" "-I/home/testgrid/cl-test-grid/work-dir/agent/quicklisp/dists/quicklisp/software/cffi_0.15.0/" "-o" "/home/testgrid/cl-test-grid/work-dir/agent/test-runs/20150612174239-abcl-1.3.0-fasl42-linux-x86/fasl/ql/dists/quicklisp/software/cl-gss-20150302-git/src/gss-grovel" "/home/testgrid/cl-test-grid/work-dir/agent/test-runs/20150612174239-abcl-1.3.0-fasl42-linux-x86/fasl/ql/dists/quicklisp/software/cl-gss-20150302-git/src/gss-grovel.c" Output was: /home/testgrid/cl-test-grid/work-dir/agent/test-runs/20150612174239-abcl-1.3.0-fasl42-linux-x86/fasl/ql/dists/quicklisp/software/cl-gss-20150302-git/src/gss-grovel.c:6:27: fatal error: gssapi/gssapi.h: No such file or directory compilation terminated.
(LOAD hunchentoot-single-signon FAIL) ffi-grovel, CFFI-GROVEL:GROVEL-ERROR : External process exited with code 1. Command was: "cc" "-m32" "-I/home/testgrid/cl-test-grid/work-dir/agent/quicklisp/dists/quicklisp/software/cffi_0.14.0/" "-o" "/home/testgrid/cl-test-grid/work-dir/agent/test-runs/20150510102428-abcl-1.3.0-fasl42-linux-x86/fasl/ql/dists/quicklisp/software/cl-gss-20150302-git/src/gss-grovel" "/home/testgrid/cl-test-grid/work-dir/agent/test-runs/20150510102428-abcl-1.3.0-fasl42-linux-x86/fasl/ql/dists/quicklisp/software/cl-gss-20150302-git/src/gss-grovel.c" Output was: /home/testgrid/cl-test-grid/work-dir/agent/test-runs/20150510102428-abcl-1.3.0-fasl42-linux-x86/fasl/ql/dists/quicklisp/software/cl-gss-20150302-git/src/gss-grovel.c:6:27: fatal error: gssapi/gssapi.h: No such file or directory compilation terminated.
abcl-1.3.1-fasl42-linux-x86
(LOAD hunchentoot-single-signon FAIL) ffi-grovel, CFFI-GROVEL:GROVEL-ERROR : External process exited with code 1. Command was: "cc" "-m32" "-I/home/testgrid/cl-test-grid/work-dir/agent/quicklisp/dists/quicklisp/software/cffi_0.15.0/" "-o" "/home/testgrid/cl-test-grid/work-dir/agent/test-runs/20150612012527-abcl-1.3.1-fasl42-linux-x86/fasl/ql/dists/quicklisp/software/cl-gss-20150302-git/src/gss-grovel" "/home/testgrid/cl-test-grid/work-dir/agent/test-runs/20150612012527-abcl-1.3.1-fasl42-linux-x86/fasl/ql/dists/quicklisp/software/cl-gss-20150302-git/src/gss-grovel.c" Output was: /home/testgrid/cl-test-grid/work-dir/agent/test-runs/20150612012527-abcl-1.3.1-fasl42-linux-x86/fasl/ql/dists/quicklisp/software/cl-gss-20150302-git/src/gss-grovel.c:6:27: fatal error: gssapi/gssapi.h: No such file or directory compilation terminated.
(LOAD hunchentoot-single-signon FAIL) ffi-grovel, CFFI-GROVEL:GROVEL-ERROR : External process exited with code 1. Command was: "cc" "-m32" "-I/home/testgrid/cl-test-grid/work-dir/agent/quicklisp/dists/quicklisp/software/cffi_0.14.0/" "-o" "/home/testgrid/cl-test-grid/work-dir/agent/test-runs/20150509182502-abcl-1.3.1-fasl42-linux-x86/fasl/ql/dists/quicklisp/software/cl-gss-20150302-git/src/gss-grovel" "/home/testgrid/cl-test-grid/work-dir/agent/test-runs/20150509182502-abcl-1.3.1-fasl42-linux-x86/fasl/ql/dists/quicklisp/software/cl-gss-20150302-git/src/gss-grovel.c" Output was: /home/testgrid/cl-test-grid/work-dir/agent/test-runs/20150509182502-abcl-1.3.1-fasl42-linux-x86/fasl/ql/dists/quicklisp/software/cl-gss-20150302-git/src/gss-grovel.c:6:27: fatal error: gssapi/gssapi.h: No such file or directory compilation terminated.
abcl-1.3.2-fasl42-linux-x86
(LOAD hunchentoot-single-signon FAIL) ffi-grovel, CFFI-GROVEL:GROVEL-ERROR : External process exited with code 1. Command was: "cc" "-m32" "-I/home/testgrid/cl-test-grid/work-dir/agent/quicklisp/dists/quicklisp/software/cffi_0.15.0/" "-o" "/home/testgrid/cl-test-grid/work-dir/agent/test-runs/20150610052319-abcl-1.3.2-fasl42-linux-x86/fasl/ql/dists/quicklisp/software/cl-gss-20150302-git/src/gss-grovel" "/home/testgrid/cl-test-grid/work-dir/agent/test-runs/20150610052319-abcl-1.3.2-fasl42-linux-x86/fasl/ql/dists/quicklisp/software/cl-gss-20150302-git/src/gss-grovel.c" Output was: /home/testgrid/cl-test-grid/work-dir/agent/test-runs/20150610052319-abcl-1.3.2-fasl42-linux-x86/fasl/ql/dists/quicklisp/software/cl-gss-20150302-git/src/gss-grovel.c:6:27: fatal error: gssapi/gssapi.h: No such file or directory compilation terminated.
(LOAD hunchentoot-single-signon FAIL) ffi-grovel, CFFI-GROVEL:GROVEL-ERROR : External process exited with code 1. Command was: "cc" "-m32" "-I/home/testgrid/cl-test-grid/work-dir/agent/quicklisp/dists/quicklisp/software/cffi_0.14.0/" "-o" "/home/testgrid/cl-test-grid/work-dir/agent/test-runs/20150507074959-abcl-1.3.2-fasl42-linux-x86/fasl/ql/dists/quicklisp/software/cl-gss-20150302-git/src/gss-grovel" "/home/testgrid/cl-test-grid/work-dir/agent/test-runs/20150507074959-abcl-1.3.2-fasl42-linux-x86/fasl/ql/dists/quicklisp/software/cl-gss-20150302-git/src/gss-grovel.c" Output was: /home/testgrid/cl-test-grid/work-dir/agent/test-runs/20150507074959-abcl-1.3.2-fasl42-linux-x86/fasl/ql/dists/quicklisp/software/cl-gss-20150302-git/src/gss-grovel.c:6:27: fatal error: gssapi/gssapi.h: No such file or directory compilation terminated.
ccl-1.10-r16196-f96-linux-x64
(LOAD hunchentoot-single-signon FAIL) ffi-grovel, CFFI-GROVEL:GROVEL-ERROR : External process exited with code 1. Command was: "cc" "-m64" "-I/home/hijarian/systems/cl-test-grid/work-dir/agent/quicklisp/dists/quicklisp/software/cffi_0.15.0/" "-o" "/home/hijarian/systems/cl-test-grid/work-dir/agent/test-runs/20150609102449-ccl-1.10-r16196-f96-linux-x64/fasl/ql/dists/quicklisp/software/cl-gss-20150302-git/src/gss-grovel" "/home/hijarian/systems/cl-test-grid/work-dir/agent/test-runs/20150609102449-ccl-1.10-r16196-f96-linux-x64/fasl/ql/dists/quicklisp/software/cl-gss-20150302-git/src/gss-grovel.c" Output was: /home/hijarian/systems/cl-test-grid/work-dir/agent/test-runs/20150609102449-ccl-1.10-r16196-f96-linux-x64/fasl/ql/dists/quicklisp/software/cl-gss-20150302-git/src/gss-grovel.c:6:27: fatal error: gssapi/gssapi.h: Нет такого файла или каталога #include <gssapi/gssapi.h> ^ compilation terminated.
(LOAD hunchentoot-single-signon FAIL) ffi-grovel, CFFI-GROVEL:GROVEL-ERROR : External process exited with code 1. Command was: "cc" "-m64" "-I/home/hijarian/systems/cl-test-grid/work-dir/agent/quicklisp/dists/quicklisp/software/cffi_0.14.0/" "-o" "/home/hijarian/systems/cl-test-grid/work-dir/agent/test-runs/20150518161431-ccl-1.10-r16196-f96-linux-x64/fasl/ql/dists/quicklisp/software/cl-gss-20150302-git/src/gss-grovel" "/home/hijarian/systems/cl-test-grid/work-dir/agent/test-runs/20150518161431-ccl-1.10-r16196-f96-linux-x64/fasl/ql/dists/quicklisp/software/cl-gss-20150302-git/src/gss-grovel.c" Output was: /home/hijarian/systems/cl-test-grid/work-dir/agent/test-runs/20150518161431-ccl-1.10-r16196-f96-linux-x64/fasl/ql/dists/quicklisp/software/cl-gss-20150302-git/src/gss-grovel.c:6:27: fatal error: gssapi/gssapi.h: Нет такого файла или каталога #include <gssapi/gssapi.h> ^ compilation terminated.
ccl-1.10-r16196-f96-linux-x86
(LOAD hunchentoot-single-signon FAIL) ffi-grovel, CFFI-GROVEL:GROVEL-ERROR : External process exited with code 1. Command was: "cc" "-m32" "-I/home/testgrid/cl-test-grid/work-dir/agent/quicklisp/dists/quicklisp/software/cffi_0.15.0/" "-o" "/home/testgrid/cl-test-grid/work-dir/agent/test-runs/20150609131725-ccl-1.10-r16196-f96-linux-x86/fasl/ql/dists/quicklisp/software/cl-gss-20150302-git/src/gss-grovel" "/home/testgrid/cl-test-grid/work-dir/agent/test-runs/20150609131725-ccl-1.10-r16196-f96-linux-x86/fasl/ql/dists/quicklisp/software/cl-gss-20150302-git/src/gss-grovel.c" Output was: /home/testgrid/cl-test-grid/work-dir/agent/test-runs/20150609131725-ccl-1.10-r16196-f96-linux-x86/fasl/ql/dists/quicklisp/software/cl-gss-20150302-git/src/gss-grovel.c:6:27: fatal error: gssapi/gssapi.h: No such file or directory compilation terminated.
(LOAD hunchentoot-single-signon FAIL) ffi-grovel, CFFI-GROVEL:GROVEL-ERROR : External process exited with code 1. Command was: "cc" "-m32" "-I/home/testgrid/cl-test-grid/work-dir/agent/quicklisp/dists/quicklisp/software/cffi_0.14.0/" "-o" "/home/testgrid/cl-test-grid/work-dir/agent/test-runs/20150506162937-ccl-1.10-r16196-f96-linux-x86/fasl/ql/dists/quicklisp/software/cl-gss-20150302-git/src/gss-grovel" "/home/testgrid/cl-test-grid/work-dir/agent/test-runs/20150506162937-ccl-1.10-r16196-f96-linux-x86/fasl/ql/dists/quicklisp/software/cl-gss-20150302-git/src/gss-grovel.c" Output was: /home/testgrid/cl-test-grid/work-dir/agent/test-runs/20150506162937-ccl-1.10-r16196-f96-linux-x86/fasl/ql/dists/quicklisp/software/cl-gss-20150302-git/src/gss-grovel.c:6:27: fatal error: gssapi/gssapi.h: No such file or directory compilation terminated.
ccl-1.8-r15286m-f95-linux-x86
(LOAD hunchentoot-single-signon FAIL) ffi-grovel, CFFI-GROVEL:GROVEL-ERROR : External process exited with code 1. Command was: "cc" "-m32" "-I/home/testgrid/cl-test-grid/work-dir/agent/quicklisp/dists/quicklisp/software/cffi_0.15.0/" "-o" "/home/testgrid/cl-test-grid/work-dir/agent/test-runs/20150611072354-ccl-1.8-r15286m-f95-linux-x86/fasl/ql/dists/quicklisp/software/cl-gss-20150302-git/src/gss-grovel" "/home/testgrid/cl-test-grid/work-dir/agent/test-runs/20150611072354-ccl-1.8-r15286m-f95-linux-x86/fasl/ql/dists/quicklisp/software/cl-gss-20150302-git/src/gss-grovel.c" Output was: /home/testgrid/cl-test-grid/work-dir/agent/test-runs/20150611072354-ccl-1.8-r15286m-f95-linux-x86/fasl/ql/dists/quicklisp/software/cl-gss-20150302-git/src/gss-grovel.c:6:27: fatal error: gssapi/gssapi.h: No such file or directory compilation terminated.
(LOAD hunchentoot-single-signon FAIL) ffi-grovel, CFFI-GROVEL:GROVEL-ERROR : External process exited with code 1. Command was: "cc" "-m32" "-I/home/testgrid/cl-test-grid/work-dir/agent/quicklisp/dists/quicklisp/software/cffi_0.14.0/" "-o" "/home/testgrid/cl-test-grid/work-dir/agent/test-runs/20150508235734-ccl-1.8-r15286m-f95-linux-x86/fasl/ql/dists/quicklisp/software/cl-gss-20150302-git/src/gss-grovel" "/home/testgrid/cl-test-grid/work-dir/agent/test-runs/20150508235734-ccl-1.8-r15286m-f95-linux-x86/fasl/ql/dists/quicklisp/software/cl-gss-20150302-git/src/gss-grovel.c" Output was: /home/testgrid/cl-test-grid/work-dir/agent/test-runs/20150508235734-ccl-1.8-r15286m-f95-linux-x86/fasl/ql/dists/quicklisp/software/cl-gss-20150302-git/src/gss-grovel.c:6:27: fatal error: gssapi/gssapi.h: No such file or directory compilation terminated.
ccl-1.9-r15756-f96-linux-x86
(LOAD hunchentoot-single-signon FAIL) ffi-grovel, CFFI-GROVEL:GROVEL-ERROR : External process exited with code 1. Command was: "cc" "-m32" "-I/home/testgrid/cl-test-grid/work-dir/agent/quicklisp/dists/quicklisp/software/cffi_0.15.0/" "-o" "/home/testgrid/cl-test-grid/work-dir/agent/test-runs/20150610212202-ccl-1.9-r15756-f96-linux-x86/fasl/ql/dists/quicklisp/software/cl-gss-20150302-git/src/gss-grovel" "/home/testgrid/cl-test-grid/work-dir/agent/test-runs/20150610212202-ccl-1.9-r15756-f96-linux-x86/fasl/ql/dists/quicklisp/software/cl-gss-20150302-git/src/gss-grovel.c" Output was: /home/testgrid/cl-test-grid/work-dir/agent/test-runs/20150610212202-ccl-1.9-r15756-f96-linux-x86/fasl/ql/dists/quicklisp/software/cl-gss-20150302-git/src/gss-grovel.c:6:27: fatal error: gssapi/gssapi.h: No such file or directory compilation terminated.
(LOAD hunchentoot-single-signon FAIL) ffi-grovel, CFFI-GROVEL:GROVEL-ERROR : External process exited with code 1. Command was: "cc" "-m32" "-I/home/testgrid/cl-test-grid/work-dir/agent/quicklisp/dists/quicklisp/software/cffi_0.14.0/" "-o" "/home/testgrid/cl-test-grid/work-dir/agent/test-runs/20150507231310-ccl-1.9-r15756-f96-linux-x86/fasl/ql/dists/quicklisp/software/cl-gss-20150302-git/src/gss-grovel" "/home/testgrid/cl-test-grid/work-dir/agent/test-runs/20150507231310-ccl-1.9-r15756-f96-linux-x86/fasl/ql/dists/quicklisp/software/cl-gss-20150302-git/src/gss-grovel.c" Output was: /home/testgrid/cl-test-grid/work-dir/agent/test-runs/20150507231310-ccl-1.9-r15756-f96-linux-x86/fasl/ql/dists/quicklisp/software/cl-gss-20150302-git/src/gss-grovel.c:6:27: fatal error: gssapi/gssapi.h: No such file or directory compilation terminated.
clisp-2.49-unix-x64
(LOAD hunchentoot-single-signon FAIL) ffi-grovel, CFFI-GROVEL:GROVEL-ERROR : External process exited with code 1. Command was: "cc" "-m64" "-I/home/hijarian/systems/cl-test-grid/work-dir/agent/quicklisp/dists/quicklisp/software/cffi_0.15.0/" "-o" "/home/hijarian/systems/cl-test-grid/work-dir/agent/test-runs/20150609082334-clisp-2.49-unix-x64/fasl/ql/dists/quicklisp/software/cl-gss-20150302-git/src/gss-grovel" "/home/hijarian/systems/cl-test-grid/work-dir/agent/test-runs/20150609082334-clisp-2.49-unix-x64/fasl/ql/dists/quicklisp/software/cl-gss-20150302-git/src/gss-grovel.c" Output was: <see above>
(LOAD hunchentoot-single-signon FAIL) ffi-grovel, CFFI-GROVEL:GROVEL-ERROR : External process exited with code 1. Command was: "cc" "-m64" "-I/home/hijarian/systems/cl-test-grid/work-dir/agent/quicklisp/dists/quicklisp/software/cffi_0.14.0/" "-o" "/home/hijarian/systems/cl-test-grid/work-dir/agent/test-runs/20150518134347-clisp-2.49-unix-x64/fasl/ql/dists/quicklisp/software/cl-gss-20150302-git/src/gss-grovel" "/home/hijarian/systems/cl-test-grid/work-dir/agent/test-runs/20150518134347-clisp-2.49-unix-x64/fasl/ql/dists/quicklisp/software/cl-gss-20150302-git/src/gss-grovel.c" Output was: <see above>
clisp-2.49-unix-x86
(LOAD hunchentoot-single-signon FAIL) ffi-grovel, CFFI-GROVEL:GROVEL-ERROR : External process exited with code 1. Command was: "cc" "-m32" "-I/home/testgrid/cl-test-grid/work-dir/agent/quicklisp/dists/quicklisp/software/cffi_0.15.0/" "-o" "/home/testgrid/cl-test-grid/work-dir/agent/test-runs/20150609200332-clisp-2.49-unix-x86/fasl/ql/dists/quicklisp/software/cl-gss-20150302-git/src/gss-grovel" "/home/testgrid/cl-test-grid/work-dir/agent/test-runs/20150609200332-clisp-2.49-unix-x86/fasl/ql/dists/quicklisp/software/cl-gss-20150302-git/src/gss-grovel.c" Output was: <see above>
(LOAD hunchentoot-single-signon FAIL) ffi-grovel, CFFI-GROVEL:GROVEL-ERROR : External process exited with code 1. Command was: "cc" "-m32" "-I/home/testgrid/cl-test-grid/work-dir/agent/quicklisp/dists/quicklisp/software/cffi_0.14.0/" "-o" "/home/testgrid/cl-test-grid/work-dir/agent/test-runs/20150506223916-clisp-2.49-unix-x86/fasl/ql/dists/quicklisp/software/cl-gss-20150302-git/src/gss-grovel" "/home/testgrid/cl-test-grid/work-dir/agent/test-runs/20150506223916-clisp-2.49-unix-x86/fasl/ql/dists/quicklisp/software/cl-gss-20150302-git/src/gss-grovel.c" Output was: <see above>
cmu-snapshot-2013-04__20d_unicode_-linux-x86
(LOAD hunchentoot-single-signon FAIL) ffi-grovel, CFFI-GROVEL:GROVEL-ERROR : Error in function CFFI-GROVEL:GROVEL-ERROR: External process exited with code 1. Command was: "cc" "-m32" "-I/home/testgrid/cl-test-grid/work-dir/agent/quicklisp/dists/quicklisp/software/cffi_0.15.0/" "-o" "/home/testgrid/cl-test-grid/work-dir/agent/test-runs/20150611151007-cmu-snapshot-2013-04__20d_unicode_-linux-x86/fasl/ql/dists/quicklisp/software/cl-gss-20150302-git/src/gss-grovel" "/home/testgrid/cl-test-grid/work-dir/agent/test-runs/20150611151007-cmu-snapshot-2013-04__20d_unicode_-linux-x86/fasl/ql/dists/quicklisp/software/cl-gss-20150302-git/src/gss-grovel.c" Output was: /home/testgrid/cl-test-grid/work-dir/agent/test-runs/20150611151007-cmu-snapshot-2013-04__20d_unicode_-linux-x86/fasl/ql/dists/quicklisp/software/cl-gss-20150302-git/src/gss-grovel.c:6:27: fatal error: gssapi/gssapi.h: No such file or directory compilation terminated.
(LOAD hunchentoot-single-signon FAIL) ffi-grovel, CFFI-GROVEL:GROVEL-ERROR : Error in function CFFI-GROVEL:GROVEL-ERROR: External process exited with code 1. Command was: "cc" "-m32" "-I/home/testgrid/cl-test-grid/work-dir/agent/quicklisp/dists/quicklisp/software/cffi_0.14.0/" "-o" "/home/testgrid/cl-test-grid/work-dir/agent/test-runs/20150509081147-cmu-snapshot-2013-04__20d_unicode_-linux-x86/fasl/ql/dists/quicklisp/software/cl-gss-20150302-git/src/gss-grovel" "/home/testgrid/cl-test-grid/work-dir/agent/test-runs/20150509081147-cmu-snapshot-2013-04__20d_unicode_-linux-x86/fasl/ql/dists/quicklisp/software/cl-gss-20150302-git/src/gss-grovel.c" Output was: /home/testgrid/cl-test-grid/work-dir/agent/test-runs/20150509081147-cmu-snapshot-2013-04__20d_unicode_-linux-x86/fasl/ql/dists/quicklisp/software/cl-gss-20150302-git/src/gss-grovel.c:6:27: fatal error: gssapi/gssapi.h: No such file or directory compilation terminated.
cmu-snapshot-2014-01__20e_unicode_-linux-x86
(LOAD hunchentoot-single-signon FAIL) COMMON-LISP:TYPE-ERROR : #
(LOAD hunchentoot-single-signon FAIL) COMMON-LISP:TYPE-ERROR : #
cmu-snapshot-2014-05-dirty__20e_unicode_-linux-x86
(LOAD hunchentoot-single-signon FAIL) COMMON-LISP:TYPE-ERROR : #
(LOAD hunchentoot-single-signon FAIL) COMMON-LISP:TYPE-ERROR : #
cmu-snapshot-2014-12___20f_unicode_-linux-x86
(LOAD hunchentoot-single-signon FAIL) ffi-grovel, CFFI-GROVEL:GROVEL-ERROR : Error in function CFFI-GROVEL:GROVEL-ERROR: External process exited with code 1. Command was: "cc" "-m32" "-I/home/testgrid/cl-test-grid/work-dir/agent/quicklisp/dists/quicklisp/software/cffi_0.15.0/" "-o" "/home/testgrid/cl-test-grid/work-dir/agent/test-runs/20150609171751-cmu-snapshot-2014-12___20f_unicode_-linux-x86/fasl/ql/dists/quicklisp/software/cl-gss-20150302-git/src/gss-grovel" "/home/testgrid/cl-test-grid/work-dir/agent/test-runs/20150609171751-cmu-snapshot-2014-12___20f_unicode_-linux-x86/fasl/ql/dists/quicklisp/software/cl-gss-20150302-git/src/gss-grovel.c" Output was: /home/testgrid/cl-test-grid/work-dir/agent/test-runs/20150609171751-cmu-snapshot-2014-12___20f_unicode_-linux-x86/fasl/ql/dists/quicklisp/software/cl-gss-20150302-git/src/gss-grovel.c:6:27: fatal error: gssapi/gssapi.h: No such file or directory compilation terminated.
(LOAD hunchentoot-single-signon FAIL) ffi-grovel, CFFI-GROVEL:GROVEL-ERROR : Error in function CFFI-GROVEL:GROVEL-ERROR: External process exited with code 1. Command was: "cc" "-m32" "-I/home/testgrid/cl-test-grid/work-dir/agent/quicklisp/dists/quicklisp/software/cffi_0.14.0/" "-o" "/home/testgrid/cl-test-grid/work-dir/agent/test-runs/20150506195248-cmu-snapshot-2014-12___20f_unicode_-linux-x86/fasl/ql/dists/quicklisp/software/cl-gss-20150302-git/src/gss-grovel" "/home/testgrid/cl-test-grid/work-dir/agent/test-runs/20150506195248-cmu-snapshot-2014-12___20f_unicode_-linux-x86/fasl/ql/dists/quicklisp/software/cl-gss-20150302-git/src/gss-grovel.c" Output was: /home/testgrid/cl-test-grid/work-dir/agent/test-runs/20150506195248-cmu-snapshot-2014-12___20f_unicode_-linux-x86/fasl/ql/dists/quicklisp/software/cl-gss-20150302-git/src/gss-grovel.c:6:27: fatal error: gssapi/gssapi.h: No such file or directory compilation terminated.
ecl-13.5.1-unknown-linux-i686-bytecode
(LOAD hunchentoot-single-signon FAIL) ASDF/FIND-SYSTEM:LOAD-SYSTEM-DEFINITION-ERROR : Error while trying to load definition for system cl-gss from pathname /home/testgrid/cl-test-grid/work-dir/agent/quicklisp/dists/quicklisp/software/cl-gss-20150302-git/cl-gss.asd: The variable C::*CC-FLAGS* is unbound.
(LOAD hunchentoot-single-signon FAIL) ASDF/FIND-SYSTEM:LOAD-SYSTEM-DEFINITION-ERROR : Error while trying to load definition for system cl-gss from pathname /home/testgrid/cl-test-grid/work-dir/agent/quicklisp/dists/quicklisp/software/cl-gss-20150302-git/cl-gss.asd: The variable C::*CC-FLAGS* is unbound.
ecl-13.5.1-unknown-linux-i686-lisp-to-c
(LOAD hunchentoot-single-signon FAIL) ASDF/FIND-SYSTEM:LOAD-SYSTEM-DEFINITION-ERROR : Error while trying to load definition for system cl-gss from pathname /home/testgrid/cl-test-grid/work-dir/agent/quicklisp/dists/quicklisp/software/cl-gss-20150302-git/cl-gss.asd: COMPILE-FILE-ERROR while compiling #<cl-source-file "alexandria" "macros">
(LOAD hunchentoot-single-signon FAIL) ffi-grovel, CFFI-GROVEL:GROVEL-ERROR : External process exited with code 1. Command was: "cc" "-m32" " -D_GNU_SOURCE -D_FILE_OFFSET_BITS=64 -g -O2 -fPIC -D_GNU_SOURCE -D_FILE_OFFSET_BITS=64 -g -O2 -fPIC -D_THREAD_SAFE -Dlinux" "-I/home/testgrid/cl-test-grid/work-dir/agent/quicklisp/dists/quicklisp/software/cffi_0.14.0/" "-o" "/home/testgrid/cl-test-grid/work-dir/agent/test-runs/20150507041008-ecl-13.5.1-unknown-linux-i686-lisp-to-c/fasl/ql/dists/quicklisp/software/cl-gss-20150302-git/src/gss-grovel" "/home/testgrid/cl-test-grid/work-dir/agent/test-runs/20150507041008-ecl-13.5.1-unknown-linux-i686-lisp-to-c/fasl/ql/dists/quicklisp/software/cl-gss-20150302-git/src/gss-grovel.c" Output was: <see above>
ecl-15.2.21-ee989b97-linux-i686-bytecode
(LOAD hunchentoot-single-signon FAIL) ASDF/FIND-SYSTEM:LOAD-SYSTEM-DEFINITION-ERROR : Error while trying to load definition for system cl-gss from pathname /home/testgrid/cl-test-grid/work-dir/agent/quicklisp/dists/quicklisp/software/cl-gss-20150302-git/cl-gss.asd: The variable C::*CC-FLAGS* is unbound.
(LOAD hunchentoot-single-signon FAIL) ASDF/FIND-SYSTEM:LOAD-SYSTEM-DEFINITION-ERROR : Error while trying to load definition for system cl-gss from pathname /home/testgrid/cl-test-grid/work-dir/agent/quicklisp/dists/quicklisp/software/cl-gss-20150302-git/cl-gss.asd: The variable C::*CC-FLAGS* is unbound.
ecl-15.2.21-ee989b97-linux-i686-lisp-to-c
(LOAD hunchentoot-single-signon FAIL) ASDF/FIND-SYSTEM:LOAD-SYSTEM-DEFINITION-ERROR : Error while trying to load definition for system cl-gss from pathname /home/testgrid/cl-test-grid/work-dir/agent/quicklisp/dists/quicklisp/software/cl-gss-20150302-git/cl-gss.asd: COMPILE-FILE-ERROR while compiling #<cl-source-file "alexandria" "macros">
(LOAD hunchentoot-single-signon FAIL) ffi-grovel, CFFI-GROVEL:GROVEL-ERROR : External process exited with code 1. Command was: "cc" "-m32" " -D_GNU_SOURCE -D_FILE_OFFSET_BITS=64 -g -O2 -fPIC -D_THREAD_SAFE -Dlinux" "-I/home/testgrid/cl-test-grid/work-dir/agent/quicklisp/dists/quicklisp/software/cffi_0.14.0/" "-o" "/home/testgrid/cl-test-grid/work-dir/agent/test-runs/20150509143635-ecl-15.2.21-ee989b97-linux-i686-lisp-to-c/fasl/ql/dists/quicklisp/software/cl-gss-20150302-git/src/gss-grovel" "/home/testgrid/cl-test-grid/work-dir/agent/test-runs/20150509143635-ecl-15.2.21-ee989b97-linux-i686-lisp-to-c/fasl/ql/dists/quicklisp/software/cl-gss-20150302-git/src/gss-grovel.c" Output was: <see above>
ecl-15.2.21-ee989b97-linux-x64-bytecode
(LOAD hunchentoot-single-signon FAIL) ASDF/FIND-SYSTEM:LOAD-SYSTEM-DEFINITION-ERROR : Error while trying to load definition for system cl-gss from pathname /home/hijarian/systems/cl-test-grid/work-dir/agent/quicklisp/dists/quicklisp/software/cl-gss-20150302-git/cl-gss.asd: The variable C::*CC-FLAGS* is unbound.
(LOAD hunchentoot-single-signon FAIL) ASDF/FIND-SYSTEM:LOAD-SYSTEM-DEFINITION-ERROR : Error while trying to load definition for system cl-gss from pathname /home/hijarian/systems/cl-test-grid/work-dir/agent/quicklisp/dists/quicklisp/software/cl-gss-20150302-git/cl-gss.asd: The variable C::*CC-FLAGS* is unbound.
ecl-15.2.21-ee989b97-linux-x64-lisp-to-c
(LOAD hunchentoot-single-signon FAIL) ASDF/FIND-SYSTEM:LOAD-SYSTEM-DEFINITION-ERROR : Error while trying to load definition for system cl-gss from pathname /home/hijarian/systems/cl-test-grid/work-dir/agent/quicklisp/dists/quicklisp/software/cl-gss-20150302-git/cl-gss.asd: COMPILE-FILE-ERROR while compiling #<cl-source-file "alexandria" "macros">
(LOAD hunchentoot-single-signon FAIL) ffi-grovel, CFFI-GROVEL:GROVEL-ERROR : External process exited with code 1. Command was: "cc" "-m64" " -D_GNU_SOURCE -D_FILE_OFFSET_BITS=64 -g -O2 -fPIC -D_THREAD_SAFE -Dlinux" "-I/home/hijarian/systems/cl-test-grid/work-dir/agent/quicklisp/dists/quicklisp/software/cffi_0.14.0/" "-o" "/home/hijarian/systems/cl-test-grid/work-dir/agent/test-runs/20150518211124-ecl-15.2.21-ee989b97-linux-x64-lisp-to-c/fasl/ql/dists/quicklisp/software/cl-gss-20150302-git/src/gss-grovel" "/home/hijarian/systems/cl-test-grid/work-dir/agent/test-runs/20150518211124-ecl-15.2.21-ee989b97-linux-x64-lisp-to-c/fasl/ql/dists/quicklisp/software/cl-gss-20150302-git/src/gss-grovel.c" Output was: <see above>
ecl-15.3.7-827d3035-linux-x64-lisp-to-c
ecl-15.3.7-a014bd2c-linux-x64-lisp-to-c
sbcl-1.0.58-linux-x86
(LOAD hunchentoot-single-signon FAIL) ffi-grovel, CFFI-GROVEL:GROVEL-ERROR : External process exited with code 1. Command was: "cc" "-m32" "-I/home/testgrid/cl-test-grid/work-dir/agent/quicklisp/dists/quicklisp/software/cffi_0.15.0/" "-o" "/home/testgrid/cl-test-grid/work-dir/agent/test-runs/20150611052545-sbcl-1.0.58-linux-x86/fasl/ql/dists/quicklisp/software/cl-gss-20150302-git/src/gss-grovel" "/home/testgrid/cl-test-grid/work-dir/agent/test-runs/20150611052545-sbcl-1.0.58-linux-x86/fasl/ql/dists/quicklisp/software/cl-gss-20150302-git/src/gss-grovel.c" Output was: /home/testgrid/cl-test-grid/work-dir/agent/test-runs/20150611052545-sbcl-1.0.58-linux-x86/fasl/ql/dists/quicklisp/software/cl-gss-20150302-git/src/gss-grovel.c:6:27: fatal error: gssapi/gssapi.h: No such file or directory compilation terminated.
(LOAD hunchentoot-single-signon FAIL) ffi-grovel, CFFI-GROVEL:GROVEL-ERROR : External process exited with code 1. Command was: "cc" "-m32" "-I/home/testgrid/cl-test-grid/work-dir/agent/quicklisp/dists/quicklisp/software/cffi_0.14.0/" "-o" "/home/testgrid/cl-test-grid/work-dir/agent/test-runs/20150508221029-sbcl-1.0.58-linux-x86/fasl/ql/dists/quicklisp/software/cl-gss-20150302-git/src/gss-grovel" "/home/testgrid/cl-test-grid/work-dir/agent/test-runs/20150508221029-sbcl-1.0.58-linux-x86/fasl/ql/dists/quicklisp/software/cl-gss-20150302-git/src/gss-grovel.c" Output was: /home/testgrid/cl-test-grid/work-dir/agent/test-runs/20150508221029-sbcl-1.0.58-linux-x86/fasl/ql/dists/quicklisp/software/cl-gss-20150302-git/src/gss-grovel.c:6:27: fatal error: gssapi/gssapi.h: No such file or directory compilation terminated.
sbcl-1.1.11-linux-x86
(LOAD hunchentoot-single-signon FAIL) ffi-grovel, CFFI-GROVEL:GROVEL-ERROR : External process exited with code 1. Command was: "cc" "-m32" "-I/home/testgrid/cl-test-grid/work-dir/agent/quicklisp/dists/quicklisp/software/cffi_0.15.0/" "-o" "/home/testgrid/cl-test-grid/work-dir/agent/test-runs/20150611031108-sbcl-1.1.11-linux-x86/fasl/ql/dists/quicklisp/software/cl-gss-20150302-git/src/gss-grovel" "/home/testgrid/cl-test-grid/work-dir/agent/test-runs/20150611031108-sbcl-1.1.11-linux-x86/fasl/ql/dists/quicklisp/software/cl-gss-20150302-git/src/gss-grovel.c" Output was: /home/testgrid/cl-test-grid/work-dir/agent/test-runs/20150611031108-sbcl-1.1.11-linux-x86/fasl/ql/dists/quicklisp/software/cl-gss-20150302-git/src/gss-grovel.c:6:27: fatal error: gssapi/gssapi.h: No such file or directory compilation terminated.
(LOAD hunchentoot-single-signon FAIL) ffi-grovel, CFFI-GROVEL:GROVEL-ERROR : External process exited with code 1. Command was: "cc" "-m32" "-I/home/testgrid/cl-test-grid/work-dir/agent/quicklisp/dists/quicklisp/software/cffi_0.14.0/" "-o" "/home/testgrid/cl-test-grid/work-dir/agent/test-runs/20150508201056-sbcl-1.1.11-linux-x86/fasl/ql/dists/quicklisp/software/cl-gss-20150302-git/src/gss-grovel" "/home/testgrid/cl-test-grid/work-dir/agent/test-runs/20150508201056-sbcl-1.1.11-linux-x86/fasl/ql/dists/quicklisp/software/cl-gss-20150302-git/src/gss-grovel.c" Output was: /home/testgrid/cl-test-grid/work-dir/agent/test-runs/20150508201056-sbcl-1.1.11-linux-x86/fasl/ql/dists/quicklisp/software/cl-gss-20150302-git/src/gss-grovel.c:6:27: fatal error: gssapi/gssapi.h: No such file or directory compilation terminated.
sbcl-1.1.16-linux-x86
(LOAD hunchentoot-single-signon FAIL) ffi-grovel, CFFI-GROVEL:GROVEL-ERROR : External process exited with code 1. Command was: "cc" "-m32" "-I/home/testgrid/cl-test-grid/work-dir/agent/quicklisp/dists/quicklisp/software/cffi_0.15.0/" "-o" "/home/testgrid/cl-test-grid/work-dir/agent/test-runs/20150611010136-sbcl-1.1.16-linux-x86/fasl/ql/dists/quicklisp/software/cl-gss-20150302-git/src/gss-grovel" "/home/testgrid/cl-test-grid/work-dir/agent/test-runs/20150611010136-sbcl-1.1.16-linux-x86/fasl/ql/dists/quicklisp/software/cl-gss-20150302-git/src/gss-grovel.c" Output was: /home/testgrid/cl-test-grid/work-dir/agent/test-runs/20150611010136-sbcl-1.1.16-linux-x86/fasl/ql/dists/quicklisp/software/cl-gss-20150302-git/src/gss-grovel.c:6:27: fatal error: gssapi/gssapi.h: No such file or directory compilation terminated.
(LOAD hunchentoot-single-signon FAIL) ffi-grovel, CFFI-GROVEL:GROVEL-ERROR : External process exited with code 1. Command was: "cc" "-m32" "-I/home/testgrid/cl-test-grid/work-dir/agent/quicklisp/dists/quicklisp/software/cffi_0.14.0/" "-o" "/home/testgrid/cl-test-grid/work-dir/agent/test-runs/20150508181220-sbcl-1.1.16-linux-x86/fasl/ql/dists/quicklisp/software/cl-gss-20150302-git/src/gss-grovel" "/home/testgrid/cl-test-grid/work-dir/agent/test-runs/20150508181220-sbcl-1.1.16-linux-x86/fasl/ql/dists/quicklisp/software/cl-gss-20150302-git/src/gss-grovel.c" Output was: /home/testgrid/cl-test-grid/work-dir/agent/test-runs/20150508181220-sbcl-1.1.16-linux-x86/fasl/ql/dists/quicklisp/software/cl-gss-20150302-git/src/gss-grovel.c:6:27: fatal error: gssapi/gssapi.h: No such file or directory compilation terminated.
sbcl-1.2.3-linux-x64
(LOAD hunchentoot-single-signon FAIL) ffi-grovel, CFFI-GROVEL:GROVEL-ERROR : External process exited with code 1. Command was: "cc" "-m64" "-I/home/hijarian/systems/cl-test-grid/work-dir/agent/quicklisp/dists/quicklisp/software/cffi_0.15.0/" "-o" "/home/hijarian/systems/cl-test-grid/work-dir/agent/test-runs/20150609131809-sbcl-1.2.3-linux-x64/fasl/ql/dists/quicklisp/software/cl-gss-20150302-git/src/gss-grovel" "/home/hijarian/systems/cl-test-grid/work-dir/agent/test-runs/20150609131809-sbcl-1.2.3-linux-x64/fasl/ql/dists/quicklisp/software/cl-gss-20150302-git/src/gss-grovel.c" Output was: /home/hijarian/systems/cl-test-grid/work-dir/agent/test-runs/20150609131809-sbcl-1.2.3-linux-x64/fasl/ql/dists/quicklisp/software/cl-gss-20150302-git/src/gss-grovel.c:6:27: fatal error: gssapi/gssapi.h: Нет такого файла или каталога #include <gssapi/gssapi.h> ^ compilation terminated.
(LOAD hunchentoot-single-signon FAIL) ffi-grovel, CFFI-GROVEL:GROVEL-ERROR : External process exited with code 1. Command was: "cc" "-m64" "-I/home/hijarian/systems/cl-test-grid/work-dir/agent/quicklisp/dists/quicklisp/software/cffi_0.14.0/" "-o" "/home/hijarian/systems/cl-test-grid/work-dir/agent/test-runs/20150518190329-sbcl-1.2.3-linux-x64/fasl/ql/dists/quicklisp/software/cl-gss-20150302-git/src/gss-grovel" "/home/hijarian/systems/cl-test-grid/work-dir/agent/test-runs/20150518190329-sbcl-1.2.3-linux-x64/fasl/ql/dists/quicklisp/software/cl-gss-20150302-git/src/gss-grovel.c" Output was: /home/hijarian/systems/cl-test-grid/work-dir/agent/test-runs/20150518190329-sbcl-1.2.3-linux-x64/fasl/ql/dists/quicklisp/software/cl-gss-20150302-git/src/gss-grovel.c:6:27: fatal error: gssapi/gssapi.h: Нет такого файла или каталога #include <gssapi/gssapi.h> ^ compilation terminated.
sbcl-1.2.6-linux-x86
(LOAD hunchentoot-single-signon FAIL) ffi-grovel, CFFI-GROVEL:GROVEL-ERROR : External process exited with code 1. Command was: "cc" "-m32" "-I/home/testgrid/cl-test-grid/work-dir/agent/quicklisp/dists/quicklisp/software/cffi_0.15.0/" "-o" "/home/testgrid/cl-test-grid/work-dir/agent/test-runs/20150609105613-sbcl-1.2.6-linux-x86/fasl/ql/dists/quicklisp/software/cl-gss-20150302-git/src/gss-grovel" "/home/testgrid/cl-test-grid/work-dir/agent/test-runs/20150609105613-sbcl-1.2.6-linux-x86/fasl/ql/dists/quicklisp/software/cl-gss-20150302-git/src/gss-grovel.c" Output was: /home/testgrid/cl-test-grid/work-dir/agent/test-runs/20150609105613-sbcl-1.2.6-linux-x86/fasl/ql/dists/quicklisp/software/cl-gss-20150302-git/src/gss-grovel.c:6:27: fatal error: gssapi/gssapi.h: No such file or directory compilation terminated.
(LOAD hunchentoot-single-signon FAIL) ffi-grovel, CFFI-GROVEL:GROVEL-ERROR : External process exited with code 1. Command was: "cc" "-m32" "-I/home/testgrid/cl-test-grid/work-dir/agent/quicklisp/dists/quicklisp/software/cffi_0.14.0/" "-o" "/home/testgrid/cl-test-grid/work-dir/agent/test-runs/20150506142627-sbcl-1.2.6-linux-x86/fasl/ql/dists/quicklisp/software/cl-gss-20150302-git/src/gss-grovel" "/home/testgrid/cl-test-grid/work-dir/agent/test-runs/20150506142627-sbcl-1.2.6-linux-x86/fasl/ql/dists/quicklisp/software/cl-gss-20150302-git/src/gss-grovel.c" Output was: /home/testgrid/cl-test-grid/work-dir/agent/test-runs/20150506142627-sbcl-1.2.6-linux-x86/fasl/ql/dists/quicklisp/software/cl-gss-20150302-git/src/gss-grovel.c:6:27: fatal error: gssapi/gssapi.h: No such file or directory compilation terminated.

Breakdown by testcases: for every failed testcase the lisp implmentations it fails on

The library does not have a testsuite adapter for CL Test Grid.

To reports overview

Generated at: 2015-06-20 14:24:30 GMT.