hu.dwim.web-server results collected by cl-test-grid

Results on the last two Quicklisp distributions

 quicklisp 2015-07-10quicklisp 2015-06-08
abcl-1.2.1-fasl42-linux-x86
(LOAD hu.dwim.web-server.websocket FAIL) needs newer ASDF, ASDF/FIND-SYSTEM:LOAD-SYSTEM-DEFINITION-ERROR : Error while trying to load definition for system hu.dwim.web-server.websocket from pathname /home/testgrid/cl-test-grid/work-dir/agent/quicklisp/dists/quicklisp/software/hu.dwim.web-server-20150709-darcs/hu.dwim.web-server.websocket.asd: The symbol NON-PROPAGATING-OPERATION is not present in package ASDF/INTERFACE.
(LOAD hu.dwim.web-server.test FAIL) needs newer ASDF, ASDF/FIND-SYSTEM:LOAD-SYSTEM-DEFINITION-ERROR : Error while trying to load definition for system hu.dwim.web-server.test from pathname /home/testgrid/cl-test-grid/work-dir/agent/quicklisp/dists/quicklisp/software/hu.dwim.web-server-20150709-darcs/hu.dwim.web-server.test.asd: The symbol NON-PROPAGATING-OPERATION is not present in package ASDF/INTERFACE.
(LOAD hu.dwim.web-server.documentation FAIL) needs newer ASDF, ASDF/FIND-SYSTEM:LOAD-SYSTEM-DEFINITION-ERROR : Error while trying to load definition for system hu.dwim.web-server.documentation from pathname /home/testgrid/cl-test-grid/work-dir/agent/quicklisp/dists/quicklisp/software/hu.dwim.web-server-20150709-darcs/hu.dwim.web-server.documentation.asd: The symbol NON-PROPAGATING-OPERATION is not present in package ASDF/INTERFACE.
(LOAD hu.dwim.web-server.application.test FAIL) needs newer ASDF, ASDF/FIND-SYSTEM:LOAD-SYSTEM-DEFINITION-ERROR : Error while trying to load definition for system hu.dwim.web-server.application.test from pathname /home/testgrid/cl-test-grid/work-dir/agent/quicklisp/dists/quicklisp/software/hu.dwim.web-server-20150709-darcs/hu.dwim.web-server.application.test.asd: The symbol NON-PROPAGATING-OPERATION is not present in package ASDF/INTERFACE.
(LOAD hu.dwim.web-server.application+hu.dwim.perec FAIL) needs newer ASDF, ASDF/FIND-SYSTEM:LOAD-SYSTEM-DEFINITION-ERROR : Error while trying to load definition for system hu.dwim.web-server.application+hu.dwim.perec from pathname /home/testgrid/cl-test-grid/work-dir/agent/quicklisp/dists/quicklisp/software/hu.dwim.web-server-20150709-darcs/hu.dwim.web-server.application+hu.dwim.perec.asd: The symbol NON-PROPAGATING-OPERATION is not present in package ASDF/INTERFACE.
(LOAD hu.dwim.web-server.application FAIL) needs newer ASDF, ASDF/FIND-SYSTEM:LOAD-SYSTEM-DEFINITION-ERROR : Error while trying to load definition for system hu.dwim.web-server.application from pathname /home/testgrid/cl-test-grid/work-dir/agent/quicklisp/dists/quicklisp/software/hu.dwim.web-server-20150709-darcs/hu.dwim.web-server.application.asd: The symbol NON-PROPAGATING-OPERATION is not present in package ASDF/INTERFACE.
(LOAD hu.dwim.web-server+swank FAIL) needs newer ASDF, ASDF/FIND-SYSTEM:LOAD-SYSTEM-DEFINITION-ERROR : Error while trying to load definition for system hu.dwim.web-server+swank from pathname /home/testgrid/cl-test-grid/work-dir/agent/quicklisp/dists/quicklisp/software/hu.dwim.web-server-20150709-darcs/hu.dwim.web-server+swank.asd: The symbol NON-PROPAGATING-OPERATION is not present in package ASDF/INTERFACE.
(LOAD hu.dwim.web-server FAIL) needs newer ASDF, ASDF/FIND-SYSTEM:LOAD-SYSTEM-DEFINITION-ERROR : Error while trying to load definition for system hu.dwim.web-server from pathname /home/testgrid/cl-test-grid/work-dir/agent/quicklisp/dists/quicklisp/software/hu.dwim.web-server-20150709-darcs/hu.dwim.web-server.asd: The symbol NON-PROPAGATING-OPERATION is not present in package ASDF/INTERFACE.
(LOAD hu.dwim.web-server.test FAIL) needs newer ASDF, ASDF/FIND-SYSTEM:LOAD-SYSTEM-DEFINITION-ERROR : Error while trying to load definition for system hu.dwim.web-server.test from pathname /home/testgrid/cl-test-grid/work-dir/agent/quicklisp/dists/quicklisp/software/hu.dwim.web-server-20150608-darcs/hu.dwim.web-server.test.asd: The symbol NON-PROPAGATING-OPERATION is not present in package ASDF/INTERFACE.
(LOAD hu.dwim.web-server.application.test FAIL) needs newer ASDF, ASDF/FIND-SYSTEM:LOAD-SYSTEM-DEFINITION-ERROR : Error while trying to load definition for system hu.dwim.web-server.application.test from pathname /home/testgrid/cl-test-grid/work-dir/agent/quicklisp/dists/quicklisp/software/hu.dwim.web-server-20150608-darcs/hu.dwim.web-server.application.test.asd: The symbol NON-PROPAGATING-OPERATION is not present in package ASDF/INTERFACE.
(LOAD hu.dwim.web-server.application+hu.dwim.perec FAIL) needs newer ASDF, ASDF/FIND-SYSTEM:LOAD-SYSTEM-DEFINITION-ERROR : Error while trying to load definition for system hu.dwim.web-server.application+hu.dwim.perec from pathname /home/testgrid/cl-test-grid/work-dir/agent/quicklisp/dists/quicklisp/software/hu.dwim.web-server-20150608-darcs/hu.dwim.web-server.application+hu.dwim.perec.asd: The symbol NON-PROPAGATING-OPERATION is not present in package ASDF/INTERFACE.
(LOAD hu.dwim.web-server.application FAIL) needs newer ASDF, ASDF/FIND-SYSTEM:LOAD-SYSTEM-DEFINITION-ERROR : Error while trying to load definition for system hu.dwim.web-server.application from pathname /home/testgrid/cl-test-grid/work-dir/agent/quicklisp/dists/quicklisp/software/hu.dwim.web-server-20150608-darcs/hu.dwim.web-server.application.asd: The symbol NON-PROPAGATING-OPERATION is not present in package ASDF/INTERFACE.
(LOAD hu.dwim.web-server+swank FAIL) needs newer ASDF, ASDF/FIND-SYSTEM:LOAD-SYSTEM-DEFINITION-ERROR : Error while trying to load definition for system hu.dwim.web-server+swank from pathname /home/testgrid/cl-test-grid/work-dir/agent/quicklisp/dists/quicklisp/software/hu.dwim.web-server-20150608-darcs/hu.dwim.web-server+swank.asd: The symbol NON-PROPAGATING-OPERATION is not present in package ASDF/INTERFACE.
(LOAD hu.dwim.web-server FAIL) needs newer ASDF, ASDF/FIND-SYSTEM:LOAD-SYSTEM-DEFINITION-ERROR : Error while trying to load definition for system hu.dwim.web-server from pathname /home/testgrid/cl-test-grid/work-dir/agent/quicklisp/dists/quicklisp/software/hu.dwim.web-server-20150608-darcs/hu.dwim.web-server.asd: The symbol NON-PROPAGATING-OPERATION is not present in package ASDF/INTERFACE.
abcl-1.3.0-fasl42-linux-x86
(LOAD hu.dwim.web-server.websocket FAIL) COMMON-LISP:SIMPLE-ERROR : This is not implemented for your lisp, sorry. You may try to continue, but...
(LOAD hu.dwim.web-server.test FAIL) COMMON-LISP:SIMPLE-ERROR : This is not implemented for your lisp, sorry. You may try to continue, but...
(LOAD hu.dwim.web-server.documentation FAIL) ffi, CFFI:LOAD-FOREIGN-LIBRARY-ERROR : Unable to load any of the alternatives: ("libgvc.so" "libgvc.so.4" "libgvc32.so.4")
(LOAD hu.dwim.web-server.application.test FAIL) COMMON-LISP:SIMPLE-ERROR : This is not implemented for your lisp, sorry. You may try to continue, but...
(LOAD hu.dwim.web-server.application+hu.dwim.perec FAIL) COMMON-LISP:SIMPLE-ERROR : This is not implemented for your lisp, sorry. You may try to continue, but...
(LOAD hu.dwim.web-server.application FAIL) COMMON-LISP:SIMPLE-ERROR : This is not implemented for your lisp, sorry. You may try to continue, but...
(LOAD hu.dwim.web-server+swank FAIL) COMMON-LISP:SIMPLE-ERROR : This is not implemented for your lisp, sorry. You may try to continue, but...
(LOAD hu.dwim.web-server FAIL) COMMON-LISP:SIMPLE-ERROR : This is not implemented for your lisp, sorry. You may try to continue, but...
(LOAD hu.dwim.web-server.test FAIL) COMMON-LISP:SIMPLE-ERROR : This is not implemented for your lisp, sorry. You may try to continue, but...
(LOAD hu.dwim.web-server.application.test FAIL) COMMON-LISP:SIMPLE-ERROR : This is not implemented for your lisp, sorry. You may try to continue, but...
(LOAD hu.dwim.web-server.application+hu.dwim.perec FAIL) COMMON-LISP:SIMPLE-ERROR : This is not implemented for your lisp, sorry. You may try to continue, but...
(LOAD hu.dwim.web-server.application FAIL) COMMON-LISP:SIMPLE-ERROR : This is not implemented for your lisp, sorry. You may try to continue, but...
(LOAD hu.dwim.web-server+swank FAIL) COMMON-LISP:SIMPLE-ERROR : This is not implemented for your lisp, sorry. You may try to continue, but...
(LOAD hu.dwim.web-server FAIL) COMMON-LISP:SIMPLE-ERROR : This is not implemented for your lisp, sorry. You may try to continue, but...
abcl-1.3.1-fasl42-linux-x86
(LOAD hu.dwim.web-server.websocket FAIL) COMMON-LISP:SIMPLE-ERROR : This is not implemented for your lisp, sorry. You may try to continue, but...
(LOAD hu.dwim.web-server.test FAIL) COMMON-LISP:SIMPLE-ERROR : This is not implemented for your lisp, sorry. You may try to continue, but...
(LOAD hu.dwim.web-server.documentation FAIL) ffi, CFFI:LOAD-FOREIGN-LIBRARY-ERROR : Unable to load any of the alternatives: ("libgvc.so" "libgvc.so.4" "libgvc32.so.4")
(LOAD hu.dwim.web-server.application.test FAIL) COMMON-LISP:SIMPLE-ERROR : This is not implemented for your lisp, sorry. You may try to continue, but...
(LOAD hu.dwim.web-server.application+hu.dwim.perec FAIL) COMMON-LISP:SIMPLE-ERROR : This is not implemented for your lisp, sorry. You may try to continue, but...
(LOAD hu.dwim.web-server.application FAIL) COMMON-LISP:SIMPLE-ERROR : This is not implemented for your lisp, sorry. You may try to continue, but...
(LOAD hu.dwim.web-server+swank FAIL) COMMON-LISP:SIMPLE-ERROR : This is not implemented for your lisp, sorry. You may try to continue, but...
(LOAD hu.dwim.web-server FAIL) COMMON-LISP:SIMPLE-ERROR : This is not implemented for your lisp, sorry. You may try to continue, but...
(LOAD hu.dwim.web-server.test FAIL) COMMON-LISP:SIMPLE-ERROR : This is not implemented for your lisp, sorry. You may try to continue, but...
(LOAD hu.dwim.web-server.application.test FAIL) COMMON-LISP:SIMPLE-ERROR : This is not implemented for your lisp, sorry. You may try to continue, but...
(LOAD hu.dwim.web-server.application+hu.dwim.perec FAIL) COMMON-LISP:SIMPLE-ERROR : This is not implemented for your lisp, sorry. You may try to continue, but...
(LOAD hu.dwim.web-server.application FAIL) COMMON-LISP:SIMPLE-ERROR : This is not implemented for your lisp, sorry. You may try to continue, but...
(LOAD hu.dwim.web-server+swank FAIL) COMMON-LISP:SIMPLE-ERROR : This is not implemented for your lisp, sorry. You may try to continue, but...
(LOAD hu.dwim.web-server FAIL) COMMON-LISP:SIMPLE-ERROR : This is not implemented for your lisp, sorry. You may try to continue, but...
abcl-1.3.2-fasl42-linux-x86
(LOAD hu.dwim.web-server.websocket FAIL) COMMON-LISP:SIMPLE-ERROR : This is not implemented for your lisp, sorry. You may try to continue, but...
(LOAD hu.dwim.web-server.test FAIL) COMMON-LISP:SIMPLE-ERROR : This is not implemented for your lisp, sorry. You may try to continue, but...
(LOAD hu.dwim.web-server.documentation FAIL) ffi, CFFI:LOAD-FOREIGN-LIBRARY-ERROR : Unable to load any of the alternatives: ("libgvc.so" "libgvc.so.4" "libgvc32.so.4")
(LOAD hu.dwim.web-server.application.test FAIL) COMMON-LISP:SIMPLE-ERROR : This is not implemented for your lisp, sorry. You may try to continue, but...
(LOAD hu.dwim.web-server.application+hu.dwim.perec FAIL) COMMON-LISP:SIMPLE-ERROR : This is not implemented for your lisp, sorry. You may try to continue, but...
(LOAD hu.dwim.web-server.application FAIL) COMMON-LISP:SIMPLE-ERROR : This is not implemented for your lisp, sorry. You may try to continue, but...
(LOAD hu.dwim.web-server+swank FAIL) COMMON-LISP:SIMPLE-ERROR : This is not implemented for your lisp, sorry. You may try to continue, but...
(LOAD hu.dwim.web-server FAIL) COMMON-LISP:SIMPLE-ERROR : This is not implemented for your lisp, sorry. You may try to continue, but...
(LOAD hu.dwim.web-server.test FAIL) COMMON-LISP:SIMPLE-ERROR : This is not implemented for your lisp, sorry. You may try to continue, but...
(LOAD hu.dwim.web-server.application.test FAIL) COMMON-LISP:SIMPLE-ERROR : This is not implemented for your lisp, sorry. You may try to continue, but...
(LOAD hu.dwim.web-server.application+hu.dwim.perec FAIL) COMMON-LISP:SIMPLE-ERROR : This is not implemented for your lisp, sorry. You may try to continue, but...
(LOAD hu.dwim.web-server.application FAIL) COMMON-LISP:SIMPLE-ERROR : This is not implemented for your lisp, sorry. You may try to continue, but...
(LOAD hu.dwim.web-server+swank FAIL) COMMON-LISP:SIMPLE-ERROR : This is not implemented for your lisp, sorry. You may try to continue, but...
(LOAD hu.dwim.web-server FAIL) COMMON-LISP:SIMPLE-ERROR : This is not implemented for your lisp, sorry. You may try to continue, but...
ccl-1.10-r16196-f96-linux-x64
(LOAD hu.dwim.web-server.test FAIL) CCL:NO-APPLICABLE-METHOD-EXISTS : There is no applicable method for the generic function: #<STANDARD-GENERIC-FUNCTION CCL:SLOT-VALUE-USING-CLASS #x30200002B44F> when called with arguments: (#<STANDARD-CLASS CL-L10N.LDML:LANGUAGE> #<LANGUAGE language #x3020025AAA0D> 0)
(LOAD hu.dwim.web-server.application.test FAIL) COMMON-LISP:SIMPLE-ERROR : External process exited with code 1. Command was: "g++" "-m64" "-Wno-write-strings" "-I/home/hijarian/systems/cl-test-grid/work-dir/agent/quicklisp/dists/quicklisp/software/iolib-20150302-git/src/grovel/" "-o" "/home/hijarian/systems/cl-test-grid/work-dir/agent/test-runs/20150609102449-ccl-1.10-r16196-f96-linux-x64/fasl/ql/dists/quicklisp/software/iolib-20150302-git/src/syscalls/ffi-types-unix" "/home/hijarian/systems/cl-test-grid/work-dir/agent/test-runs/20150609102449-ccl-1.10-r16196-f96-linux-x64/fasl/ql/dists/quicklisp/software/iolib-20150302-git/src/syscalls/ffi-types-unix.c" Output was: /home/hijarian/systems/cl-test-grid/work-dir/agent/test-runs/20150609102449-ccl-1.10-r16196-f96-linux-x64/fasl/ql/dists/quicklisp/software/iolib-20150302-git/src/syscalls/ffi-types-unix.c:14:17: fatal error: lfp.h: Нет такого файла или каталога #include <lfp.h> ^ compilation terminated.
(LOAD hu.dwim.web-server.application+hu.dwim.perec FAIL) CCL:NO-APPLICABLE-METHOD-EXISTS : There is no applicable method for the generic function: #<STANDARD-GENERIC-FUNCTION CCL:SLOT-VALUE-USING-CLASS #x30200002B44F> when called with arguments: (#<STANDARD-CLASS CL-L10N.LDML:LANGUAGE> #<LANGUAGE language #x30200219384D> 0)
(LOAD hu.dwim.web-server.application FAIL) COMMON-LISP:SIMPLE-ERROR : External process exited with code 1. Command was: "g++" "-m64" "-Wno-write-strings" "-I/home/hijarian/systems/cl-test-grid/work-dir/agent/quicklisp/dists/quicklisp/software/iolib-20150302-git/src/grovel/" "-o" "/home/hijarian/systems/cl-test-grid/work-dir/agent/test-runs/20150609102449-ccl-1.10-r16196-f96-linux-x64/fasl/ql/dists/quicklisp/software/iolib-20150302-git/src/syscalls/ffi-types-unix" "/home/hijarian/systems/cl-test-grid/work-dir/agent/test-runs/20150609102449-ccl-1.10-r16196-f96-linux-x64/fasl/ql/dists/quicklisp/software/iolib-20150302-git/src/syscalls/ffi-types-unix.c" Output was: /home/hijarian/systems/cl-test-grid/work-dir/agent/test-runs/20150609102449-ccl-1.10-r16196-f96-linux-x64/fasl/ql/dists/quicklisp/software/iolib-20150302-git/src/syscalls/ffi-types-unix.c:14:17: fatal error: lfp.h: Нет такого файла или каталога #include <lfp.h> ^ compilation terminated.
(LOAD hu.dwim.web-server+swank FAIL) COMMON-LISP:SIMPLE-ERROR : External process exited with code 1. Command was: "g++" "-m64" "-Wno-write-strings" "-I/home/hijarian/systems/cl-test-grid/work-dir/agent/quicklisp/dists/quicklisp/software/iolib-20150302-git/src/grovel/" "-o" "/home/hijarian/systems/cl-test-grid/work-dir/agent/test-runs/20150609102449-ccl-1.10-r16196-f96-linux-x64/fasl/ql/dists/quicklisp/software/iolib-20150302-git/src/syscalls/ffi-types-unix" "/home/hijarian/systems/cl-test-grid/work-dir/agent/test-runs/20150609102449-ccl-1.10-r16196-f96-linux-x64/fasl/ql/dists/quicklisp/software/iolib-20150302-git/src/syscalls/ffi-types-unix.c" Output was: /home/hijarian/systems/cl-test-grid/work-dir/agent/test-runs/20150609102449-ccl-1.10-r16196-f96-linux-x64/fasl/ql/dists/quicklisp/software/iolib-20150302-git/src/syscalls/ffi-types-unix.c:14:17: fatal error: lfp.h: Нет такого файла или каталога #include <lfp.h> ^ compilation terminated.
(LOAD hu.dwim.web-server FAIL) COMMON-LISP:SIMPLE-ERROR : External process exited with code 1. Command was: "g++" "-m64" "-Wno-write-strings" "-I/home/hijarian/systems/cl-test-grid/work-dir/agent/quicklisp/dists/quicklisp/software/iolib-20150302-git/src/grovel/" "-o" "/home/hijarian/systems/cl-test-grid/work-dir/agent/test-runs/20150609102449-ccl-1.10-r16196-f96-linux-x64/fasl/ql/dists/quicklisp/software/iolib-20150302-git/src/syscalls/ffi-types-unix" "/home/hijarian/systems/cl-test-grid/work-dir/agent/test-runs/20150609102449-ccl-1.10-r16196-f96-linux-x64/fasl/ql/dists/quicklisp/software/iolib-20150302-git/src/syscalls/ffi-types-unix.c" Output was: /home/hijarian/systems/cl-test-grid/work-dir/agent/test-runs/20150609102449-ccl-1.10-r16196-f96-linux-x64/fasl/ql/dists/quicklisp/software/iolib-20150302-git/src/syscalls/ffi-types-unix.c:14:17: fatal error: lfp.h: Нет такого файла или каталога #include <lfp.h> ^ compilation terminated.
ccl-1.10-r16196-f96-linux-x86
(LOAD hu.dwim.web-server.websocket FAIL) COMMON-LISP:TYPE-ERROR : The value NIL is not of the expected type PACKAGE.
(LOAD hu.dwim.web-server.test FAIL) CCL:NO-APPLICABLE-METHOD-EXISTS : There is no applicable method for the generic function: #<STANDARD-GENERIC-FUNCTION CCL:SLOT-VALUE-USING-CLASS #x180144BE> when called with arguments: (#<STANDARD-CLASS CL-L10N.LDML:LANGUAGE> #<LANGUAGE language #x19BC1476> 0)
(LOAD hu.dwim.web-server.documentation FAIL) ffi, CFFI:LOAD-FOREIGN-LIBRARY-ERROR : Unable to load any of the alternatives: ("libgvc.so" "libgvc.so.4" "libgvc32.so.4")
(LOAD hu.dwim.web-server.application.test FAIL) COMMON-LISP:TYPE-ERROR : The value NIL is not of the expected type PACKAGE.
(LOAD hu.dwim.web-server.application+hu.dwim.perec FAIL) CCL:NO-APPLICABLE-METHOD-EXISTS : There is no applicable method for the generic function: #<STANDARD-GENERIC-FUNCTION CCL:SLOT-VALUE-USING-CLASS #x180144BE> when called with arguments: (#<STANDARD-CLASS CL-L10N.LDML:LANGUAGE> #<LANGUAGE language #x197CD226> 0)
(LOAD hu.dwim.web-server.application FAIL) COMMON-LISP:TYPE-ERROR : The value NIL is not of the expected type PACKAGE.
(LOAD hu.dwim.web-server+swank FAIL) COMMON-LISP:TYPE-ERROR : The value NIL is not of the expected type PACKAGE.
(LOAD hu.dwim.web-server FAIL) COMMON-LISP:TYPE-ERROR : The value NIL is not of the expected type PACKAGE.
(LOAD hu.dwim.web-server.test FAIL) CCL:NO-APPLICABLE-METHOD-EXISTS : There is no applicable method for the generic function: #<STANDARD-GENERIC-FUNCTION CCL:SLOT-VALUE-USING-CLASS #x180144BE> when called with arguments: (#<STANDARD-CLASS CL-L10N.LDML:LANGUAGE> #<LANGUAGE language #x19B5EC46> 0)
(LOAD hu.dwim.web-server.application.test FAIL) COMMON-LISP:TYPE-ERROR : The value NIL is not of the expected type PACKAGE.
(LOAD hu.dwim.web-server.application+hu.dwim.perec FAIL) CCL:NO-APPLICABLE-METHOD-EXISTS : There is no applicable method for the generic function: #<STANDARD-GENERIC-FUNCTION CCL:SLOT-VALUE-USING-CLASS #x180144BE> when called with arguments: (#<STANDARD-CLASS CL-L10N.LDML:LANGUAGE> #<LANGUAGE language #x197AE086> 0)
(LOAD hu.dwim.web-server.application FAIL) COMMON-LISP:TYPE-ERROR : The value NIL is not of the expected type PACKAGE.
(LOAD hu.dwim.web-server+swank FAIL) COMMON-LISP:TYPE-ERROR : The value NIL is not of the expected type PACKAGE.
(LOAD hu.dwim.web-server FAIL) COMMON-LISP:TYPE-ERROR : The value NIL is not of the expected type PACKAGE.
ccl-1.8-r15286m-f95-linux-x86
(LOAD hu.dwim.web-server.websocket FAIL) needs newer ASDF, ASDF:LOAD-SYSTEM-DEFINITION-ERROR : Error while trying to load definition for system hu.dwim.web-server.websocket from pathname /home/testgrid/cl-test-grid/work-dir/agent/quicklisp/dists/quicklisp/software/hu.dwim.web-server-20150709-darcs/hu\.dwim\.web-server\.websocket.asd: Cannot IMPORT "NON-PROPAGATING-OPERATION" from package "ASDF"
(LOAD hu.dwim.web-server.test FAIL) needs newer ASDF, ASDF:LOAD-SYSTEM-DEFINITION-ERROR : Error while trying to load definition for system hu.dwim.web-server.test from pathname /home/testgrid/cl-test-grid/work-dir/agent/quicklisp/dists/quicklisp/software/hu.dwim.web-server-20150709-darcs/hu\.dwim\.web-server\.test.asd: Cannot IMPORT "NON-PROPAGATING-OPERATION" from package "ASDF"
(LOAD hu.dwim.web-server.documentation FAIL) needs newer ASDF, ASDF:LOAD-SYSTEM-DEFINITION-ERROR : Error while trying to load definition for system hu.dwim.web-server.documentation from pathname /home/testgrid/cl-test-grid/work-dir/agent/quicklisp/dists/quicklisp/software/hu.dwim.web-server-20150709-darcs/hu\.dwim\.web-server\.documentation.asd: Cannot IMPORT "NON-PROPAGATING-OPERATION" from package "ASDF"
(LOAD hu.dwim.web-server.application.test FAIL) needs newer ASDF, ASDF:LOAD-SYSTEM-DEFINITION-ERROR : Error while trying to load definition for system hu.dwim.web-server.application.test from pathname /home/testgrid/cl-test-grid/work-dir/agent/quicklisp/dists/quicklisp/software/hu.dwim.web-server-20150709-darcs/hu\.dwim\.web-server\.application\.test.asd: Cannot IMPORT "NON-PROPAGATING-OPERATION" from package "ASDF"
(LOAD hu.dwim.web-server.application+hu.dwim.perec FAIL) needs newer ASDF, ASDF:LOAD-SYSTEM-DEFINITION-ERROR : Error while trying to load definition for system hu.dwim.web-server.application+hu.dwim.perec from pathname /home/testgrid/cl-test-grid/work-dir/agent/quicklisp/dists/quicklisp/software/hu.dwim.web-server-20150709-darcs/hu\.dwim\.web-server\.application+hu\.dwim\.perec.asd: Cannot IMPORT "NON-PROPAGATING-OPERATION" from package "ASDF"
(LOAD hu.dwim.web-server.application FAIL) needs newer ASDF, ASDF:LOAD-SYSTEM-DEFINITION-ERROR : Error while trying to load definition for system hu.dwim.web-server.application from pathname /home/testgrid/cl-test-grid/work-dir/agent/quicklisp/dists/quicklisp/software/hu.dwim.web-server-20150709-darcs/hu\.dwim\.web-server\.application.asd: Cannot IMPORT "NON-PROPAGATING-OPERATION" from package "ASDF"
(LOAD hu.dwim.web-server+swank FAIL) needs newer ASDF, ASDF:LOAD-SYSTEM-DEFINITION-ERROR : Error while trying to load definition for system hu.dwim.web-server+swank from pathname /home/testgrid/cl-test-grid/work-dir/agent/quicklisp/dists/quicklisp/software/hu.dwim.web-server-20150709-darcs/hu\.dwim\.web-server+swank.asd: Cannot IMPORT "NON-PROPAGATING-OPERATION" from package "ASDF"
(LOAD hu.dwim.web-server FAIL) needs newer ASDF, ASDF:LOAD-SYSTEM-DEFINITION-ERROR : Error while trying to load definition for system hu.dwim.web-server from pathname /home/testgrid/cl-test-grid/work-dir/agent/quicklisp/dists/quicklisp/software/hu.dwim.web-server-20150709-darcs/hu\.dwim\.web-server.asd: Cannot IMPORT "NON-PROPAGATING-OPERATION" from package "ASDF"
(LOAD hu.dwim.web-server.test FAIL) needs newer ASDF, ASDF:LOAD-SYSTEM-DEFINITION-ERROR : Error while trying to load definition for system hu.dwim.web-server.test from pathname /home/testgrid/cl-test-grid/work-dir/agent/quicklisp/dists/quicklisp/software/hu.dwim.web-server-20150608-darcs/hu\.dwim\.web-server\.test.asd: Cannot IMPORT "NON-PROPAGATING-OPERATION" from package "ASDF"
(LOAD hu.dwim.web-server.application.test FAIL) needs newer ASDF, ASDF:LOAD-SYSTEM-DEFINITION-ERROR : Error while trying to load definition for system hu.dwim.web-server.application.test from pathname /home/testgrid/cl-test-grid/work-dir/agent/quicklisp/dists/quicklisp/software/hu.dwim.web-server-20150608-darcs/hu\.dwim\.web-server\.application\.test.asd: Cannot IMPORT "NON-PROPAGATING-OPERATION" from package "ASDF"
(LOAD hu.dwim.web-server.application+hu.dwim.perec FAIL) needs newer ASDF, ASDF:LOAD-SYSTEM-DEFINITION-ERROR : Error while trying to load definition for system hu.dwim.web-server.application+hu.dwim.perec from pathname /home/testgrid/cl-test-grid/work-dir/agent/quicklisp/dists/quicklisp/software/hu.dwim.web-server-20150608-darcs/hu\.dwim\.web-server\.application+hu\.dwim\.perec.asd: Cannot IMPORT "NON-PROPAGATING-OPERATION" from package "ASDF"
(LOAD hu.dwim.web-server.application FAIL) needs newer ASDF, ASDF:LOAD-SYSTEM-DEFINITION-ERROR : Error while trying to load definition for system hu.dwim.web-server.application from pathname /home/testgrid/cl-test-grid/work-dir/agent/quicklisp/dists/quicklisp/software/hu.dwim.web-server-20150608-darcs/hu\.dwim\.web-server\.application.asd: Cannot IMPORT "NON-PROPAGATING-OPERATION" from package "ASDF"
(LOAD hu.dwim.web-server+swank FAIL) needs newer ASDF, ASDF:LOAD-SYSTEM-DEFINITION-ERROR : Error while trying to load definition for system hu.dwim.web-server+swank from pathname /home/testgrid/cl-test-grid/work-dir/agent/quicklisp/dists/quicklisp/software/hu.dwim.web-server-20150608-darcs/hu\.dwim\.web-server+swank.asd: Cannot IMPORT "NON-PROPAGATING-OPERATION" from package "ASDF"
(LOAD hu.dwim.web-server FAIL) needs newer ASDF, ASDF:LOAD-SYSTEM-DEFINITION-ERROR : Error while trying to load definition for system hu.dwim.web-server from pathname /home/testgrid/cl-test-grid/work-dir/agent/quicklisp/dists/quicklisp/software/hu.dwim.web-server-20150608-darcs/hu\.dwim\.web-server.asd: Cannot IMPORT "NON-PROPAGATING-OPERATION" from package "ASDF"
ccl-1.9-r15756-f96-linux-x86
(LOAD hu.dwim.web-server.websocket FAIL) needs newer ASDF, ASDF/FIND-SYSTEM:LOAD-SYSTEM-DEFINITION-ERROR : Error while trying to load definition for system hu.dwim.web-server.websocket from pathname /home/testgrid/cl-test-grid/work-dir/agent/quicklisp/dists/quicklisp/software/hu.dwim.web-server-20150709-darcs/hu\.dwim\.web-server\.websocket.asd: Cannot IMPORT "NON-PROPAGATING-OPERATION" from package "ASDF"
(LOAD hu.dwim.web-server.test FAIL) needs newer ASDF, ASDF/FIND-SYSTEM:LOAD-SYSTEM-DEFINITION-ERROR : Error while trying to load definition for system hu.dwim.web-server.test from pathname /home/testgrid/cl-test-grid/work-dir/agent/quicklisp/dists/quicklisp/software/hu.dwim.web-server-20150709-darcs/hu\.dwim\.web-server\.test.asd: Cannot IMPORT "NON-PROPAGATING-OPERATION" from package "ASDF"
(LOAD hu.dwim.web-server.documentation FAIL) needs newer ASDF, ASDF/FIND-SYSTEM:LOAD-SYSTEM-DEFINITION-ERROR : Error while trying to load definition for system hu.dwim.web-server.documentation from pathname /home/testgrid/cl-test-grid/work-dir/agent/quicklisp/dists/quicklisp/software/hu.dwim.web-server-20150709-darcs/hu\.dwim\.web-server\.documentation.asd: Cannot IMPORT "NON-PROPAGATING-OPERATION" from package "ASDF"
(LOAD hu.dwim.web-server.application.test FAIL) needs newer ASDF, ASDF/FIND-SYSTEM:LOAD-SYSTEM-DEFINITION-ERROR : Error while trying to load definition for system hu.dwim.web-server.application.test from pathname /home/testgrid/cl-test-grid/work-dir/agent/quicklisp/dists/quicklisp/software/hu.dwim.web-server-20150709-darcs/hu\.dwim\.web-server\.application\.test.asd: Cannot IMPORT "NON-PROPAGATING-OPERATION" from package "ASDF"
(LOAD hu.dwim.web-server.application+hu.dwim.perec FAIL) needs newer ASDF, ASDF/FIND-SYSTEM:LOAD-SYSTEM-DEFINITION-ERROR : Error while trying to load definition for system hu.dwim.web-server.application+hu.dwim.perec from pathname /home/testgrid/cl-test-grid/work-dir/agent/quicklisp/dists/quicklisp/software/hu.dwim.web-server-20150709-darcs/hu\.dwim\.web-server\.application+hu\.dwim\.perec.asd: Cannot IMPORT "NON-PROPAGATING-OPERATION" from package "ASDF"
(LOAD hu.dwim.web-server.application FAIL) needs newer ASDF, ASDF/FIND-SYSTEM:LOAD-SYSTEM-DEFINITION-ERROR : Error while trying to load definition for system hu.dwim.web-server.application from pathname /home/testgrid/cl-test-grid/work-dir/agent/quicklisp/dists/quicklisp/software/hu.dwim.web-server-20150709-darcs/hu\.dwim\.web-server\.application.asd: Cannot IMPORT "NON-PROPAGATING-OPERATION" from package "ASDF"
(LOAD hu.dwim.web-server+swank FAIL) needs newer ASDF, ASDF/FIND-SYSTEM:LOAD-SYSTEM-DEFINITION-ERROR : Error while trying to load definition for system hu.dwim.web-server+swank from pathname /home/testgrid/cl-test-grid/work-dir/agent/quicklisp/dists/quicklisp/software/hu.dwim.web-server-20150709-darcs/hu\.dwim\.web-server+swank.asd: Cannot IMPORT "NON-PROPAGATING-OPERATION" from package "ASDF"
(LOAD hu.dwim.web-server FAIL) needs newer ASDF, ASDF/FIND-SYSTEM:LOAD-SYSTEM-DEFINITION-ERROR : Error while trying to load definition for system hu.dwim.web-server from pathname /home/testgrid/cl-test-grid/work-dir/agent/quicklisp/dists/quicklisp/software/hu.dwim.web-server-20150709-darcs/hu\.dwim\.web-server.asd: Cannot IMPORT "NON-PROPAGATING-OPERATION" from package "ASDF"
(LOAD hu.dwim.web-server.test FAIL) needs newer ASDF, ASDF/FIND-SYSTEM:LOAD-SYSTEM-DEFINITION-ERROR : Error while trying to load definition for system hu.dwim.web-server.test from pathname /home/testgrid/cl-test-grid/work-dir/agent/quicklisp/dists/quicklisp/software/hu.dwim.web-server-20150608-darcs/hu\.dwim\.web-server\.test.asd: Cannot IMPORT "NON-PROPAGATING-OPERATION" from package "ASDF"
(LOAD hu.dwim.web-server.application.test FAIL) needs newer ASDF, ASDF/FIND-SYSTEM:LOAD-SYSTEM-DEFINITION-ERROR : Error while trying to load definition for system hu.dwim.web-server.application.test from pathname /home/testgrid/cl-test-grid/work-dir/agent/quicklisp/dists/quicklisp/software/hu.dwim.web-server-20150608-darcs/hu\.dwim\.web-server\.application\.test.asd: Cannot IMPORT "NON-PROPAGATING-OPERATION" from package "ASDF"
(LOAD hu.dwim.web-server.application+hu.dwim.perec FAIL) needs newer ASDF, ASDF/FIND-SYSTEM:LOAD-SYSTEM-DEFINITION-ERROR : Error while trying to load definition for system hu.dwim.web-server.application+hu.dwim.perec from pathname /home/testgrid/cl-test-grid/work-dir/agent/quicklisp/dists/quicklisp/software/hu.dwim.web-server-20150608-darcs/hu\.dwim\.web-server\.application+hu\.dwim\.perec.asd: Cannot IMPORT "NON-PROPAGATING-OPERATION" from package "ASDF"
(LOAD hu.dwim.web-server.application FAIL) needs newer ASDF, ASDF/FIND-SYSTEM:LOAD-SYSTEM-DEFINITION-ERROR : Error while trying to load definition for system hu.dwim.web-server.application from pathname /home/testgrid/cl-test-grid/work-dir/agent/quicklisp/dists/quicklisp/software/hu.dwim.web-server-20150608-darcs/hu\.dwim\.web-server\.application.asd: Cannot IMPORT "NON-PROPAGATING-OPERATION" from package "ASDF"
(LOAD hu.dwim.web-server+swank FAIL) needs newer ASDF, ASDF/FIND-SYSTEM:LOAD-SYSTEM-DEFINITION-ERROR : Error while trying to load definition for system hu.dwim.web-server+swank from pathname /home/testgrid/cl-test-grid/work-dir/agent/quicklisp/dists/quicklisp/software/hu.dwim.web-server-20150608-darcs/hu\.dwim\.web-server+swank.asd: Cannot IMPORT "NON-PROPAGATING-OPERATION" from package "ASDF"
(LOAD hu.dwim.web-server FAIL) needs newer ASDF, ASDF/FIND-SYSTEM:LOAD-SYSTEM-DEFINITION-ERROR : Error while trying to load definition for system hu.dwim.web-server from pathname /home/testgrid/cl-test-grid/work-dir/agent/quicklisp/dists/quicklisp/software/hu.dwim.web-server-20150608-darcs/hu\.dwim\.web-server.asd: Cannot IMPORT "NON-PROPAGATING-OPERATION" from package "ASDF"
clisp-2.49-unix-x64
(LOAD hu.dwim.web-server.test FAIL) needs newer ASDF, ASDF:LOAD-SYSTEM-DEFINITION-ERROR : Error while trying to load definition for system hu.dwim.web-server.test from pathname /home/hijarian/systems/cl-test-grid/work-dir/agent/quicklisp/dists/quicklisp/software/hu.dwim.web-server-20150608-darcs/hu.dwim.web-server.test.asd: DEFPACKAGE HU.DWIM.ASDF: Не существует символа ASDF::NON-PROPAGATING-OPERATION .
(LOAD hu.dwim.web-server.application.test FAIL) needs newer ASDF, ASDF:LOAD-SYSTEM-DEFINITION-ERROR : Error while trying to load definition for system hu.dwim.web-server.application.test from pathname /home/hijarian/systems/cl-test-grid/work-dir/agent/quicklisp/dists/quicklisp/software/hu.dwim.web-server-20150608-darcs/hu.dwim.web-server.application.test.asd: DEFPACKAGE HU.DWIM.ASDF: Не существует символа ASDF::NON-PROPAGATING-OPERATION .
(LOAD hu.dwim.web-server.application+hu.dwim.perec FAIL) needs newer ASDF, ASDF:LOAD-SYSTEM-DEFINITION-ERROR : Error while trying to load definition for system hu.dwim.web-server.application+hu.dwim.perec from pathname /home/hijarian/systems/cl-test-grid/work-dir/agent/quicklisp/dists/quicklisp/software/hu.dwim.web-server-20150608-darcs/hu.dwim.web-server.application+hu.dwim.perec.asd: DEFPACKAGE HU.DWIM.ASDF: Не существует символа ASDF::NON-PROPAGATING-OPERATION .
(LOAD hu.dwim.web-server.application FAIL) needs newer ASDF, ASDF:LOAD-SYSTEM-DEFINITION-ERROR : Error while trying to load definition for system hu.dwim.web-server.application from pathname /home/hijarian/systems/cl-test-grid/work-dir/agent/quicklisp/dists/quicklisp/software/hu.dwim.web-server-20150608-darcs/hu.dwim.web-server.application.asd: DEFPACKAGE HU.DWIM.ASDF: Не существует символа ASDF::NON-PROPAGATING-OPERATION .
(LOAD hu.dwim.web-server+swank FAIL) needs newer ASDF, ASDF:LOAD-SYSTEM-DEFINITION-ERROR : Error while trying to load definition for system hu.dwim.web-server+swank from pathname /home/hijarian/systems/cl-test-grid/work-dir/agent/quicklisp/dists/quicklisp/software/hu.dwim.web-server-20150608-darcs/hu.dwim.web-server+swank.asd: DEFPACKAGE HU.DWIM.ASDF: Не существует символа ASDF::NON-PROPAGATING-OPERATION .
(LOAD hu.dwim.web-server FAIL) needs newer ASDF, ASDF:LOAD-SYSTEM-DEFINITION-ERROR : Error while trying to load definition for system hu.dwim.web-server from pathname /home/hijarian/systems/cl-test-grid/work-dir/agent/quicklisp/dists/quicklisp/software/hu.dwim.web-server-20150608-darcs/hu.dwim.web-server.asd: DEFPACKAGE HU.DWIM.ASDF: Не существует символа ASDF::NON-PROPAGATING-OPERATION .
clisp-2.49-unix-x86
(LOAD hu.dwim.web-server.websocket FAIL) needs newer ASDF, ASDF:LOAD-SYSTEM-DEFINITION-ERROR : Error while trying to load definition for system hu.dwim.web-server.websocket from pathname /home/testgrid/cl-test-grid/work-dir/agent/quicklisp/dists/quicklisp/software/hu.dwim.web-server-20150709-darcs/hu.dwim.web-server.websocket.asd: DEFPACKAGE HU.DWIM.ASDF: There is no symbol ASDF::NON-PROPAGATING-OPERATION .
(LOAD hu.dwim.web-server.test FAIL) needs newer ASDF, ASDF:LOAD-SYSTEM-DEFINITION-ERROR : Error while trying to load definition for system hu.dwim.web-server.test from pathname /home/testgrid/cl-test-grid/work-dir/agent/quicklisp/dists/quicklisp/software/hu.dwim.web-server-20150709-darcs/hu.dwim.web-server.test.asd: DEFPACKAGE HU.DWIM.ASDF: There is no symbol ASDF::NON-PROPAGATING-OPERATION .
(LOAD hu.dwim.web-server.documentation FAIL) needs newer ASDF, ASDF:LOAD-SYSTEM-DEFINITION-ERROR : Error while trying to load definition for system hu.dwim.web-server.documentation from pathname /home/testgrid/cl-test-grid/work-dir/agent/quicklisp/dists/quicklisp/software/hu.dwim.web-server-20150709-darcs/hu.dwim.web-server.documentation.asd: DEFPACKAGE HU.DWIM.ASDF: There is no symbol ASDF::NON-PROPAGATING-OPERATION .
(LOAD hu.dwim.web-server.application.test FAIL) needs newer ASDF, ASDF:LOAD-SYSTEM-DEFINITION-ERROR : Error while trying to load definition for system hu.dwim.web-server.application.test from pathname /home/testgrid/cl-test-grid/work-dir/agent/quicklisp/dists/quicklisp/software/hu.dwim.web-server-20150709-darcs/hu.dwim.web-server.application.test.asd: DEFPACKAGE HU.DWIM.ASDF: There is no symbol ASDF::NON-PROPAGATING-OPERATION .
(LOAD hu.dwim.web-server.application+hu.dwim.perec FAIL) needs newer ASDF, ASDF:LOAD-SYSTEM-DEFINITION-ERROR : Error while trying to load definition for system hu.dwim.web-server.application+hu.dwim.perec from pathname /home/testgrid/cl-test-grid/work-dir/agent/quicklisp/dists/quicklisp/software/hu.dwim.web-server-20150709-darcs/hu.dwim.web-server.application+hu.dwim.perec.asd: DEFPACKAGE HU.DWIM.ASDF: There is no symbol ASDF::NON-PROPAGATING-OPERATION .
(LOAD hu.dwim.web-server.application FAIL) needs newer ASDF, ASDF:LOAD-SYSTEM-DEFINITION-ERROR : Error while trying to load definition for system hu.dwim.web-server.application from pathname /home/testgrid/cl-test-grid/work-dir/agent/quicklisp/dists/quicklisp/software/hu.dwim.web-server-20150709-darcs/hu.dwim.web-server.application.asd: DEFPACKAGE HU.DWIM.ASDF: There is no symbol ASDF::NON-PROPAGATING-OPERATION .
(LOAD hu.dwim.web-server+swank FAIL) needs newer ASDF, ASDF:LOAD-SYSTEM-DEFINITION-ERROR : Error while trying to load definition for system hu.dwim.web-server+swank from pathname /home/testgrid/cl-test-grid/work-dir/agent/quicklisp/dists/quicklisp/software/hu.dwim.web-server-20150709-darcs/hu.dwim.web-server+swank.asd: DEFPACKAGE HU.DWIM.ASDF: There is no symbol ASDF::NON-PROPAGATING-OPERATION .
(LOAD hu.dwim.web-server FAIL) needs newer ASDF, ASDF:LOAD-SYSTEM-DEFINITION-ERROR : Error while trying to load definition for system hu.dwim.web-server from pathname /home/testgrid/cl-test-grid/work-dir/agent/quicklisp/dists/quicklisp/software/hu.dwim.web-server-20150709-darcs/hu.dwim.web-server.asd: DEFPACKAGE HU.DWIM.ASDF: There is no symbol ASDF::NON-PROPAGATING-OPERATION .
(LOAD hu.dwim.web-server.test FAIL) needs newer ASDF, ASDF:LOAD-SYSTEM-DEFINITION-ERROR : Error while trying to load definition for system hu.dwim.web-server.test from pathname /home/testgrid/cl-test-grid/work-dir/agent/quicklisp/dists/quicklisp/software/hu.dwim.web-server-20150608-darcs/hu.dwim.web-server.test.asd: DEFPACKAGE HU.DWIM.ASDF: There is no symbol ASDF::NON-PROPAGATING-OPERATION .
(LOAD hu.dwim.web-server.application.test FAIL) needs newer ASDF, ASDF:LOAD-SYSTEM-DEFINITION-ERROR : Error while trying to load definition for system hu.dwim.web-server.application.test from pathname /home/testgrid/cl-test-grid/work-dir/agent/quicklisp/dists/quicklisp/software/hu.dwim.web-server-20150608-darcs/hu.dwim.web-server.application.test.asd: DEFPACKAGE HU.DWIM.ASDF: There is no symbol ASDF::NON-PROPAGATING-OPERATION .
(LOAD hu.dwim.web-server.application+hu.dwim.perec FAIL) needs newer ASDF, ASDF:LOAD-SYSTEM-DEFINITION-ERROR : Error while trying to load definition for system hu.dwim.web-server.application+hu.dwim.perec from pathname /home/testgrid/cl-test-grid/work-dir/agent/quicklisp/dists/quicklisp/software/hu.dwim.web-server-20150608-darcs/hu.dwim.web-server.application+hu.dwim.perec.asd: DEFPACKAGE HU.DWIM.ASDF: There is no symbol ASDF::NON-PROPAGATING-OPERATION .
(LOAD hu.dwim.web-server.application FAIL) needs newer ASDF, ASDF:LOAD-SYSTEM-DEFINITION-ERROR : Error while trying to load definition for system hu.dwim.web-server.application from pathname /home/testgrid/cl-test-grid/work-dir/agent/quicklisp/dists/quicklisp/software/hu.dwim.web-server-20150608-darcs/hu.dwim.web-server.application.asd: DEFPACKAGE HU.DWIM.ASDF: There is no symbol ASDF::NON-PROPAGATING-OPERATION .
(LOAD hu.dwim.web-server+swank FAIL) needs newer ASDF, ASDF:LOAD-SYSTEM-DEFINITION-ERROR : Error while trying to load definition for system hu.dwim.web-server+swank from pathname /home/testgrid/cl-test-grid/work-dir/agent/quicklisp/dists/quicklisp/software/hu.dwim.web-server-20150608-darcs/hu.dwim.web-server+swank.asd: DEFPACKAGE HU.DWIM.ASDF: There is no symbol ASDF::NON-PROPAGATING-OPERATION .
(LOAD hu.dwim.web-server FAIL) needs newer ASDF, ASDF:LOAD-SYSTEM-DEFINITION-ERROR : Error while trying to load definition for system hu.dwim.web-server from pathname /home/testgrid/cl-test-grid/work-dir/agent/quicklisp/dists/quicklisp/software/hu.dwim.web-server-20150608-darcs/hu.dwim.web-server.asd: DEFPACKAGE HU.DWIM.ASDF: There is no symbol ASDF::NON-PROPAGATING-OPERATION .
cmu-snapshot-2013-04__20d_unicode_-linux-x86
(LOAD hu.dwim.web-server.websocket FAIL) needs newer ASDF, ASDF/FIND-SYSTEM:LOAD-SYSTEM-DEFINITION-ERROR : Error while trying to load definition for system hu.dwim.web-server.websocket from pathname /home/testgrid/cl-test-grid/work-dir/agent/quicklisp/dists/quicklisp/software/hu.dwim.web-server-20150709-darcs/hu.dwim.web-server.websocket.asd: ASDF/INTERFACE does not contain a symbol NON-PROPAGATING-OPERATION
(LOAD hu.dwim.web-server.test FAIL) needs newer ASDF, ASDF/FIND-SYSTEM:LOAD-SYSTEM-DEFINITION-ERROR : Error while trying to load definition for system hu.dwim.web-server.test from pathname /home/testgrid/cl-test-grid/work-dir/agent/quicklisp/dists/quicklisp/software/hu.dwim.web-server-20150709-darcs/hu.dwim.web-server.test.asd: ASDF/INTERFACE does not contain a symbol NON-PROPAGATING-OPERATION
(LOAD hu.dwim.web-server.documentation FAIL) needs newer ASDF, ASDF/FIND-SYSTEM:LOAD-SYSTEM-DEFINITION-ERROR : Error while trying to load definition for system hu.dwim.web-server.documentation from pathname /home/testgrid/cl-test-grid/work-dir/agent/quicklisp/dists/quicklisp/software/hu.dwim.web-server-20150709-darcs/hu.dwim.web-server.documentation.asd: ASDF/INTERFACE does not contain a symbol NON-PROPAGATING-OPERATION
(LOAD hu.dwim.web-server.application.test FAIL) needs newer ASDF, ASDF/FIND-SYSTEM:LOAD-SYSTEM-DEFINITION-ERROR : Error while trying to load definition for system hu.dwim.web-server.application.test from pathname /home/testgrid/cl-test-grid/work-dir/agent/quicklisp/dists/quicklisp/software/hu.dwim.web-server-20150709-darcs/hu.dwim.web-server.application.test.asd: ASDF/INTERFACE does not contain a symbol NON-PROPAGATING-OPERATION
(LOAD hu.dwim.web-server.application+hu.dwim.perec FAIL) needs newer ASDF, ASDF/FIND-SYSTEM:LOAD-SYSTEM-DEFINITION-ERROR : Error while trying to load definition for system hu.dwim.web-server.application+hu.dwim.perec from pathname /home/testgrid/cl-test-grid/work-dir/agent/quicklisp/dists/quicklisp/software/hu.dwim.web-server-20150709-darcs/hu.dwim.web-server.application+hu.dwim.perec.asd: ASDF/INTERFACE does not contain a symbol NON-PROPAGATING-OPERATION
(LOAD hu.dwim.web-server.application FAIL) needs newer ASDF, ASDF/FIND-SYSTEM:LOAD-SYSTEM-DEFINITION-ERROR : Error while trying to load definition for system hu.dwim.web-server.application from pathname /home/testgrid/cl-test-grid/work-dir/agent/quicklisp/dists/quicklisp/software/hu.dwim.web-server-20150709-darcs/hu.dwim.web-server.application.asd: ASDF/INTERFACE does not contain a symbol NON-PROPAGATING-OPERATION
(LOAD hu.dwim.web-server+swank FAIL) needs newer ASDF, ASDF/FIND-SYSTEM:LOAD-SYSTEM-DEFINITION-ERROR : Error while trying to load definition for system hu.dwim.web-server+swank from pathname /home/testgrid/cl-test-grid/work-dir/agent/quicklisp/dists/quicklisp/software/hu.dwim.web-server-20150709-darcs/hu.dwim.web-server+swank.asd: ASDF/INTERFACE does not contain a symbol NON-PROPAGATING-OPERATION
(LOAD hu.dwim.web-server FAIL) needs newer ASDF, ASDF/FIND-SYSTEM:LOAD-SYSTEM-DEFINITION-ERROR : Error while trying to load definition for system hu.dwim.web-server from pathname /home/testgrid/cl-test-grid/work-dir/agent/quicklisp/dists/quicklisp/software/hu.dwim.web-server-20150709-darcs/hu.dwim.web-server.asd: ASDF/INTERFACE does not contain a symbol NON-PROPAGATING-OPERATION
(LOAD hu.dwim.web-server.test FAIL) needs newer ASDF, ASDF/FIND-SYSTEM:LOAD-SYSTEM-DEFINITION-ERROR : Error while trying to load definition for system hu.dwim.web-server.test from pathname /home/testgrid/cl-test-grid/work-dir/agent/quicklisp/dists/quicklisp/software/hu.dwim.web-server-20150608-darcs/hu.dwim.web-server.test.asd: ASDF/INTERFACE does not contain a symbol NON-PROPAGATING-OPERATION
(LOAD hu.dwim.web-server.application.test FAIL) needs newer ASDF, ASDF/FIND-SYSTEM:LOAD-SYSTEM-DEFINITION-ERROR : Error while trying to load definition for system hu.dwim.web-server.application.test from pathname /home/testgrid/cl-test-grid/work-dir/agent/quicklisp/dists/quicklisp/software/hu.dwim.web-server-20150608-darcs/hu.dwim.web-server.application.test.asd: ASDF/INTERFACE does not contain a symbol NON-PROPAGATING-OPERATION
(LOAD hu.dwim.web-server.application+hu.dwim.perec FAIL) needs newer ASDF, ASDF/FIND-SYSTEM:LOAD-SYSTEM-DEFINITION-ERROR : Error while trying to load definition for system hu.dwim.web-server.application+hu.dwim.perec from pathname /home/testgrid/cl-test-grid/work-dir/agent/quicklisp/dists/quicklisp/software/hu.dwim.web-server-20150608-darcs/hu.dwim.web-server.application+hu.dwim.perec.asd: ASDF/INTERFACE does not contain a symbol NON-PROPAGATING-OPERATION
(LOAD hu.dwim.web-server.application FAIL) needs newer ASDF, ASDF/FIND-SYSTEM:LOAD-SYSTEM-DEFINITION-ERROR : Error while trying to load definition for system hu.dwim.web-server.application from pathname /home/testgrid/cl-test-grid/work-dir/agent/quicklisp/dists/quicklisp/software/hu.dwim.web-server-20150608-darcs/hu.dwim.web-server.application.asd: ASDF/INTERFACE does not contain a symbol NON-PROPAGATING-OPERATION
(LOAD hu.dwim.web-server+swank FAIL) needs newer ASDF, ASDF/FIND-SYSTEM:LOAD-SYSTEM-DEFINITION-ERROR : Error while trying to load definition for system hu.dwim.web-server+swank from pathname /home/testgrid/cl-test-grid/work-dir/agent/quicklisp/dists/quicklisp/software/hu.dwim.web-server-20150608-darcs/hu.dwim.web-server+swank.asd: ASDF/INTERFACE does not contain a symbol NON-PROPAGATING-OPERATION
(LOAD hu.dwim.web-server FAIL) needs newer ASDF, ASDF/FIND-SYSTEM:LOAD-SYSTEM-DEFINITION-ERROR : Error while trying to load definition for system hu.dwim.web-server from pathname /home/testgrid/cl-test-grid/work-dir/agent/quicklisp/dists/quicklisp/software/hu.dwim.web-server-20150608-darcs/hu.dwim.web-server.asd: ASDF/INTERFACE does not contain a symbol NON-PROPAGATING-OPERATION
cmu-snapshot-2014-01__20e_unicode_-linux-x86
(LOAD hu.dwim.web-server.websocket FAIL) needs newer ASDF, ASDF/FIND-SYSTEM:LOAD-SYSTEM-DEFINITION-ERROR : Error while trying to load definition for system hu.dwim.web-server.websocket from pathname /home/testgrid/cl-test-grid/work-dir/agent/quicklisp/dists/quicklisp/software/hu.dwim.web-server-20150709-darcs/hu.dwim.web-server.websocket.asd: ASDF/INTERFACE does not contain a symbol NON-PROPAGATING-OPERATION
(LOAD hu.dwim.web-server.test FAIL) needs newer ASDF, ASDF/FIND-SYSTEM:LOAD-SYSTEM-DEFINITION-ERROR : Error while trying to load definition for system hu.dwim.web-server.test from pathname /home/testgrid/cl-test-grid/work-dir/agent/quicklisp/dists/quicklisp/software/hu.dwim.web-server-20150709-darcs/hu.dwim.web-server.test.asd: ASDF/INTERFACE does not contain a symbol NON-PROPAGATING-OPERATION
(LOAD hu.dwim.web-server.documentation FAIL) needs newer ASDF, ASDF/FIND-SYSTEM:LOAD-SYSTEM-DEFINITION-ERROR : Error while trying to load definition for system hu.dwim.web-server.documentation from pathname /home/testgrid/cl-test-grid/work-dir/agent/quicklisp/dists/quicklisp/software/hu.dwim.web-server-20150709-darcs/hu.dwim.web-server.documentation.asd: ASDF/INTERFACE does not contain a symbol NON-PROPAGATING-OPERATION
(LOAD hu.dwim.web-server.application.test FAIL) needs newer ASDF, ASDF/FIND-SYSTEM:LOAD-SYSTEM-DEFINITION-ERROR : Error while trying to load definition for system hu.dwim.web-server.application.test from pathname /home/testgrid/cl-test-grid/work-dir/agent/quicklisp/dists/quicklisp/software/hu.dwim.web-server-20150709-darcs/hu.dwim.web-server.application.test.asd: ASDF/INTERFACE does not contain a symbol NON-PROPAGATING-OPERATION
(LOAD hu.dwim.web-server.application+hu.dwim.perec FAIL) needs newer ASDF, ASDF/FIND-SYSTEM:LOAD-SYSTEM-DEFINITION-ERROR : Error while trying to load definition for system hu.dwim.web-server.application+hu.dwim.perec from pathname /home/testgrid/cl-test-grid/work-dir/agent/quicklisp/dists/quicklisp/software/hu.dwim.web-server-20150709-darcs/hu.dwim.web-server.application+hu.dwim.perec.asd: ASDF/INTERFACE does not contain a symbol NON-PROPAGATING-OPERATION
(LOAD hu.dwim.web-server.application FAIL) needs newer ASDF, ASDF/FIND-SYSTEM:LOAD-SYSTEM-DEFINITION-ERROR : Error while trying to load definition for system hu.dwim.web-server.application from pathname /home/testgrid/cl-test-grid/work-dir/agent/quicklisp/dists/quicklisp/software/hu.dwim.web-server-20150709-darcs/hu.dwim.web-server.application.asd: ASDF/INTERFACE does not contain a symbol NON-PROPAGATING-OPERATION
(LOAD hu.dwim.web-server+swank FAIL) needs newer ASDF, ASDF/FIND-SYSTEM:LOAD-SYSTEM-DEFINITION-ERROR : Error while trying to load definition for system hu.dwim.web-server+swank from pathname /home/testgrid/cl-test-grid/work-dir/agent/quicklisp/dists/quicklisp/software/hu.dwim.web-server-20150709-darcs/hu.dwim.web-server+swank.asd: ASDF/INTERFACE does not contain a symbol NON-PROPAGATING-OPERATION
(LOAD hu.dwim.web-server FAIL) needs newer ASDF, ASDF/FIND-SYSTEM:LOAD-SYSTEM-DEFINITION-ERROR : Error while trying to load definition for system hu.dwim.web-server from pathname /home/testgrid/cl-test-grid/work-dir/agent/quicklisp/dists/quicklisp/software/hu.dwim.web-server-20150709-darcs/hu.dwim.web-server.asd: ASDF/INTERFACE does not contain a symbol NON-PROPAGATING-OPERATION
(LOAD hu.dwim.web-server.test FAIL) needs newer ASDF, ASDF/FIND-SYSTEM:LOAD-SYSTEM-DEFINITION-ERROR : Error while trying to load definition for system hu.dwim.web-server.test from pathname /home/testgrid/cl-test-grid/work-dir/agent/quicklisp/dists/quicklisp/software/hu.dwim.web-server-20150608-darcs/hu.dwim.web-server.test.asd: ASDF/INTERFACE does not contain a symbol NON-PROPAGATING-OPERATION
(LOAD hu.dwim.web-server.application.test FAIL) needs newer ASDF, ASDF/FIND-SYSTEM:LOAD-SYSTEM-DEFINITION-ERROR : Error while trying to load definition for system hu.dwim.web-server.application.test from pathname /home/testgrid/cl-test-grid/work-dir/agent/quicklisp/dists/quicklisp/software/hu.dwim.web-server-20150608-darcs/hu.dwim.web-server.application.test.asd: ASDF/INTERFACE does not contain a symbol NON-PROPAGATING-OPERATION
(LOAD hu.dwim.web-server.application+hu.dwim.perec FAIL) needs newer ASDF, ASDF/FIND-SYSTEM:LOAD-SYSTEM-DEFINITION-ERROR : Error while trying to load definition for system hu.dwim.web-server.application+hu.dwim.perec from pathname /home/testgrid/cl-test-grid/work-dir/agent/quicklisp/dists/quicklisp/software/hu.dwim.web-server-20150608-darcs/hu.dwim.web-server.application+hu.dwim.perec.asd: ASDF/INTERFACE does not contain a symbol NON-PROPAGATING-OPERATION
(LOAD hu.dwim.web-server.application FAIL) needs newer ASDF, ASDF/FIND-SYSTEM:LOAD-SYSTEM-DEFINITION-ERROR : Error while trying to load definition for system hu.dwim.web-server.application from pathname /home/testgrid/cl-test-grid/work-dir/agent/quicklisp/dists/quicklisp/software/hu.dwim.web-server-20150608-darcs/hu.dwim.web-server.application.asd: ASDF/INTERFACE does not contain a symbol NON-PROPAGATING-OPERATION
(LOAD hu.dwim.web-server+swank FAIL) needs newer ASDF, ASDF/FIND-SYSTEM:LOAD-SYSTEM-DEFINITION-ERROR : Error while trying to load definition for system hu.dwim.web-server+swank from pathname /home/testgrid/cl-test-grid/work-dir/agent/quicklisp/dists/quicklisp/software/hu.dwim.web-server-20150608-darcs/hu.dwim.web-server+swank.asd: ASDF/INTERFACE does not contain a symbol NON-PROPAGATING-OPERATION
(LOAD hu.dwim.web-server FAIL) needs newer ASDF, ASDF/FIND-SYSTEM:LOAD-SYSTEM-DEFINITION-ERROR : Error while trying to load definition for system hu.dwim.web-server from pathname /home/testgrid/cl-test-grid/work-dir/agent/quicklisp/dists/quicklisp/software/hu.dwim.web-server-20150608-darcs/hu.dwim.web-server.asd: ASDF/INTERFACE does not contain a symbol NON-PROPAGATING-OPERATION
cmu-snapshot-2014-05-dirty__20e_unicode_-linux-x86
(LOAD hu.dwim.web-server.websocket FAIL) needs newer ASDF, ASDF/FIND-SYSTEM:LOAD-SYSTEM-DEFINITION-ERROR : Error while trying to load definition for system hu.dwim.web-server.websocket from pathname /home/testgrid/cl-test-grid/work-dir/agent/quicklisp/dists/quicklisp/software/hu.dwim.web-server-20150709-darcs/hu.dwim.web-server.websocket.asd: ASDF/INTERFACE does not contain a symbol NON-PROPAGATING-OPERATION
(LOAD hu.dwim.web-server.test FAIL) needs newer ASDF, ASDF/FIND-SYSTEM:LOAD-SYSTEM-DEFINITION-ERROR : Error while trying to load definition for system hu.dwim.web-server.test from pathname /home/testgrid/cl-test-grid/work-dir/agent/quicklisp/dists/quicklisp/software/hu.dwim.web-server-20150709-darcs/hu.dwim.web-server.test.asd: ASDF/INTERFACE does not contain a symbol NON-PROPAGATING-OPERATION
(LOAD hu.dwim.web-server.documentation FAIL) needs newer ASDF, ASDF/FIND-SYSTEM:LOAD-SYSTEM-DEFINITION-ERROR : Error while trying to load definition for system hu.dwim.web-server.documentation from pathname /home/testgrid/cl-test-grid/work-dir/agent/quicklisp/dists/quicklisp/software/hu.dwim.web-server-20150709-darcs/hu.dwim.web-server.documentation.asd: ASDF/INTERFACE does not contain a symbol NON-PROPAGATING-OPERATION
(LOAD hu.dwim.web-server.application.test FAIL) needs newer ASDF, ASDF/FIND-SYSTEM:LOAD-SYSTEM-DEFINITION-ERROR : Error while trying to load definition for system hu.dwim.web-server.application.test from pathname /home/testgrid/cl-test-grid/work-dir/agent/quicklisp/dists/quicklisp/software/hu.dwim.web-server-20150709-darcs/hu.dwim.web-server.application.test.asd: ASDF/INTERFACE does not contain a symbol NON-PROPAGATING-OPERATION
(LOAD hu.dwim.web-server.application+hu.dwim.perec FAIL) needs newer ASDF, ASDF/FIND-SYSTEM:LOAD-SYSTEM-DEFINITION-ERROR : Error while trying to load definition for system hu.dwim.web-server.application+hu.dwim.perec from pathname /home/testgrid/cl-test-grid/work-dir/agent/quicklisp/dists/quicklisp/software/hu.dwim.web-server-20150709-darcs/hu.dwim.web-server.application+hu.dwim.perec.asd: ASDF/INTERFACE does not contain a symbol NON-PROPAGATING-OPERATION
(LOAD hu.dwim.web-server.application FAIL) needs newer ASDF, ASDF/FIND-SYSTEM:LOAD-SYSTEM-DEFINITION-ERROR : Error while trying to load definition for system hu.dwim.web-server.application from pathname /home/testgrid/cl-test-grid/work-dir/agent/quicklisp/dists/quicklisp/software/hu.dwim.web-server-20150709-darcs/hu.dwim.web-server.application.asd: ASDF/INTERFACE does not contain a symbol NON-PROPAGATING-OPERATION
(LOAD hu.dwim.web-server+swank FAIL) needs newer ASDF, ASDF/FIND-SYSTEM:LOAD-SYSTEM-DEFINITION-ERROR : Error while trying to load definition for system hu.dwim.web-server+swank from pathname /home/testgrid/cl-test-grid/work-dir/agent/quicklisp/dists/quicklisp/software/hu.dwim.web-server-20150709-darcs/hu.dwim.web-server+swank.asd: ASDF/INTERFACE does not contain a symbol NON-PROPAGATING-OPERATION
(LOAD hu.dwim.web-server FAIL) needs newer ASDF, ASDF/FIND-SYSTEM:LOAD-SYSTEM-DEFINITION-ERROR : Error while trying to load definition for system hu.dwim.web-server from pathname /home/testgrid/cl-test-grid/work-dir/agent/quicklisp/dists/quicklisp/software/hu.dwim.web-server-20150709-darcs/hu.dwim.web-server.asd: ASDF/INTERFACE does not contain a symbol NON-PROPAGATING-OPERATION
(LOAD hu.dwim.web-server.test FAIL) needs newer ASDF, ASDF/FIND-SYSTEM:LOAD-SYSTEM-DEFINITION-ERROR : Error while trying to load definition for system hu.dwim.web-server.test from pathname /home/testgrid/cl-test-grid/work-dir/agent/quicklisp/dists/quicklisp/software/hu.dwim.web-server-20150608-darcs/hu.dwim.web-server.test.asd: ASDF/INTERFACE does not contain a symbol NON-PROPAGATING-OPERATION
(LOAD hu.dwim.web-server.application.test FAIL) needs newer ASDF, ASDF/FIND-SYSTEM:LOAD-SYSTEM-DEFINITION-ERROR : Error while trying to load definition for system hu.dwim.web-server.application.test from pathname /home/testgrid/cl-test-grid/work-dir/agent/quicklisp/dists/quicklisp/software/hu.dwim.web-server-20150608-darcs/hu.dwim.web-server.application.test.asd: ASDF/INTERFACE does not contain a symbol NON-PROPAGATING-OPERATION
(LOAD hu.dwim.web-server.application+hu.dwim.perec FAIL) needs newer ASDF, ASDF/FIND-SYSTEM:LOAD-SYSTEM-DEFINITION-ERROR : Error while trying to load definition for system hu.dwim.web-server.application+hu.dwim.perec from pathname /home/testgrid/cl-test-grid/work-dir/agent/quicklisp/dists/quicklisp/software/hu.dwim.web-server-20150608-darcs/hu.dwim.web-server.application+hu.dwim.perec.asd: ASDF/INTERFACE does not contain a symbol NON-PROPAGATING-OPERATION
(LOAD hu.dwim.web-server.application FAIL) needs newer ASDF, ASDF/FIND-SYSTEM:LOAD-SYSTEM-DEFINITION-ERROR : Error while trying to load definition for system hu.dwim.web-server.application from pathname /home/testgrid/cl-test-grid/work-dir/agent/quicklisp/dists/quicklisp/software/hu.dwim.web-server-20150608-darcs/hu.dwim.web-server.application.asd: ASDF/INTERFACE does not contain a symbol NON-PROPAGATING-OPERATION
(LOAD hu.dwim.web-server+swank FAIL) needs newer ASDF, ASDF/FIND-SYSTEM:LOAD-SYSTEM-DEFINITION-ERROR : Error while trying to load definition for system hu.dwim.web-server+swank from pathname /home/testgrid/cl-test-grid/work-dir/agent/quicklisp/dists/quicklisp/software/hu.dwim.web-server-20150608-darcs/hu.dwim.web-server+swank.asd: ASDF/INTERFACE does not contain a symbol NON-PROPAGATING-OPERATION
(LOAD hu.dwim.web-server FAIL) needs newer ASDF, ASDF/FIND-SYSTEM:LOAD-SYSTEM-DEFINITION-ERROR : Error while trying to load definition for system hu.dwim.web-server from pathname /home/testgrid/cl-test-grid/work-dir/agent/quicklisp/dists/quicklisp/software/hu.dwim.web-server-20150608-darcs/hu.dwim.web-server.asd: ASDF/INTERFACE does not contain a symbol NON-PROPAGATING-OPERATION
cmu-snapshot-2014-12___20f_unicode_-linux-x86
(LOAD hu.dwim.web-server.websocket FAIL) COMMON-LISP:SIMPLE-ERROR : Error in function USE-PACKAGE: Use'ing package CLOSER-MOP results in name conflicts for these symbols: (TYPEP SUBTYPEP)
(LOAD hu.dwim.web-server.test FAIL) ASDF/FIND-SYSTEM:LOAD-SYSTEM-DEFINITION-ERROR : Error while trying to load definition for system hu.dwim.computed-class+hu.dwim.logger from pathname /home/testgrid/cl-test-grid/work-dir/agent/quicklisp/dists/quicklisp/software/hu.dwim.computed-class-20150709-darcs/hu.dwim.computed-class+hu.dwim.logger.asd: Error in function USE-PACKAGE: Use'ing package CLOSER-MOP results in name conflicts for these symbols: (TYPEP SUBTYPEP)
(LOAD hu.dwim.web-server.documentation FAIL) ASDF/FIND-SYSTEM:LOAD-SYSTEM-DEFINITION-ERROR : Error while trying to load definition for system hu.dwim.computed-class+hu.dwim.logger from pathname /home/testgrid/cl-test-grid/work-dir/agent/quicklisp/dists/quicklisp/software/hu.dwim.computed-class-20150709-darcs/hu.dwim.computed-class+hu.dwim.logger.asd: Error in function USE-PACKAGE: Use'ing package CLOSER-MOP results in name conflicts for these symbols: (TYPEP SUBTYPEP)
(LOAD hu.dwim.web-server.application.test FAIL) ASDF/FIND-SYSTEM:LOAD-SYSTEM-DEFINITION-ERROR : Error while trying to load definition for system hu.dwim.computed-class+hu.dwim.logger from pathname /home/testgrid/cl-test-grid/work-dir/agent/quicklisp/dists/quicklisp/software/hu.dwim.computed-class-20150709-darcs/hu.dwim.computed-class+hu.dwim.logger.asd: Error in function USE-PACKAGE: Use'ing package CLOSER-MOP results in name conflicts for these symbols: (TYPEP SUBTYPEP)
(LOAD hu.dwim.web-server.application+hu.dwim.perec FAIL) COMMON-LISP:SIMPLE-ERROR : Error in function USE-PACKAGE: Use'ing package CLOSER-MOP results in name conflicts for these symbols: (TYPEP SUBTYPEP)
(LOAD hu.dwim.web-server.application FAIL) COMMON-LISP:SIMPLE-ERROR : Error in function USE-PACKAGE: Use'ing package CLOSER-MOP results in name conflicts for these symbols: (TYPEP SUBTYPEP)
(LOAD hu.dwim.web-server+swank FAIL) COMMON-LISP:SIMPLE-ERROR : Error in function USE-PACKAGE: Use'ing package CLOSER-MOP results in name conflicts for these symbols: (TYPEP SUBTYPEP)
(LOAD hu.dwim.web-server FAIL) COMMON-LISP:SIMPLE-ERROR : Error in function USE-PACKAGE: Use'ing package CLOSER-MOP results in name conflicts for these symbols: (TYPEP SUBTYPEP)
(LOAD hu.dwim.web-server.test FAIL) ASDF/FIND-SYSTEM:LOAD-SYSTEM-DEFINITION-ERROR : Error while trying to load definition for system hu.dwim.computed-class+hu.dwim.logger from pathname /home/testgrid/cl-test-grid/work-dir/agent/quicklisp/dists/quicklisp/software/hu.dwim.computed-class-20150608-darcs/hu.dwim.computed-class+hu.dwim.logger.asd: Error in function USE-PACKAGE: Use'ing package CLOSER-MOP results in name conflicts for these symbols: (TYPEP SUBTYPEP)
(LOAD hu.dwim.web-server.application.test FAIL) ASDF/FIND-SYSTEM:LOAD-SYSTEM-DEFINITION-ERROR : Error while trying to load definition for system hu.dwim.computed-class+hu.dwim.logger from pathname /home/testgrid/cl-test-grid/work-dir/agent/quicklisp/dists/quicklisp/software/hu.dwim.computed-class-20150608-darcs/hu.dwim.computed-class+hu.dwim.logger.asd: Error in function USE-PACKAGE: Use'ing package CLOSER-MOP results in name conflicts for these symbols: (TYPEP SUBTYPEP)
(LOAD hu.dwim.web-server.application+hu.dwim.perec FAIL) COMMON-LISP:SIMPLE-ERROR : Error in function USE-PACKAGE: Use'ing package CLOSER-MOP results in name conflicts for these symbols: (TYPEP SUBTYPEP)
(LOAD hu.dwim.web-server.application FAIL) COMMON-LISP:SIMPLE-ERROR : Error in function USE-PACKAGE: Use'ing package CLOSER-MOP results in name conflicts for these symbols: (TYPEP SUBTYPEP)
(LOAD hu.dwim.web-server+swank FAIL) COMMON-LISP:SIMPLE-ERROR : Error in function USE-PACKAGE: Use'ing package CLOSER-MOP results in name conflicts for these symbols: (TYPEP SUBTYPEP)
(LOAD hu.dwim.web-server FAIL) COMMON-LISP:SIMPLE-ERROR : Error in function USE-PACKAGE: Use'ing package CLOSER-MOP results in name conflicts for these symbols: (TYPEP SUBTYPEP)
ecl-13.5.1-unknown-linux-i686-bytecode
(LOAD hu.dwim.web-server.websocket FAIL) needs newer ASDF, ASDF/FIND-SYSTEM:LOAD-SYSTEM-DEFINITION-ERROR : Error while trying to load definition for system hu.dwim.web-server.websocket from pathname /home/testgrid/cl-test-grid/work-dir/agent/quicklisp/dists/quicklisp/software/hu.dwim.web-server-20150709-darcs/hu.dwim.web-server.websocket.asd: Cannot find symbol "NON-PROPAGATING-OPERATION" in package #<"ASDF/INTERFACE" package>
(LOAD hu.dwim.web-server.test FAIL) needs newer ASDF, ASDF/FIND-SYSTEM:LOAD-SYSTEM-DEFINITION-ERROR : Error while trying to load definition for system hu.dwim.web-server.test from pathname /home/testgrid/cl-test-grid/work-dir/agent/quicklisp/dists/quicklisp/software/hu.dwim.web-server-20150709-darcs/hu.dwim.web-server.test.asd: Cannot find symbol "NON-PROPAGATING-OPERATION" in package #<"ASDF/INTERFACE" package>
(LOAD hu.dwim.web-server.documentation FAIL) needs newer ASDF, ASDF/FIND-SYSTEM:LOAD-SYSTEM-DEFINITION-ERROR : Error while trying to load definition for system hu.dwim.web-server.documentation from pathname /home/testgrid/cl-test-grid/work-dir/agent/quicklisp/dists/quicklisp/software/hu.dwim.web-server-20150709-darcs/hu.dwim.web-server.documentation.asd: Cannot find symbol "NON-PROPAGATING-OPERATION" in package #<"ASDF/INTERFACE" package>
(LOAD hu.dwim.web-server.application.test FAIL) needs newer ASDF, ASDF/FIND-SYSTEM:LOAD-SYSTEM-DEFINITION-ERROR : Error while trying to load definition for system hu.dwim.web-server.application.test from pathname /home/testgrid/cl-test-grid/work-dir/agent/quicklisp/dists/quicklisp/software/hu.dwim.web-server-20150709-darcs/hu.dwim.web-server.application.test.asd: Cannot find symbol "NON-PROPAGATING-OPERATION" in package #<"ASDF/INTERFACE" package>
(LOAD hu.dwim.web-server.application+hu.dwim.perec FAIL) needs newer ASDF, ASDF/FIND-SYSTEM:LOAD-SYSTEM-DEFINITION-ERROR : Error while trying to load definition for system hu.dwim.web-server.application+hu.dwim.perec from pathname /home/testgrid/cl-test-grid/work-dir/agent/quicklisp/dists/quicklisp/software/hu.dwim.web-server-20150709-darcs/hu.dwim.web-server.application+hu.dwim.perec.asd: Cannot find symbol "NON-PROPAGATING-OPERATION" in package #<"ASDF/INTERFACE" package>
(LOAD hu.dwim.web-server.application FAIL) needs newer ASDF, ASDF/FIND-SYSTEM:LOAD-SYSTEM-DEFINITION-ERROR : Error while trying to load definition for system hu.dwim.web-server.application from pathname /home/testgrid/cl-test-grid/work-dir/agent/quicklisp/dists/quicklisp/software/hu.dwim.web-server-20150709-darcs/hu.dwim.web-server.application.asd: Cannot find symbol "NON-PROPAGATING-OPERATION" in package #<"ASDF/INTERFACE" package>
(LOAD hu.dwim.web-server+swank FAIL) needs newer ASDF, ASDF/FIND-SYSTEM:LOAD-SYSTEM-DEFINITION-ERROR : Error while trying to load definition for system hu.dwim.web-server+swank from pathname /home/testgrid/cl-test-grid/work-dir/agent/quicklisp/dists/quicklisp/software/hu.dwim.web-server-20150709-darcs/hu.dwim.web-server+swank.asd: Cannot find symbol "NON-PROPAGATING-OPERATION" in package #<"ASDF/INTERFACE" package>
(LOAD hu.dwim.web-server FAIL) needs newer ASDF, ASDF/FIND-SYSTEM:LOAD-SYSTEM-DEFINITION-ERROR : Error while trying to load definition for system hu.dwim.web-server from pathname /home/testgrid/cl-test-grid/work-dir/agent/quicklisp/dists/quicklisp/software/hu.dwim.web-server-20150709-darcs/hu.dwim.web-server.asd: Cannot find symbol "NON-PROPAGATING-OPERATION" in package #<"ASDF/INTERFACE" package>
(LOAD hu.dwim.web-server.test FAIL) needs newer ASDF, ASDF/FIND-SYSTEM:LOAD-SYSTEM-DEFINITION-ERROR : Error while trying to load definition for system hu.dwim.web-server.test from pathname /home/testgrid/cl-test-grid/work-dir/agent/quicklisp/dists/quicklisp/software/hu.dwim.web-server-20150608-darcs/hu.dwim.web-server.test.asd: Cannot find symbol "NON-PROPAGATING-OPERATION" in package #<"ASDF/INTERFACE" package>
(LOAD hu.dwim.web-server.application.test FAIL) needs newer ASDF, ASDF/FIND-SYSTEM:LOAD-SYSTEM-DEFINITION-ERROR : Error while trying to load definition for system hu.dwim.web-server.application.test from pathname /home/testgrid/cl-test-grid/work-dir/agent/quicklisp/dists/quicklisp/software/hu.dwim.web-server-20150608-darcs/hu.dwim.web-server.application.test.asd: Cannot find symbol "NON-PROPAGATING-OPERATION" in package #<"ASDF/INTERFACE" package>
(LOAD hu.dwim.web-server.application+hu.dwim.perec FAIL) needs newer ASDF, ASDF/FIND-SYSTEM:LOAD-SYSTEM-DEFINITION-ERROR : Error while trying to load definition for system hu.dwim.web-server.application+hu.dwim.perec from pathname /home/testgrid/cl-test-grid/work-dir/agent/quicklisp/dists/quicklisp/software/hu.dwim.web-server-20150608-darcs/hu.dwim.web-server.application+hu.dwim.perec.asd: Cannot find symbol "NON-PROPAGATING-OPERATION" in package #<"ASDF/INTERFACE" package>
(LOAD hu.dwim.web-server.application FAIL) needs newer ASDF, ASDF/FIND-SYSTEM:LOAD-SYSTEM-DEFINITION-ERROR : Error while trying to load definition for system hu.dwim.web-server.application from pathname /home/testgrid/cl-test-grid/work-dir/agent/quicklisp/dists/quicklisp/software/hu.dwim.web-server-20150608-darcs/hu.dwim.web-server.application.asd: Cannot find symbol "NON-PROPAGATING-OPERATION" in package #<"ASDF/INTERFACE" package>
(LOAD hu.dwim.web-server+swank FAIL) needs newer ASDF, ASDF/FIND-SYSTEM:LOAD-SYSTEM-DEFINITION-ERROR : Error while trying to load definition for system hu.dwim.web-server+swank from pathname /home/testgrid/cl-test-grid/work-dir/agent/quicklisp/dists/quicklisp/software/hu.dwim.web-server-20150608-darcs/hu.dwim.web-server+swank.asd: Cannot find symbol "NON-PROPAGATING-OPERATION" in package #<"ASDF/INTERFACE" package>
(LOAD hu.dwim.web-server FAIL) needs newer ASDF, ASDF/FIND-SYSTEM:LOAD-SYSTEM-DEFINITION-ERROR : Error while trying to load definition for system hu.dwim.web-server from pathname /home/testgrid/cl-test-grid/work-dir/agent/quicklisp/dists/quicklisp/software/hu.dwim.web-server-20150608-darcs/hu.dwim.web-server.asd: Cannot find symbol "NON-PROPAGATING-OPERATION" in package #<"ASDF/INTERFACE" package>
ecl-13.5.1-unknown-linux-i686-lisp-to-c
(LOAD hu.dwim.web-server.websocket FAIL) ASDF/FIND-SYSTEM:LOAD-SYSTEM-DEFINITION-ERROR : Error while trying to load definition for system hu.dwim.web-server.websocket from pathname /home/testgrid/cl-test-grid/work-dir/agent/quicklisp/dists/quicklisp/software/hu.dwim.web-server-20150709-darcs/hu.dwim.web-server.websocket.asd: COMPILE-FILE-ERROR while compiling #<cl-source-file "hu.dwim.asdf" "source" "package">
(LOAD hu.dwim.web-server.test FAIL) ASDF/FIND-SYSTEM:LOAD-SYSTEM-DEFINITION-ERROR : Error while trying to load definition for system hu.dwim.web-server.test from pathname /home/testgrid/cl-test-grid/work-dir/agent/quicklisp/dists/quicklisp/software/hu.dwim.web-server-20150709-darcs/hu.dwim.web-server.test.asd: COMPILE-FILE-ERROR while compiling #<cl-source-file "hu.dwim.asdf" "source" "package">
(LOAD hu.dwim.web-server.documentation FAIL) ASDF/FIND-SYSTEM:LOAD-SYSTEM-DEFINITION-ERROR : Error while trying to load definition for system hu.dwim.web-server.documentation from pathname /home/testgrid/cl-test-grid/work-dir/agent/quicklisp/dists/quicklisp/software/hu.dwim.web-server-20150709-darcs/hu.dwim.web-server.documentation.asd: COMPILE-FILE-ERROR while compiling #<cl-source-file "hu.dwim.asdf" "source" "package">
(LOAD hu.dwim.web-server.application.test FAIL) ASDF/FIND-SYSTEM:LOAD-SYSTEM-DEFINITION-ERROR : Error while trying to load definition for system hu.dwim.web-server.application.test from pathname /home/testgrid/cl-test-grid/work-dir/agent/quicklisp/dists/quicklisp/software/hu.dwim.web-server-20150709-darcs/hu.dwim.web-server.application.test.asd: COMPILE-FILE-ERROR while compiling #<cl-source-file "hu.dwim.asdf" "source" "package">
(LOAD hu.dwim.web-server.application+hu.dwim.perec FAIL) ASDF/FIND-SYSTEM:LOAD-SYSTEM-DEFINITION-ERROR : Error while trying to load definition for system hu.dwim.web-server.application+hu.dwim.perec from pathname /home/testgrid/cl-test-grid/work-dir/agent/quicklisp/dists/quicklisp/software/hu.dwim.web-server-20150709-darcs/hu.dwim.web-server.application+hu.dwim.perec.asd: COMPILE-FILE-ERROR while compiling #<cl-source-file "hu.dwim.asdf" "source" "package">
(LOAD hu.dwim.web-server.application FAIL) ASDF/FIND-SYSTEM:LOAD-SYSTEM-DEFINITION-ERROR : Error while trying to load definition for system hu.dwim.web-server.application from pathname /home/testgrid/cl-test-grid/work-dir/agent/quicklisp/dists/quicklisp/software/hu.dwim.web-server-20150709-darcs/hu.dwim.web-server.application.asd: COMPILE-FILE-ERROR while compiling #<cl-source-file "hu.dwim.asdf" "source" "package">
(LOAD hu.dwim.web-server+swank FAIL) ASDF/FIND-SYSTEM:LOAD-SYSTEM-DEFINITION-ERROR : Error while trying to load definition for system hu.dwim.web-server+swank from pathname /home/testgrid/cl-test-grid/work-dir/agent/quicklisp/dists/quicklisp/software/hu.dwim.web-server-20150709-darcs/hu.dwim.web-server+swank.asd: COMPILE-FILE-ERROR while compiling #<cl-source-file "hu.dwim.asdf" "source" "package">
(LOAD hu.dwim.web-server FAIL) ASDF/FIND-SYSTEM:LOAD-SYSTEM-DEFINITION-ERROR : Error while trying to load definition for system hu.dwim.web-server from pathname /home/testgrid/cl-test-grid/work-dir/agent/quicklisp/dists/quicklisp/software/hu.dwim.web-server-20150709-darcs/hu.dwim.web-server.asd: COMPILE-FILE-ERROR while compiling #<cl-source-file "hu.dwim.asdf" "source" "package">
(LOAD hu.dwim.web-server.test FAIL) ASDF/FIND-SYSTEM:LOAD-SYSTEM-DEFINITION-ERROR : Error while trying to load definition for system hu.dwim.web-server.test from pathname /home/testgrid/cl-test-grid/work-dir/agent/quicklisp/dists/quicklisp/software/hu.dwim.web-server-20150608-darcs/hu.dwim.web-server.test.asd: COMPILE-FILE-ERROR while compiling #<cl-source-file "hu.dwim.asdf" "source" "package">
(LOAD hu.dwim.web-server.application.test FAIL) ASDF/FIND-SYSTEM:LOAD-SYSTEM-DEFINITION-ERROR : Error while trying to load definition for system hu.dwim.web-server.application.test from pathname /home/testgrid/cl-test-grid/work-dir/agent/quicklisp/dists/quicklisp/software/hu.dwim.web-server-20150608-darcs/hu.dwim.web-server.application.test.asd: COMPILE-FILE-ERROR while compiling #<cl-source-file "hu.dwim.asdf" "source" "package">
(LOAD hu.dwim.web-server.application+hu.dwim.perec FAIL) ASDF/FIND-SYSTEM:LOAD-SYSTEM-DEFINITION-ERROR : Error while trying to load definition for system hu.dwim.web-server.application+hu.dwim.perec from pathname /home/testgrid/cl-test-grid/work-dir/agent/quicklisp/dists/quicklisp/software/hu.dwim.web-server-20150608-darcs/hu.dwim.web-server.application+hu.dwim.perec.asd: COMPILE-FILE-ERROR while compiling #<cl-source-file "hu.dwim.asdf" "source" "package">
(LOAD hu.dwim.web-server.application FAIL) ASDF/FIND-SYSTEM:LOAD-SYSTEM-DEFINITION-ERROR : Error while trying to load definition for system hu.dwim.web-server.application from pathname /home/testgrid/cl-test-grid/work-dir/agent/quicklisp/dists/quicklisp/software/hu.dwim.web-server-20150608-darcs/hu.dwim.web-server.application.asd: COMPILE-FILE-ERROR while compiling #<cl-source-file "hu.dwim.asdf" "source" "package">
(LOAD hu.dwim.web-server+swank FAIL) ASDF/FIND-SYSTEM:LOAD-SYSTEM-DEFINITION-ERROR : Error while trying to load definition for system hu.dwim.web-server+swank from pathname /home/testgrid/cl-test-grid/work-dir/agent/quicklisp/dists/quicklisp/software/hu.dwim.web-server-20150608-darcs/hu.dwim.web-server+swank.asd: COMPILE-FILE-ERROR while compiling #<cl-source-file "hu.dwim.asdf" "source" "package">
(LOAD hu.dwim.web-server FAIL) ASDF/FIND-SYSTEM:LOAD-SYSTEM-DEFINITION-ERROR : Error while trying to load definition for system hu.dwim.web-server from pathname /home/testgrid/cl-test-grid/work-dir/agent/quicklisp/dists/quicklisp/software/hu.dwim.web-server-20150608-darcs/hu.dwim.web-server.asd: COMPILE-FILE-ERROR while compiling #<cl-source-file "hu.dwim.asdf" "source" "package">
ecl-15.2.21-ee989b97-linux-i686-bytecode
(LOAD hu.dwim.web-server.websocket FAIL) ASDF/FIND-SYSTEM:LOAD-SYSTEM-DEFINITION-ERROR : Error while trying to load definition for system iolib from pathname /home/testgrid/cl-test-grid/work-dir/agent/quicklisp/dists/quicklisp/software/iolib-20150709-git/iolib.asd: The variable C::*CC-FLAGS* is unbound.
(LOAD hu.dwim.web-server.test FAIL) ASDF/FIND-SYSTEM:LOAD-SYSTEM-DEFINITION-ERROR : Error while trying to load definition for system iolib from pathname /home/testgrid/cl-test-grid/work-dir/agent/quicklisp/dists/quicklisp/software/iolib-20150709-git/iolib.asd: The variable C::*CC-FLAGS* is unbound.
(LOAD hu.dwim.web-server.documentation FAIL) ASDF/FIND-SYSTEM:LOAD-SYSTEM-DEFINITION-ERROR : Error while trying to load definition for system iolib from pathname /home/testgrid/cl-test-grid/work-dir/agent/quicklisp/dists/quicklisp/software/iolib-20150709-git/iolib.asd: The variable C::*CC-FLAGS* is unbound.
(LOAD hu.dwim.web-server.application.test FAIL) ASDF/FIND-SYSTEM:LOAD-SYSTEM-DEFINITION-ERROR : Error while trying to load definition for system iolib from pathname /home/testgrid/cl-test-grid/work-dir/agent/quicklisp/dists/quicklisp/software/iolib-20150709-git/iolib.asd: The variable C::*CC-FLAGS* is unbound.
(LOAD hu.dwim.web-server.application+hu.dwim.perec FAIL) ASDF/FIND-SYSTEM:LOAD-SYSTEM-DEFINITION-ERROR : Error while trying to load definition for system iolib from pathname /home/testgrid/cl-test-grid/work-dir/agent/quicklisp/dists/quicklisp/software/iolib-20150709-git/iolib.asd: The variable C::*CC-FLAGS* is unbound.
(LOAD hu.dwim.web-server.application FAIL) ASDF/FIND-SYSTEM:LOAD-SYSTEM-DEFINITION-ERROR : Error while trying to load definition for system iolib from pathname /home/testgrid/cl-test-grid/work-dir/agent/quicklisp/dists/quicklisp/software/iolib-20150709-git/iolib.asd: The variable C::*CC-FLAGS* is unbound.
(LOAD hu.dwim.web-server+swank FAIL) ASDF/FIND-SYSTEM:LOAD-SYSTEM-DEFINITION-ERROR : Error while trying to load definition for system iolib from pathname /home/testgrid/cl-test-grid/work-dir/agent/quicklisp/dists/quicklisp/software/iolib-20150709-git/iolib.asd: The variable C::*CC-FLAGS* is unbound.
(LOAD hu.dwim.web-server FAIL) ASDF/FIND-SYSTEM:LOAD-SYSTEM-DEFINITION-ERROR : Error while trying to load definition for system iolib from pathname /home/testgrid/cl-test-grid/work-dir/agent/quicklisp/dists/quicklisp/software/iolib-20150709-git/iolib.asd: The variable C::*CC-FLAGS* is unbound.
(LOAD hu.dwim.web-server.test FAIL) ASDF/FIND-SYSTEM:LOAD-SYSTEM-DEFINITION-ERROR : Error while trying to load definition for system iolib from pathname /home/testgrid/cl-test-grid/work-dir/agent/quicklisp/dists/quicklisp/software/iolib-20150302-git/iolib.asd: The variable C::*CC-FLAGS* is unbound.
(LOAD hu.dwim.web-server.application.test FAIL) ASDF/FIND-SYSTEM:LOAD-SYSTEM-DEFINITION-ERROR : Error while trying to load definition for system iolib from pathname /home/testgrid/cl-test-grid/work-dir/agent/quicklisp/dists/quicklisp/software/iolib-20150302-git/iolib.asd: The variable C::*CC-FLAGS* is unbound.
(LOAD hu.dwim.web-server.application+hu.dwim.perec FAIL) ASDF/FIND-SYSTEM:LOAD-SYSTEM-DEFINITION-ERROR : Error while trying to load definition for system iolib from pathname /home/testgrid/cl-test-grid/work-dir/agent/quicklisp/dists/quicklisp/software/iolib-20150302-git/iolib.asd: The variable C::*CC-FLAGS* is unbound.
(LOAD hu.dwim.web-server.application FAIL) ASDF/FIND-SYSTEM:LOAD-SYSTEM-DEFINITION-ERROR : Error while trying to load definition for system iolib from pathname /home/testgrid/cl-test-grid/work-dir/agent/quicklisp/dists/quicklisp/software/iolib-20150302-git/iolib.asd: The variable C::*CC-FLAGS* is unbound.
(LOAD hu.dwim.web-server+swank FAIL) ASDF/FIND-SYSTEM:LOAD-SYSTEM-DEFINITION-ERROR : Error while trying to load definition for system iolib from pathname /home/testgrid/cl-test-grid/work-dir/agent/quicklisp/dists/quicklisp/software/iolib-20150302-git/iolib.asd: The variable C::*CC-FLAGS* is unbound.
(LOAD hu.dwim.web-server FAIL) ASDF/FIND-SYSTEM:LOAD-SYSTEM-DEFINITION-ERROR : Error while trying to load definition for system iolib from pathname /home/testgrid/cl-test-grid/work-dir/agent/quicklisp/dists/quicklisp/software/iolib-20150302-git/iolib.asd: The variable C::*CC-FLAGS* is unbound.
ecl-15.2.21-ee989b97-linux-i686-lisp-to-c
(LOAD hu.dwim.web-server.websocket FAIL) ASDF/FIND-SYSTEM:LOAD-SYSTEM-DEFINITION-ERROR : Error while trying to load definition for system iolib from pathname /home/testgrid/cl-test-grid/work-dir/agent/quicklisp/dists/quicklisp/software/iolib-20150709-git/iolib.asd: COMPILE-FILE-ERROR while compiling #<cl-source-file "alexandria" "macros">
(LOAD hu.dwim.web-server.test FAIL) ASDF/FIND-SYSTEM:LOAD-SYSTEM-DEFINITION-ERROR : Error while trying to load definition for system hu.dwim.computed-class+hu.dwim.logger from pathname /home/testgrid/cl-test-grid/work-dir/agent/quicklisp/dists/quicklisp/software/hu.dwim.computed-class-20150709-darcs/hu.dwim.computed-class+hu.dwim.logger.asd: COMPILE-FILE-ERROR while compiling #<cl-source-file "alexandria" "macros">
(LOAD hu.dwim.web-server.documentation FAIL) ASDF/FIND-SYSTEM:LOAD-SYSTEM-DEFINITION-ERROR : Error while trying to load definition for system iolib from pathname /home/testgrid/cl-test-grid/work-dir/agent/quicklisp/dists/quicklisp/software/iolib-20150709-git/iolib.asd: COMPILE-FILE-ERROR while compiling #<cl-source-file "alexandria" "macros">
(LOAD hu.dwim.web-server.application.test FAIL) ASDF/FIND-SYSTEM:LOAD-SYSTEM-DEFINITION-ERROR : Error while trying to load definition for system iolib from pathname /home/testgrid/cl-test-grid/work-dir/agent/quicklisp/dists/quicklisp/software/iolib-20150709-git/iolib.asd: COMPILE-FILE-ERROR while compiling #<cl-source-file "alexandria" "macros">
(LOAD hu.dwim.web-server.application+hu.dwim.perec FAIL) ASDF/FIND-SYSTEM:LOAD-SYSTEM-DEFINITION-ERROR : Error while trying to load definition for system iolib from pathname /home/testgrid/cl-test-grid/work-dir/agent/quicklisp/dists/quicklisp/software/iolib-20150709-git/iolib.asd: COMPILE-FILE-ERROR while compiling #<cl-source-file "alexandria" "macros">
(LOAD hu.dwim.web-server.application FAIL) ASDF/FIND-SYSTEM:LOAD-SYSTEM-DEFINITION-ERROR : Error while trying to load definition for system iolib from pathname /home/testgrid/cl-test-grid/work-dir/agent/quicklisp/dists/quicklisp/software/iolib-20150709-git/iolib.asd: COMPILE-FILE-ERROR while compiling #<cl-source-file "alexandria" "macros">
(LOAD hu.dwim.web-server+swank FAIL) ASDF/FIND-SYSTEM:LOAD-SYSTEM-DEFINITION-ERROR : Error while trying to load definition for system iolib from pathname /home/testgrid/cl-test-grid/work-dir/agent/quicklisp/dists/quicklisp/software/iolib-20150709-git/iolib.asd: COMPILE-FILE-ERROR while compiling #<cl-source-file "alexandria" "macros">
(LOAD hu.dwim.web-server FAIL) ASDF/FIND-SYSTEM:LOAD-SYSTEM-DEFINITION-ERROR : Error while trying to load definition for system iolib from pathname /home/testgrid/cl-test-grid/work-dir/agent/quicklisp/dists/quicklisp/software/iolib-20150709-git/iolib.asd: COMPILE-FILE-ERROR while compiling #<cl-source-file "alexandria" "macros">
(LOAD hu.dwim.web-server.test FAIL) ASDF/FIND-SYSTEM:LOAD-SYSTEM-DEFINITION-ERROR : Error while trying to load definition for system hu.dwim.computed-class+hu.dwim.logger from pathname /home/testgrid/cl-test-grid/work-dir/agent/quicklisp/dists/quicklisp/software/hu.dwim.computed-class-20150608-darcs/hu.dwim.computed-class+hu.dwim.logger.asd: COMPILE-FILE-ERROR while compiling #<cl-source-file "alexandria" "macros">
(LOAD hu.dwim.web-server.application.test FAIL) ASDF/FIND-SYSTEM:LOAD-SYSTEM-DEFINITION-ERROR : Error while trying to load definition for system iolib from pathname /home/testgrid/cl-test-grid/work-dir/agent/quicklisp/dists/quicklisp/software/iolib-20150302-git/iolib.asd: COMPILE-FILE-ERROR while compiling #<cl-source-file "alexandria" "macros">
(LOAD hu.dwim.web-server.application+hu.dwim.perec FAIL) ASDF/FIND-SYSTEM:LOAD-SYSTEM-DEFINITION-ERROR : Error while trying to load definition for system iolib from pathname /home/testgrid/cl-test-grid/work-dir/agent/quicklisp/dists/quicklisp/software/iolib-20150302-git/iolib.asd: COMPILE-FILE-ERROR while compiling #<cl-source-file "alexandria" "macros">
(LOAD hu.dwim.web-server.application FAIL) ASDF/FIND-SYSTEM:LOAD-SYSTEM-DEFINITION-ERROR : Error while trying to load definition for system iolib from pathname /home/testgrid/cl-test-grid/work-dir/agent/quicklisp/dists/quicklisp/software/iolib-20150302-git/iolib.asd: COMPILE-FILE-ERROR while compiling #<cl-source-file "alexandria" "macros">
(LOAD hu.dwim.web-server+swank FAIL) ASDF/FIND-SYSTEM:LOAD-SYSTEM-DEFINITION-ERROR : Error while trying to load definition for system iolib from pathname /home/testgrid/cl-test-grid/work-dir/agent/quicklisp/dists/quicklisp/software/iolib-20150302-git/iolib.asd: COMPILE-FILE-ERROR while compiling #<cl-source-file "alexandria" "macros">
(LOAD hu.dwim.web-server FAIL) ASDF/FIND-SYSTEM:LOAD-SYSTEM-DEFINITION-ERROR : Error while trying to load definition for system iolib from pathname /home/testgrid/cl-test-grid/work-dir/agent/quicklisp/dists/quicklisp/software/iolib-20150302-git/iolib.asd: COMPILE-FILE-ERROR while compiling #<cl-source-file "alexandria" "macros">
ecl-15.2.21-ee989b97-linux-x64-bytecode
(LOAD hu.dwim.web-server.test FAIL) ASDF/FIND-SYSTEM:LOAD-SYSTEM-DEFINITION-ERROR : Error while trying to load definition for system iolib from pathname /home/hijarian/systems/cl-test-grid/work-dir/agent/quicklisp/dists/quicklisp/software/iolib-20150302-git/iolib.asd: The variable C::*CC-FLAGS* is unbound.
(LOAD hu.dwim.web-server.application.test FAIL) ASDF/FIND-SYSTEM:LOAD-SYSTEM-DEFINITION-ERROR : Error while trying to load definition for system iolib from pathname /home/hijarian/systems/cl-test-grid/work-dir/agent/quicklisp/dists/quicklisp/software/iolib-20150302-git/iolib.asd: The variable C::*CC-FLAGS* is unbound.
(LOAD hu.dwim.web-server.application+hu.dwim.perec FAIL) ASDF/FIND-SYSTEM:LOAD-SYSTEM-DEFINITION-ERROR : Error while trying to load definition for system iolib from pathname /home/hijarian/systems/cl-test-grid/work-dir/agent/quicklisp/dists/quicklisp/software/iolib-20150302-git/iolib.asd: The variable C::*CC-FLAGS* is unbound.
(LOAD hu.dwim.web-server.application FAIL) ASDF/FIND-SYSTEM:LOAD-SYSTEM-DEFINITION-ERROR : Error while trying to load definition for system iolib from pathname /home/hijarian/systems/cl-test-grid/work-dir/agent/quicklisp/dists/quicklisp/software/iolib-20150302-git/iolib.asd: The variable C::*CC-FLAGS* is unbound.
(LOAD hu.dwim.web-server+swank FAIL) ASDF/FIND-SYSTEM:LOAD-SYSTEM-DEFINITION-ERROR : Error while trying to load definition for system iolib from pathname /home/hijarian/systems/cl-test-grid/work-dir/agent/quicklisp/dists/quicklisp/software/iolib-20150302-git/iolib.asd: The variable C::*CC-FLAGS* is unbound.
(LOAD hu.dwim.web-server FAIL) ASDF/FIND-SYSTEM:LOAD-SYSTEM-DEFINITION-ERROR : Error while trying to load definition for system iolib from pathname /home/hijarian/systems/cl-test-grid/work-dir/agent/quicklisp/dists/quicklisp/software/iolib-20150302-git/iolib.asd: The variable C::*CC-FLAGS* is unbound.
ecl-15.2.21-ee989b97-linux-x64-lisp-to-c
(LOAD hu.dwim.web-server.test FAIL) ASDF/FIND-SYSTEM:LOAD-SYSTEM-DEFINITION-ERROR : Error while trying to load definition for system hu.dwim.computed-class+hu.dwim.logger from pathname /home/hijarian/systems/cl-test-grid/work-dir/agent/quicklisp/dists/quicklisp/software/hu.dwim.computed-class-20150608-darcs/hu.dwim.computed-class+hu.dwim.logger.asd: COMPILE-FILE-ERROR while compiling #<cl-source-file "alexandria" "macros">
(LOAD hu.dwim.web-server.application.test FAIL) ASDF/FIND-SYSTEM:LOAD-SYSTEM-DEFINITION-ERROR : Error while trying to load definition for system iolib from pathname /home/hijarian/systems/cl-test-grid/work-dir/agent/quicklisp/dists/quicklisp/software/iolib-20150302-git/iolib.asd: COMPILE-FILE-ERROR while compiling #<cl-source-file "alexandria" "macros">
(LOAD hu.dwim.web-server.application+hu.dwim.perec FAIL) ASDF/FIND-SYSTEM:LOAD-SYSTEM-DEFINITION-ERROR : Error while trying to load definition for system iolib from pathname /home/hijarian/systems/cl-test-grid/work-dir/agent/quicklisp/dists/quicklisp/software/iolib-20150302-git/iolib.asd: COMPILE-FILE-ERROR while compiling #<cl-source-file "alexandria" "macros">
(LOAD hu.dwim.web-server.application FAIL) ASDF/FIND-SYSTEM:LOAD-SYSTEM-DEFINITION-ERROR : Error while trying to load definition for system iolib from pathname /home/hijarian/systems/cl-test-grid/work-dir/agent/quicklisp/dists/quicklisp/software/iolib-20150302-git/iolib.asd: COMPILE-FILE-ERROR while compiling #<cl-source-file "alexandria" "macros">
(LOAD hu.dwim.web-server+swank FAIL) ASDF/FIND-SYSTEM:LOAD-SYSTEM-DEFINITION-ERROR : Error while trying to load definition for system iolib from pathname /home/hijarian/systems/cl-test-grid/work-dir/agent/quicklisp/dists/quicklisp/software/iolib-20150302-git/iolib.asd: COMPILE-FILE-ERROR while compiling #<cl-source-file "alexandria" "macros">
(LOAD hu.dwim.web-server FAIL) ASDF/FIND-SYSTEM:LOAD-SYSTEM-DEFINITION-ERROR : Error while trying to load definition for system iolib from pathname /home/hijarian/systems/cl-test-grid/work-dir/agent/quicklisp/dists/quicklisp/software/iolib-20150302-git/iolib.asd: COMPILE-FILE-ERROR while compiling #<cl-source-file "alexandria" "macros">
sbcl-1.0.58-linux-x86
(LOAD hu.dwim.web-server.websocket FAIL) ASDF:LOAD-SYSTEM-DEFINITION-ERROR : Error while trying to load definition for system hu.dwim.web-server.websocket from pathname /home/testgrid/cl-test-grid/work-dir/agent/quicklisp/dists/quicklisp/software/hu.dwim.web-server-20150709-darcs/hu.dwim.web-server.websocket.asd: Error while trying to load definition for system hu.dwim.asdf from pathname /home/testgrid/cl-test-grid/work-dir/agent/quicklisp/dists/quicklisp/software/hu.dwim.asdf-20150709-darcs/hu.dwim.asdf.asd: READ error during COMPILE-FILE: :ASCII stream decoding error on #<SB-SYS:FD-STREAM for "file /home/testgrid/cl-test-grid/work-dir/agent/quicklisp/dists/quicklisp/software/hu.dwim.asdf-20150709-darcs/hu.dwim.asdf.asd" {B0B7A21}>: the octet sequence #(195) cannot be decoded. (in form starting at line: 1, column: 0, file-position: 0)
(LOAD hu.dwim.web-server.test FAIL) ASDF:LOAD-SYSTEM-DEFINITION-ERROR : Error while trying to load definition for system hu.dwim.web-server.test from pathname /home/testgrid/cl-test-grid/work-dir/agent/quicklisp/dists/quicklisp/software/hu.dwim.web-server-20150709-darcs/hu.dwim.web-server.test.asd: Error while trying to load definition for system hu.dwim.asdf from pathname /home/testgrid/cl-test-grid/work-dir/agent/quicklisp/dists/quicklisp/software/hu.dwim.asdf-20150709-darcs/hu.dwim.asdf.asd: READ error during COMPILE-FILE: :ASCII stream decoding error on #<SB-SYS:FD-STREAM for "file /home/testgrid/cl-test-grid/work-dir/agent/quicklisp/dists/quicklisp/software/hu.dwim.asdf-20150709-darcs/hu.dwim.asdf.asd" {B0B7A21}>: the octet sequence #(195) cannot be decoded. (in form starting at line: 1, column: 0, file-position: 0)
(LOAD hu.dwim.web-server.documentation FAIL) ASDF:LOAD-SYSTEM-DEFINITION-ERROR : Error while trying to load definition for system hu.dwim.web-server.documentation from pathname /home/testgrid/cl-test-grid/work-dir/agent/quicklisp/dists/quicklisp/software/hu.dwim.web-server-20150709-darcs/hu.dwim.web-server.documentation.asd: Error while trying to load definition for system hu.dwim.asdf from pathname /home/testgrid/cl-test-grid/work-dir/agent/quicklisp/dists/quicklisp/software/hu.dwim.asdf-20150709-darcs/hu.dwim.asdf.asd: READ error during COMPILE-FILE: :ASCII stream decoding error on #<SB-SYS:FD-STREAM for "file /home/testgrid/cl-test-grid/work-dir/agent/quicklisp/dists/quicklisp/software/hu.dwim.asdf-20150709-darcs/hu.dwim.asdf.asd" {B0B9A21}>: the octet sequence #(195) cannot be decoded. (in form starting at line: 1, column: 0, file-position: 0)
(LOAD hu.dwim.web-server.application.test FAIL) ASDF:LOAD-SYSTEM-DEFINITION-ERROR : Error while trying to load definition for system hu.dwim.web-server.application.test from pathname /home/testgrid/cl-test-grid/work-dir/agent/quicklisp/dists/quicklisp/software/hu.dwim.web-server-20150709-darcs/hu.dwim.web-server.application.test.asd: Error while trying to load definition for system hu.dwim.asdf from pathname /home/testgrid/cl-test-grid/work-dir/agent/quicklisp/dists/quicklisp/software/hu.dwim.asdf-20150709-darcs/hu.dwim.asdf.asd: READ error during COMPILE-FILE: :ASCII stream decoding error on #<SB-SYS:FD-STREAM for "file /home/testgrid/cl-test-grid/work-dir/agent/quicklisp/dists/quicklisp/software/hu.dwim.asdf-20150709-darcs/hu.dwim.asdf.asd" {B0BCA21}>: the octet sequence #(195) cannot be decoded. (in form starting at line: 1, column: 0, file-position: 0)
(LOAD hu.dwim.web-server.application+hu.dwim.perec FAIL) ASDF:LOAD-SYSTEM-DEFINITION-ERROR : Error while trying to load definition for system hu.dwim.web-server.application+hu.dwim.perec from pathname /home/testgrid/cl-test-grid/work-dir/agent/quicklisp/dists/quicklisp/software/hu.dwim.web-server-20150709-darcs/hu.dwim.web-server.application+hu.dwim.perec.asd: Error while trying to load definition for system hu.dwim.asdf from pathname /home/testgrid/cl-test-grid/work-dir/agent/quicklisp/dists/quicklisp/software/hu.dwim.asdf-20150709-darcs/hu.dwim.asdf.asd: READ error during COMPILE-FILE: :ASCII stream decoding error on #<SB-SYS:FD-STREAM for "file /home/testgrid/cl-test-grid/work-dir/agent/quicklisp/dists/quicklisp/software/hu.dwim.asdf-20150709-darcs/hu.dwim.asdf.asd" {B0BBA21}>: the octet sequence #(195) cannot be decoded. (in form starting at line: 1, column: 0, file-position: 0)
(LOAD hu.dwim.web-server.application FAIL) ASDF:LOAD-SYSTEM-DEFINITION-ERROR : Error while trying to load definition for system hu.dwim.web-server.application from pathname /home/testgrid/cl-test-grid/work-dir/agent/quicklisp/dists/quicklisp/software/hu.dwim.web-server-20150709-darcs/hu.dwim.web-server.application.asd: Error while trying to load definition for system hu.dwim.asdf from pathname /home/testgrid/cl-test-grid/work-dir/agent/quicklisp/dists/quicklisp/software/hu.dwim.asdf-20150709-darcs/hu.dwim.asdf.asd: READ error during COMPILE-FILE: :ASCII stream decoding error on #<SB-SYS:FD-STREAM for "file /home/testgrid/cl-test-grid/work-dir/agent/quicklisp/dists/quicklisp/software/hu.dwim.asdf-20150709-darcs/hu.dwim.asdf.asd" {B0BBA21}>: the octet sequence #(195) cannot be decoded. (in form starting at line: 1, column: 0, file-position: 0)
(LOAD hu.dwim.web-server+swank FAIL) ASDF:LOAD-SYSTEM-DEFINITION-ERROR : Error while trying to load definition for system hu.dwim.web-server+swank from pathname /home/testgrid/cl-test-grid/work-dir/agent/quicklisp/dists/quicklisp/software/hu.dwim.web-server-20150709-darcs/hu.dwim.web-server+swank.asd: Error while trying to load definition for system hu.dwim.asdf from pathname /home/testgrid/cl-test-grid/work-dir/agent/quicklisp/dists/quicklisp/software/hu.dwim.asdf-20150709-darcs/hu.dwim.asdf.asd: READ error during COMPILE-FILE: :ASCII stream decoding error on #<SB-SYS:FD-STREAM for "file /home/testgrid/cl-test-grid/work-dir/agent/quicklisp/dists/quicklisp/software/hu.dwim.asdf-20150709-darcs/hu.dwim.asdf.asd" {B0B6A21}>: the octet sequence #(195) cannot be decoded. (in form starting at line: 1, column: 0, file-position: 0)
(LOAD hu.dwim.web-server FAIL) ASDF:LOAD-SYSTEM-DEFINITION-ERROR : Error while trying to load definition for system hu.dwim.web-server from pathname /home/testgrid/cl-test-grid/work-dir/agent/quicklisp/dists/quicklisp/software/hu.dwim.web-server-20150709-darcs/hu.dwim.web-server.asd: Error while trying to load definition for system hu.dwim.asdf from pathname /home/testgrid/cl-test-grid/work-dir/agent/quicklisp/dists/quicklisp/software/hu.dwim.asdf-20150709-darcs/hu.dwim.asdf.asd: READ error during COMPILE-FILE: :ASCII stream decoding error on #<SB-SYS:FD-STREAM for "file /home/testgrid/cl-test-grid/work-dir/agent/quicklisp/dists/quicklisp/software/hu.dwim.asdf-20150709-darcs/hu.dwim.asdf.asd" {B0BDA21}>: the octet sequence #(195) cannot be decoded. (in form starting at line: 1, column: 0, file-position: 0)
(LOAD hu.dwim.web-server.test FAIL) ASDF:LOAD-SYSTEM-DEFINITION-ERROR : Error while trying to load definition for system hu.dwim.web-server.test from pathname /home/testgrid/cl-test-grid/work-dir/agent/quicklisp/dists/quicklisp/software/hu.dwim.web-server-20150608-darcs/hu.dwim.web-server.test.asd: Error while trying to load definition for system hu.dwim.asdf from pathname /home/testgrid/cl-test-grid/work-dir/agent/quicklisp/dists/quicklisp/software/hu.dwim.asdf-20150608-darcs/hu.dwim.asdf.asd: READ error during COMPILE-FILE: :ASCII stream decoding error on #<SB-SYS:FD-STREAM for "file /home/testgrid/cl-test-grid/work-dir/agent/quicklisp/dists/quicklisp/software/hu.dwim.asdf-20150608-darcs/hu.dwim.asdf.asd" {B0B6A21}>: the octet sequence #(195) cannot be decoded. (in form starting at line: 1, column: 0, file-position: 0)
(LOAD hu.dwim.web-server.application.test FAIL) ASDF:LOAD-SYSTEM-DEFINITION-ERROR : Error while trying to load definition for system hu.dwim.web-server.application.test from pathname /home/testgrid/cl-test-grid/work-dir/agent/quicklisp/dists/quicklisp/software/hu.dwim.web-server-20150608-darcs/hu.dwim.web-server.application.test.asd: Error while trying to load definition for system hu.dwim.asdf from pathname /home/testgrid/cl-test-grid/work-dir/agent/quicklisp/dists/quicklisp/software/hu.dwim.asdf-20150608-darcs/hu.dwim.asdf.asd: READ error during COMPILE-FILE: :ASCII stream decoding error on #<SB-SYS:FD-STREAM for "file /home/testgrid/cl-test-grid/work-dir/agent/quicklisp/dists/quicklisp/software/hu.dwim.asdf-20150608-darcs/hu.dwim.asdf.asd" {B0BBA21}>: the octet sequence #(195) cannot be decoded. (in form starting at line: 1, column: 0, file-position: 0)
(LOAD hu.dwim.web-server.application+hu.dwim.perec FAIL) ASDF:LOAD-SYSTEM-DEFINITION-ERROR : Error while trying to load definition for system hu.dwim.web-server.application+hu.dwim.perec from pathname /home/testgrid/cl-test-grid/work-dir/agent/quicklisp/dists/quicklisp/software/hu.dwim.web-server-20150608-darcs/hu.dwim.web-server.application+hu.dwim.perec.asd: Error while trying to load definition for system hu.dwim.asdf from pathname /home/testgrid/cl-test-grid/work-dir/agent/quicklisp/dists/quicklisp/software/hu.dwim.asdf-20150608-darcs/hu.dwim.asdf.asd: READ error during COMPILE-FILE: :ASCII stream decoding error on #<SB-SYS:FD-STREAM for "file /home/testgrid/cl-test-grid/work-dir/agent/quicklisp/dists/quicklisp/software/hu.dwim.asdf-20150608-darcs/hu.dwim.asdf.asd" {B0BAA21}>: the octet sequence #(195) cannot be decoded. (in form starting at line: 1, column: 0, file-position: 0)
(LOAD hu.dwim.web-server.application FAIL) ASDF:LOAD-SYSTEM-DEFINITION-ERROR : Error while trying to load definition for system hu.dwim.web-server.application from pathname /home/testgrid/cl-test-grid/work-dir/agent/quicklisp/dists/quicklisp/software/hu.dwim.web-server-20150608-darcs/hu.dwim.web-server.application.asd: Error while trying to load definition for system hu.dwim.asdf from pathname /home/testgrid/cl-test-grid/work-dir/agent/quicklisp/dists/quicklisp/software/hu.dwim.asdf-20150608-darcs/hu.dwim.asdf.asd: READ error during COMPILE-FILE: :ASCII stream decoding error on #<SB-SYS:FD-STREAM for "file /home/testgrid/cl-test-grid/work-dir/agent/quicklisp/dists/quicklisp/software/hu.dwim.asdf-20150608-darcs/hu.dwim.asdf.asd" {B0BAA21}>: the octet sequence #(195) cannot be decoded. (in form starting at line: 1, column: 0, file-position: 0)
(LOAD hu.dwim.web-server+swank FAIL) ASDF:LOAD-SYSTEM-DEFINITION-ERROR : Error while trying to load definition for system hu.dwim.web-server+swank from pathname /home/testgrid/cl-test-grid/work-dir/agent/quicklisp/dists/quicklisp/software/hu.dwim.web-server-20150608-darcs/hu.dwim.web-server+swank.asd: Error while trying to load definition for system hu.dwim.asdf from pathname /home/testgrid/cl-test-grid/work-dir/agent/quicklisp/dists/quicklisp/software/hu.dwim.asdf-20150608-darcs/hu.dwim.asdf.asd: READ error during COMPILE-FILE: :ASCII stream decoding error on #<SB-SYS:FD-STREAM for "file /home/testgrid/cl-test-grid/work-dir/agent/quicklisp/dists/quicklisp/software/hu.dwim.asdf-20150608-darcs/hu.dwim.asdf.asd" {B0B5A21}>: the octet sequence #(195) cannot be decoded. (in form starting at line: 1, column: 0, file-position: 0)
(LOAD hu.dwim.web-server FAIL) ASDF:LOAD-SYSTEM-DEFINITION-ERROR : Error while trying to load definition for system hu.dwim.web-server from pathname /home/testgrid/cl-test-grid/work-dir/agent/quicklisp/dists/quicklisp/software/hu.dwim.web-server-20150608-darcs/hu.dwim.web-server.asd: Error while trying to load definition for system hu.dwim.asdf from pathname /home/testgrid/cl-test-grid/work-dir/agent/quicklisp/dists/quicklisp/software/hu.dwim.asdf-20150608-darcs/hu.dwim.asdf.asd: READ error during COMPILE-FILE: :ASCII stream decoding error on #<SB-SYS:FD-STREAM for "file /home/testgrid/cl-test-grid/work-dir/agent/quicklisp/dists/quicklisp/software/hu.dwim.asdf-20150608-darcs/hu.dwim.asdf.asd" {B0BCA21}>: the octet sequence #(195) cannot be decoded. (in form starting at line: 1, column: 0, file-position: 0)
sbcl-1.1.11-linux-x86
(LOAD hu.dwim.web-server.websocket FAIL) needs newer ASDF, ASDF/FIND-SYSTEM:LOAD-SYSTEM-DEFINITION-ERROR : Error while trying to load definition for system hu.dwim.web-server.websocket from pathname /home/testgrid/cl-test-grid/work-dir/agent/quicklisp/dists/quicklisp/software/hu.dwim.web-server-20150709-darcs/hu.dwim.web-server.websocket.asd: no symbol named "NON-PROPAGATING-OPERATION" in "ASDF/INTERFACE"
(LOAD hu.dwim.web-server.test FAIL) needs newer ASDF, ASDF/FIND-SYSTEM:LOAD-SYSTEM-DEFINITION-ERROR : Error while trying to load definition for system hu.dwim.web-server.test from pathname /home/testgrid/cl-test-grid/work-dir/agent/quicklisp/dists/quicklisp/software/hu.dwim.web-server-20150709-darcs/hu.dwim.web-server.test.asd: no symbol named "NON-PROPAGATING-OPERATION" in "ASDF/INTERFACE"
(LOAD hu.dwim.web-server.documentation FAIL) needs newer ASDF, ASDF/FIND-SYSTEM:LOAD-SYSTEM-DEFINITION-ERROR : Error while trying to load definition for system hu.dwim.web-server.documentation from pathname /home/testgrid/cl-test-grid/work-dir/agent/quicklisp/dists/quicklisp/software/hu.dwim.web-server-20150709-darcs/hu.dwim.web-server.documentation.asd: no symbol named "NON-PROPAGATING-OPERATION" in "ASDF/INTERFACE"
(LOAD hu.dwim.web-server.application.test FAIL) needs newer ASDF, ASDF/FIND-SYSTEM:LOAD-SYSTEM-DEFINITION-ERROR : Error while trying to load definition for system hu.dwim.web-server.application.test from pathname /home/testgrid/cl-test-grid/work-dir/agent/quicklisp/dists/quicklisp/software/hu.dwim.web-server-20150709-darcs/hu.dwim.web-server.application.test.asd: no symbol named "NON-PROPAGATING-OPERATION" in "ASDF/INTERFACE"
(LOAD hu.dwim.web-server.application+hu.dwim.perec FAIL) needs newer ASDF, ASDF/FIND-SYSTEM:LOAD-SYSTEM-DEFINITION-ERROR : Error while trying to load definition for system hu.dwim.web-server.application+hu.dwim.perec from pathname /home/testgrid/cl-test-grid/work-dir/agent/quicklisp/dists/quicklisp/software/hu.dwim.web-server-20150709-darcs/hu.dwim.web-server.application+hu.dwim.perec.asd: no symbol named "NON-PROPAGATING-OPERATION" in "ASDF/INTERFACE"
(LOAD hu.dwim.web-server.application FAIL) needs newer ASDF, ASDF/FIND-SYSTEM:LOAD-SYSTEM-DEFINITION-ERROR : Error while trying to load definition for system hu.dwim.web-server.application from pathname /home/testgrid/cl-test-grid/work-dir/agent/quicklisp/dists/quicklisp/software/hu.dwim.web-server-20150709-darcs/hu.dwim.web-server.application.asd: no symbol named "NON-PROPAGATING-OPERATION" in "ASDF/INTERFACE"
(LOAD hu.dwim.web-server+swank FAIL) needs newer ASDF, ASDF/FIND-SYSTEM:LOAD-SYSTEM-DEFINITION-ERROR : Error while trying to load definition for system hu.dwim.web-server+swank from pathname /home/testgrid/cl-test-grid/work-dir/agent/quicklisp/dists/quicklisp/software/hu.dwim.web-server-20150709-darcs/hu.dwim.web-server+swank.asd: no symbol named "NON-PROPAGATING-OPERATION" in "ASDF/INTERFACE"
(LOAD hu.dwim.web-server FAIL) needs newer ASDF, ASDF/FIND-SYSTEM:LOAD-SYSTEM-DEFINITION-ERROR : Error while trying to load definition for system hu.dwim.web-server from pathname /home/testgrid/cl-test-grid/work-dir/agent/quicklisp/dists/quicklisp/software/hu.dwim.web-server-20150709-darcs/hu.dwim.web-server.asd: no symbol named "NON-PROPAGATING-OPERATION" in "ASDF/INTERFACE"
(LOAD hu.dwim.web-server.test FAIL) needs newer ASDF, ASDF/FIND-SYSTEM:LOAD-SYSTEM-DEFINITION-ERROR : Error while trying to load definition for system hu.dwim.web-server.test from pathname /home/testgrid/cl-test-grid/work-dir/agent/quicklisp/dists/quicklisp/software/hu.dwim.web-server-20150608-darcs/hu.dwim.web-server.test.asd: no symbol named "NON-PROPAGATING-OPERATION" in "ASDF/INTERFACE"
(LOAD hu.dwim.web-server.application.test FAIL) needs newer ASDF, ASDF/FIND-SYSTEM:LOAD-SYSTEM-DEFINITION-ERROR : Error while trying to load definition for system hu.dwim.web-server.application.test from pathname /home/testgrid/cl-test-grid/work-dir/agent/quicklisp/dists/quicklisp/software/hu.dwim.web-server-20150608-darcs/hu.dwim.web-server.application.test.asd: no symbol named "NON-PROPAGATING-OPERATION" in "ASDF/INTERFACE"
(LOAD hu.dwim.web-server.application+hu.dwim.perec FAIL) needs newer ASDF, ASDF/FIND-SYSTEM:LOAD-SYSTEM-DEFINITION-ERROR : Error while trying to load definition for system hu.dwim.web-server.application+hu.dwim.perec from pathname /home/testgrid/cl-test-grid/work-dir/agent/quicklisp/dists/quicklisp/software/hu.dwim.web-server-20150608-darcs/hu.dwim.web-server.application+hu.dwim.perec.asd: no symbol named "NON-PROPAGATING-OPERATION" in "ASDF/INTERFACE"
(LOAD hu.dwim.web-server.application FAIL) needs newer ASDF, ASDF/FIND-SYSTEM:LOAD-SYSTEM-DEFINITION-ERROR : Error while trying to load definition for system hu.dwim.web-server.application from pathname /home/testgrid/cl-test-grid/work-dir/agent/quicklisp/dists/quicklisp/software/hu.dwim.web-server-20150608-darcs/hu.dwim.web-server.application.asd: no symbol named "NON-PROPAGATING-OPERATION" in "ASDF/INTERFACE"
(LOAD hu.dwim.web-server+swank FAIL) needs newer ASDF, ASDF/FIND-SYSTEM:LOAD-SYSTEM-DEFINITION-ERROR : Error while trying to load definition for system hu.dwim.web-server+swank from pathname /home/testgrid/cl-test-grid/work-dir/agent/quicklisp/dists/quicklisp/software/hu.dwim.web-server-20150608-darcs/hu.dwim.web-server+swank.asd: no symbol named "NON-PROPAGATING-OPERATION" in "ASDF/INTERFACE"
(LOAD hu.dwim.web-server FAIL) needs newer ASDF, ASDF/FIND-SYSTEM:LOAD-SYSTEM-DEFINITION-ERROR : Error while trying to load definition for system hu.dwim.web-server from pathname /home/testgrid/cl-test-grid/work-dir/agent/quicklisp/dists/quicklisp/software/hu.dwim.web-server-20150608-darcs/hu.dwim.web-server.asd: no symbol named "NON-PROPAGATING-OPERATION" in "ASDF/INTERFACE"
sbcl-1.1.16-linux-x86
(LOAD hu.dwim.web-server.websocket FAIL) needs newer ASDF, ASDF/FIND-SYSTEM:LOAD-SYSTEM-DEFINITION-ERROR : Error while trying to load definition for system hu.dwim.web-server.websocket from pathname /home/testgrid/cl-test-grid/work-dir/agent/quicklisp/dists/quicklisp/software/hu.dwim.web-server-20150709-darcs/hu.dwim.web-server.websocket.asd: no symbol named "NON-PROPAGATING-OPERATION" in "ASDF/INTERFACE"
(LOAD hu.dwim.web-server.test FAIL) needs newer ASDF, ASDF/FIND-SYSTEM:LOAD-SYSTEM-DEFINITION-ERROR : Error while trying to load definition for system hu.dwim.web-server.test from pathname /home/testgrid/cl-test-grid/work-dir/agent/quicklisp/dists/quicklisp/software/hu.dwim.web-server-20150709-darcs/hu.dwim.web-server.test.asd: no symbol named "NON-PROPAGATING-OPERATION" in "ASDF/INTERFACE"
(LOAD hu.dwim.web-server.documentation FAIL) needs newer ASDF, ASDF/FIND-SYSTEM:LOAD-SYSTEM-DEFINITION-ERROR : Error while trying to load definition for system hu.dwim.web-server.documentation from pathname /home/testgrid/cl-test-grid/work-dir/agent/quicklisp/dists/quicklisp/software/hu.dwim.web-server-20150709-darcs/hu.dwim.web-server.documentation.asd: no symbol named "NON-PROPAGATING-OPERATION" in "ASDF/INTERFACE"
(LOAD hu.dwim.web-server.application.test FAIL) needs newer ASDF, ASDF/FIND-SYSTEM:LOAD-SYSTEM-DEFINITION-ERROR : Error while trying to load definition for system hu.dwim.web-server.application.test from pathname /home/testgrid/cl-test-grid/work-dir/agent/quicklisp/dists/quicklisp/software/hu.dwim.web-server-20150709-darcs/hu.dwim.web-server.application.test.asd: no symbol named "NON-PROPAGATING-OPERATION" in "ASDF/INTERFACE"
(LOAD hu.dwim.web-server.application+hu.dwim.perec FAIL) needs newer ASDF, ASDF/FIND-SYSTEM:LOAD-SYSTEM-DEFINITION-ERROR : Error while trying to load definition for system hu.dwim.web-server.application+hu.dwim.perec from pathname /home/testgrid/cl-test-grid/work-dir/agent/quicklisp/dists/quicklisp/software/hu.dwim.web-server-20150709-darcs/hu.dwim.web-server.application+hu.dwim.perec.asd: no symbol named "NON-PROPAGATING-OPERATION" in "ASDF/INTERFACE"
(LOAD hu.dwim.web-server.application FAIL) needs newer ASDF, ASDF/FIND-SYSTEM:LOAD-SYSTEM-DEFINITION-ERROR : Error while trying to load definition for system hu.dwim.web-server.application from pathname /home/testgrid/cl-test-grid/work-dir/agent/quicklisp/dists/quicklisp/software/hu.dwim.web-server-20150709-darcs/hu.dwim.web-server.application.asd: no symbol named "NON-PROPAGATING-OPERATION" in "ASDF/INTERFACE"
(LOAD hu.dwim.web-server+swank FAIL) needs newer ASDF, ASDF/FIND-SYSTEM:LOAD-SYSTEM-DEFINITION-ERROR : Error while trying to load definition for system hu.dwim.web-server+swank from pathname /home/testgrid/cl-test-grid/work-dir/agent/quicklisp/dists/quicklisp/software/hu.dwim.web-server-20150709-darcs/hu.dwim.web-server+swank.asd: no symbol named "NON-PROPAGATING-OPERATION" in "ASDF/INTERFACE"
(LOAD hu.dwim.web-server FAIL) needs newer ASDF, ASDF/FIND-SYSTEM:LOAD-SYSTEM-DEFINITION-ERROR : Error while trying to load definition for system hu.dwim.web-server from pathname /home/testgrid/cl-test-grid/work-dir/agent/quicklisp/dists/quicklisp/software/hu.dwim.web-server-20150709-darcs/hu.dwim.web-server.asd: no symbol named "NON-PROPAGATING-OPERATION" in "ASDF/INTERFACE"
(LOAD hu.dwim.web-server.test FAIL) needs newer ASDF, ASDF/FIND-SYSTEM:LOAD-SYSTEM-DEFINITION-ERROR : Error while trying to load definition for system hu.dwim.web-server.test from pathname /home/testgrid/cl-test-grid/work-dir/agent/quicklisp/dists/quicklisp/software/hu.dwim.web-server-20150608-darcs/hu.dwim.web-server.test.asd: no symbol named "NON-PROPAGATING-OPERATION" in "ASDF/INTERFACE"
(LOAD hu.dwim.web-server.application.test FAIL) needs newer ASDF, ASDF/FIND-SYSTEM:LOAD-SYSTEM-DEFINITION-ERROR : Error while trying to load definition for system hu.dwim.web-server.application.test from pathname /home/testgrid/cl-test-grid/work-dir/agent/quicklisp/dists/quicklisp/software/hu.dwim.web-server-20150608-darcs/hu.dwim.web-server.application.test.asd: no symbol named "NON-PROPAGATING-OPERATION" in "ASDF/INTERFACE"
(LOAD hu.dwim.web-server.application+hu.dwim.perec FAIL) needs newer ASDF, ASDF/FIND-SYSTEM:LOAD-SYSTEM-DEFINITION-ERROR : Error while trying to load definition for system hu.dwim.web-server.application+hu.dwim.perec from pathname /home/testgrid/cl-test-grid/work-dir/agent/quicklisp/dists/quicklisp/software/hu.dwim.web-server-20150608-darcs/hu.dwim.web-server.application+hu.dwim.perec.asd: no symbol named "NON-PROPAGATING-OPERATION" in "ASDF/INTERFACE"
(LOAD hu.dwim.web-server.application FAIL) needs newer ASDF, ASDF/FIND-SYSTEM:LOAD-SYSTEM-DEFINITION-ERROR : Error while trying to load definition for system hu.dwim.web-server.application from pathname /home/testgrid/cl-test-grid/work-dir/agent/quicklisp/dists/quicklisp/software/hu.dwim.web-server-20150608-darcs/hu.dwim.web-server.application.asd: no symbol named "NON-PROPAGATING-OPERATION" in "ASDF/INTERFACE"
(LOAD hu.dwim.web-server+swank FAIL) needs newer ASDF, ASDF/FIND-SYSTEM:LOAD-SYSTEM-DEFINITION-ERROR : Error while trying to load definition for system hu.dwim.web-server+swank from pathname /home/testgrid/cl-test-grid/work-dir/agent/quicklisp/dists/quicklisp/software/hu.dwim.web-server-20150608-darcs/hu.dwim.web-server+swank.asd: no symbol named "NON-PROPAGATING-OPERATION" in "ASDF/INTERFACE"
(LOAD hu.dwim.web-server FAIL) needs newer ASDF, ASDF/FIND-SYSTEM:LOAD-SYSTEM-DEFINITION-ERROR : Error while trying to load definition for system hu.dwim.web-server from pathname /home/testgrid/cl-test-grid/work-dir/agent/quicklisp/dists/quicklisp/software/hu.dwim.web-server-20150608-darcs/hu.dwim.web-server.asd: no symbol named "NON-PROPAGATING-OPERATION" in "ASDF/INTERFACE"
sbcl-1.2.3-linux-x64
(LOAD hu.dwim.web-server.test FAIL) COMMON-LISP:SIMPLE-ERROR : External process exited with code 1. Command was: "g++" "-m64" "-Wno-write-strings" "-I/home/hijarian/systems/cl-test-grid/work-dir/agent/quicklisp/dists/quicklisp/software/iolib-20150302-git/src/grovel/" "-o" "/home/hijarian/systems/cl-test-grid/work-dir/agent/test-runs/20150609131809-sbcl-1.2.3-linux-x64/fasl/ql/dists/quicklisp/software/iolib-20150302-git/src/syscalls/ffi-types-unix" "/home/hijarian/systems/cl-test-grid/work-dir/agent/test-runs/20150609131809-sbcl-1.2.3-linux-x64/fasl/ql/dists/quicklisp/software/iolib-20150302-git/src/syscalls/ffi-types-unix.c" Output was: /home/hijarian/systems/cl-test-grid/work-dir/agent/test-runs/20150609131809-sbcl-1.2.3-linux-x64/fasl/ql/dists/quicklisp/software/iolib-20150302-git/src/syscalls/ffi-types-unix.c:14:17: fatal error: lfp.h: Нет такого файла или каталога #include <lfp.h> ^ compilation terminated.
(LOAD hu.dwim.web-server.application.test FAIL) COMMON-LISP:SIMPLE-ERROR : External process exited with code 1. Command was: "g++" "-m64" "-Wno-write-strings" "-I/home/hijarian/systems/cl-test-grid/work-dir/agent/quicklisp/dists/quicklisp/software/iolib-20150302-git/src/grovel/" "-o" "/home/hijarian/systems/cl-test-grid/work-dir/agent/test-runs/20150609131809-sbcl-1.2.3-linux-x64/fasl/ql/dists/quicklisp/software/iolib-20150302-git/src/syscalls/ffi-types-unix" "/home/hijarian/systems/cl-test-grid/work-dir/agent/test-runs/20150609131809-sbcl-1.2.3-linux-x64/fasl/ql/dists/quicklisp/software/iolib-20150302-git/src/syscalls/ffi-types-unix.c" Output was: /home/hijarian/systems/cl-test-grid/work-dir/agent/test-runs/20150609131809-sbcl-1.2.3-linux-x64/fasl/ql/dists/quicklisp/software/iolib-20150302-git/src/syscalls/ffi-types-unix.c:14:17: fatal error: lfp.h: Нет такого файла или каталога #include <lfp.h> ^ compilation terminated.
(LOAD hu.dwim.web-server.application+hu.dwim.perec FAIL) COMMON-LISP:SIMPLE-ERROR : External process exited with code 1. Command was: "g++" "-m64" "-Wno-write-strings" "-I/home/hijarian/systems/cl-test-grid/work-dir/agent/quicklisp/dists/quicklisp/software/iolib-20150302-git/src/grovel/" "-o" "/home/hijarian/systems/cl-test-grid/work-dir/agent/test-runs/20150609131809-sbcl-1.2.3-linux-x64/fasl/ql/dists/quicklisp/software/iolib-20150302-git/src/syscalls/ffi-types-unix" "/home/hijarian/systems/cl-test-grid/work-dir/agent/test-runs/20150609131809-sbcl-1.2.3-linux-x64/fasl/ql/dists/quicklisp/software/iolib-20150302-git/src/syscalls/ffi-types-unix.c" Output was: /home/hijarian/systems/cl-test-grid/work-dir/agent/test-runs/20150609131809-sbcl-1.2.3-linux-x64/fasl/ql/dists/quicklisp/software/iolib-20150302-git/src/syscalls/ffi-types-unix.c:14:17: fatal error: lfp.h: Нет такого файла или каталога #include <lfp.h> ^ compilation terminated.
(LOAD hu.dwim.web-server.application FAIL) COMMON-LISP:SIMPLE-ERROR : External process exited with code 1. Command was: "g++" "-m64" "-Wno-write-strings" "-I/home/hijarian/systems/cl-test-grid/work-dir/agent/quicklisp/dists/quicklisp/software/iolib-20150302-git/src/grovel/" "-o" "/home/hijarian/systems/cl-test-grid/work-dir/agent/test-runs/20150609131809-sbcl-1.2.3-linux-x64/fasl/ql/dists/quicklisp/software/iolib-20150302-git/src/syscalls/ffi-types-unix" "/home/hijarian/systems/cl-test-grid/work-dir/agent/test-runs/20150609131809-sbcl-1.2.3-linux-x64/fasl/ql/dists/quicklisp/software/iolib-20150302-git/src/syscalls/ffi-types-unix.c" Output was: /home/hijarian/systems/cl-test-grid/work-dir/agent/test-runs/20150609131809-sbcl-1.2.3-linux-x64/fasl/ql/dists/quicklisp/software/iolib-20150302-git/src/syscalls/ffi-types-unix.c:14:17: fatal error: lfp.h: Нет такого файла или каталога #include <lfp.h> ^ compilation terminated.
(LOAD hu.dwim.web-server+swank FAIL) COMMON-LISP:SIMPLE-ERROR : External process exited with code 1. Command was: "g++" "-m64" "-Wno-write-strings" "-I/home/hijarian/systems/cl-test-grid/work-dir/agent/quicklisp/dists/quicklisp/software/iolib-20150302-git/src/grovel/" "-o" "/home/hijarian/systems/cl-test-grid/work-dir/agent/test-runs/20150609131809-sbcl-1.2.3-linux-x64/fasl/ql/dists/quicklisp/software/iolib-20150302-git/src/syscalls/ffi-types-unix" "/home/hijarian/systems/cl-test-grid/work-dir/agent/test-runs/20150609131809-sbcl-1.2.3-linux-x64/fasl/ql/dists/quicklisp/software/iolib-20150302-git/src/syscalls/ffi-types-unix.c" Output was: /home/hijarian/systems/cl-test-grid/work-dir/agent/test-runs/20150609131809-sbcl-1.2.3-linux-x64/fasl/ql/dists/quicklisp/software/iolib-20150302-git/src/syscalls/ffi-types-unix.c:14:17: fatal error: lfp.h: Нет такого файла или каталога #include <lfp.h> ^ compilation terminated.
(LOAD hu.dwim.web-server FAIL) COMMON-LISP:SIMPLE-ERROR : External process exited with code 1. Command was: "g++" "-m64" "-Wno-write-strings" "-I/home/hijarian/systems/cl-test-grid/work-dir/agent/quicklisp/dists/quicklisp/software/iolib-20150302-git/src/grovel/" "-o" "/home/hijarian/systems/cl-test-grid/work-dir/agent/test-runs/20150609131809-sbcl-1.2.3-linux-x64/fasl/ql/dists/quicklisp/software/iolib-20150302-git/src/syscalls/ffi-types-unix" "/home/hijarian/systems/cl-test-grid/work-dir/agent/test-runs/20150609131809-sbcl-1.2.3-linux-x64/fasl/ql/dists/quicklisp/software/iolib-20150302-git/src/syscalls/ffi-types-unix.c" Output was: /home/hijarian/systems/cl-test-grid/work-dir/agent/test-runs/20150609131809-sbcl-1.2.3-linux-x64/fasl/ql/dists/quicklisp/software/iolib-20150302-git/src/syscalls/ffi-types-unix.c:14:17: fatal error: lfp.h: Нет такого файла или каталога #include <lfp.h> ^ compilation terminated.
sbcl-1.2.6-linux-x86
(LOAD hu.dwim.web-server.websocket FAIL) ffi, CFFI:LOAD-FOREIGN-LIBRARY-ERROR : Unable to load foreign library (ZLIB). Error opening shared object "libz.so": libz.so: cannot open shared object file: No such file or directory.
(LOAD hu.dwim.web-server.test FAIL) ffi, CFFI:LOAD-FOREIGN-LIBRARY-ERROR : Unable to load foreign library (ZLIB). Error opening shared object "libz.so": libz.so: cannot open shared object file: No such file or directory.
(LOAD hu.dwim.web-server.documentation FAIL) ffi, CFFI:LOAD-FOREIGN-LIBRARY-ERROR : Unable to load any of the alternatives: ("libgvc.so" "libgvc.so.4" "libgvc32.so.4")
(LOAD hu.dwim.web-server.application.test FAIL) ffi, CFFI:LOAD-FOREIGN-LIBRARY-ERROR : Unable to load foreign library (ZLIB). Error opening shared object "libz.so": libz.so: cannot open shared object file: No such file or directory.
(LOAD hu.dwim.web-server.application+hu.dwim.perec FAIL) ffi, CFFI:LOAD-FOREIGN-LIBRARY-ERROR : Unable to load foreign library (ZLIB). Error opening shared object "libz.so": libz.so: cannot open shared object file: No such file or directory.
(LOAD hu.dwim.web-server.application FAIL) ffi, CFFI:LOAD-FOREIGN-LIBRARY-ERROR : Unable to load foreign library (ZLIB). Error opening shared object "libz.so": libz.so: cannot open shared object file: No such file or directory.
(LOAD hu.dwim.web-server+swank FAIL) ffi, CFFI:LOAD-FOREIGN-LIBRARY-ERROR : Unable to load foreign library (ZLIB). Error opening shared object "libz.so": libz.so: cannot open shared object file: No such file or directory.
(LOAD hu.dwim.web-server FAIL) ffi, CFFI:LOAD-FOREIGN-LIBRARY-ERROR : Unable to load foreign library (ZLIB). Error opening shared object "libz.so": libz.so: cannot open shared object file: No such file or directory.
(LOAD hu.dwim.web-server.test FAIL) ffi, CFFI:LOAD-FOREIGN-LIBRARY-ERROR : Unable to load foreign library (ZLIB). Error opening shared object "libz.so": libz.so: cannot open shared object file: No such file or directory.
(LOAD hu.dwim.web-server.application.test FAIL) ffi, CFFI:LOAD-FOREIGN-LIBRARY-ERROR : Unable to load foreign library (ZLIB). Error opening shared object "libz.so": libz.so: cannot open shared object file: No such file or directory.
(LOAD hu.dwim.web-server.application+hu.dwim.perec FAIL) ffi, CFFI:LOAD-FOREIGN-LIBRARY-ERROR : Unable to load foreign library (ZLIB). Error opening shared object "libz.so": libz.so: cannot open shared object file: No such file or directory.
(LOAD hu.dwim.web-server.application FAIL) ffi, CFFI:LOAD-FOREIGN-LIBRARY-ERROR : Unable to load foreign library (ZLIB). Error opening shared object "libz.so": libz.so: cannot open shared object file: No such file or directory.
(LOAD hu.dwim.web-server+swank FAIL) ffi, CFFI:LOAD-FOREIGN-LIBRARY-ERROR : Unable to load foreign library (ZLIB). Error opening shared object "libz.so": libz.so: cannot open shared object file: No such file or directory.
(LOAD hu.dwim.web-server FAIL) ffi, CFFI:LOAD-FOREIGN-LIBRARY-ERROR : Unable to load foreign library (ZLIB). Error opening shared object "libz.so": libz.so: cannot open shared object file: No such file or directory.

Breakdown by testcases: for every failed testcase the lisp implmentations it fails on

The library does not have a testsuite adapter for CL Test Grid.

To reports overview

Generated at: 2015-07-23 13:00:25 GMT.