hu.dwim.walker results collected by cl-test-grid

Results on the last two Quicklisp distributions

 quicklisp 2018-04-30quicklisp 2018-03-28
abcl-1.2.1-fasl42-linux-x86
(LOAD hu.dwim.walker.test FAIL) needs newer ASDF, ASDF/FIND-SYSTEM:LOAD-SYSTEM-DEFINITION-ERROR : Error while trying to load definition for system hu.dwim.walker.test from pathname /home/testgrid/cl-test-grid/work-dir/agent/quicklisp/dists/quicklisp/software/hu.dwim.walker-20151218-darcs/hu.dwim.walker.test.asd: The symbol NON-PROPAGATING-OPERATION is not present in package ASDF/INTERFACE.
(LOAD hu.dwim.walker.documentation FAIL) needs newer ASDF, ASDF/FIND-SYSTEM:LOAD-SYSTEM-DEFINITION-ERROR : Error while trying to load definition for system hu.dwim.walker.documentation from pathname /home/testgrid/cl-test-grid/work-dir/agent/quicklisp/dists/quicklisp/software/hu.dwim.walker-20151218-darcs/hu.dwim.walker.documentation.asd: The symbol NON-PROPAGATING-OPERATION is not present in package ASDF/INTERFACE.
(LOAD hu.dwim.walker FAIL) needs newer ASDF, ASDF/FIND-SYSTEM:LOAD-SYSTEM-DEFINITION-ERROR : Error while trying to load definition for system hu.dwim.walker from pathname /home/testgrid/cl-test-grid/work-dir/agent/quicklisp/dists/quicklisp/software/hu.dwim.walker-20151218-darcs/hu.dwim.walker.asd: The symbol NON-PROPAGATING-OPERATION is not present in package ASDF/INTERFACE.
(WHOLE-TEST-SUITE FAIL) needs newer ASDF, ASDF/FIND-SYSTEM:LOAD-SYSTEM-DEFINITION-ERROR : Error while trying to load definition for system hu.dwim.walker.test from pathname /home/testgrid/cl-test-grid/work-dir/agent/quicklisp/dists/quicklisp/software/hu.dwim.walker-20151218-darcs/hu.dwim.walker.test.asd: The symbol NON-PROPAGATING-OPERATION is not present in package ASDF/INTERFACE.
abcl-1.3.0-fasl42-linux-x86
(LOAD hu.dwim.walker.documentation FAIL) ASDF/FIND-SYSTEM:LOAD-SYSTEM-DEFINITION-ERROR : Error while trying to load definition for system cffi-libffi from pathname /home/testgrid/cl-test-grid/work-dir/agent/quicklisp/dists/quicklisp/software/cffi_0.19.0/cffi-libffi.asd: Component "asdf" does not match version 3.1.2, required by #<SYSTEM "cffi-toolchain">
(WHOLE-TEST-SUITE FAIL) COMMON-LISP:FILE-ERROR : File not found: /home/testgrid/cl-test-grid/work-dir/agent/test-runs/20180423094425-abcl-1.3.0-fasl42-linux-x86/fasl/test-grid/work-dir/agent/quicklisp/dists/quicklisp/software/iolib-v0.8.3/src/syscalls/ffi-types-unix.abcl
abcl-1.3.1-fasl42-linux-x86
(LOAD hu.dwim.walker.documentation FAIL) ASDF/FIND-SYSTEM:LOAD-SYSTEM-DEFINITION-ERROR : Error while trying to load definition for system cffi-libffi from pathname /home/testgrid/cl-test-grid/work-dir/agent/quicklisp/dists/quicklisp/software/cffi_0.19.0/cffi-libffi.asd: Component "asdf" does not match version 3.1.2, required by #<SYSTEM "cffi-toolchain">
(WHOLE-TEST-SUITE FAIL) COMMON-LISP:FILE-ERROR : File not found: /home/testgrid/cl-test-grid/work-dir/agent/test-runs/20180422130550-abcl-1.3.1-fasl42-linux-x86/fasl/test-grid/work-dir/agent/quicklisp/dists/quicklisp/software/iolib-v0.8.3/src/syscalls/ffi-types-unix.abcl
abcl-1.3.2-fasl42-linux-x86
(LOAD hu.dwim.walker.documentation FAIL) ffi, CFFI:LOAD-FOREIGN-LIBRARY-ERROR : Unable to load any of the alternatives: ("libgvc.so" "libgvc.so.4" "libgvc32.so.4")
(WHOLE-TEST-SUITE FAIL) COMMON-LISP:FILE-ERROR : File not found: /home/testgrid/cl-test-grid/work-dir/agent/test-runs/20180421150322-abcl-1.3.2-fasl42-linux-x86/fasl/test-grid/work-dir/agent/quicklisp/dists/quicklisp/software/iolib-v0.8.3/src/syscalls/ffi-types-unix.abcl
abcl-1.4.0-fasl42-linux-x86
(LOAD hu.dwim.walker.test FAIL) ASDF/FIND-SYSTEM:LOAD-SYSTEM-DEFINITION-ERROR : Error while trying to load definition for system iolib from pathname /home/testgrid/cl-test-grid/work-dir/agent/quicklisp/dists/quicklisp/software/iolib-v0.8.3/iolib.asd: org.armedbear.lisp.Go
(LOAD hu.dwim.walker.documentation FAIL) ASDF/FIND-SYSTEM:LOAD-SYSTEM-DEFINITION-ERROR : Error while trying to load definition for system iolib from pathname /home/testgrid/cl-test-grid/work-dir/agent/quicklisp/dists/quicklisp/software/iolib-v0.8.3/iolib.asd: org.armedbear.lisp.Go
(WHOLE-TEST-SUITE FAIL) ASDF/FIND-SYSTEM:LOAD-SYSTEM-DEFINITION-ERROR : Error while trying to load definition for system iolib from pathname /home/testgrid/cl-test-grid/work-dir/agent/quicklisp/dists/quicklisp/software/iolib-v0.8.3/iolib.asd: org.armedbear.lisp.Go
abcl-1.5.0-fasl43-linux-x86
acl-10.0-linux-x86
(LOAD hu.dwim.walker.test FAIL) COMMON-LISP:SIMPLE-ERROR : this platform does not support :unsigned-long-long
(LOAD hu.dwim.walker.documentation FAIL) COMMON-LISP:SIMPLE-ERROR : this platform does not support :unsigned-long-long
(WHOLE-TEST-SUITE FAIL) EXCL:FILE-DOES-NOT-EXIST-ERROR : #P"/home/testgrid/cl-test-grid/work-dir/agent/test-runs/20180418105539-acl-10.0-linux-x86/fasl/test-grid/work-dir/agent/quicklisp/dists/quicklisp/software/iolib-v0.8.3/src/syscalls/ffi-types-unix.fasl" does not exist, cannot load
acl-10.0m-linux-x86
(LOAD hu.dwim.walker.test FAIL) common-lisp:parse-error : Function position must contain a symbol or lambda expression: (NAME :ACCESSOR NAME-OF :INITARG :NAME :TYPE SYMBOL)
(LOAD hu.dwim.walker.documentation FAIL) common-lisp:parse-error : Function position must contain a symbol or lambda expression: (NAME :ACCESSOR NAME-OF :INITARG :NAME :TYPE SYMBOL)
(LOAD hu.dwim.walker FAIL) common-lisp:parse-error : Function position must contain a symbol or lambda expression: (NAME :ACCESSOR NAME-OF :INITARG :NAME :TYPE SYMBOL)
(WHOLE-TEST-SUITE FAIL) common-lisp:parse-error : Function position must contain a symbol or lambda expression: (NAME :ACCESSOR NAME-OF :INITARG :NAME :TYPE SYMBOL)
acl-10.0ms-linux-x86
(LOAD hu.dwim.walker.test FAIL) common-lisp:parse-error : Function position must contain a symbol or lambda expression: (NAME :ACCESSOR NAME-OF :INITARG :NAME :TYPE SYMBOL)
(LOAD hu.dwim.walker.documentation FAIL) common-lisp:parse-error : Function position must contain a symbol or lambda expression: (NAME :ACCESSOR NAME-OF :INITARG :NAME :TYPE SYMBOL)
(LOAD hu.dwim.walker FAIL) common-lisp:parse-error : Function position must contain a symbol or lambda expression: (NAME :ACCESSOR NAME-OF :INITARG :NAME :TYPE SYMBOL)
(WHOLE-TEST-SUITE FAIL) common-lisp:parse-error : Function position must contain a symbol or lambda expression: (NAME :ACCESSOR NAME-OF :INITARG :NAME :TYPE SYMBOL)
acl-10.0s-linux-x86
(LOAD hu.dwim.walker.test FAIL) COMMON-LISP:SIMPLE-ERROR : this platform does not support :unsigned-long-long
(LOAD hu.dwim.walker.documentation FAIL) COMMON-LISP:SIMPLE-ERROR : this platform does not support :unsigned-long-long
(WHOLE-TEST-SUITE FAIL) EXCL:FILE-DOES-NOT-EXIST-ERROR : #P"/home/testgrid/cl-test-grid/work-dir/agent/test-runs/20180511035057-acl-10.0s-linux-x86/fasl/test-grid/work-dir/agent/quicklisp/dists/quicklisp/software/iolib-v0.8.3/src/syscalls/ffi-types-unix.fasl" does not exist, cannot load
(LOAD hu.dwim.walker.test FAIL) COMMON-LISP:SIMPLE-ERROR : this platform does not support :unsigned-long-long
(LOAD hu.dwim.walker.documentation FAIL) COMMON-LISP:SIMPLE-ERROR : this platform does not support :unsigned-long-long
(WHOLE-TEST-SUITE FAIL) EXCL:FILE-DOES-NOT-EXIST-ERROR : #P"/home/testgrid/cl-test-grid/work-dir/agent/test-runs/20180414104913-acl-10.0s-linux-x86/fasl/test-grid/work-dir/agent/quicklisp/dists/quicklisp/software/iolib-v0.8.3/src/syscalls/ffi-types-unix.fasl" does not exist, cannot load
ccl-1.10-r16196-f96-linux-x86
(LOAD hu.dwim.walker.documentation FAIL) ffi, CFFI:LOAD-FOREIGN-LIBRARY-ERROR : Unable to load any of the alternatives: ("libgvc.so" "libgvc.so.4" "libgvc32.so.4")
(WHOLE-TEST-SUITE FAIL) CCL::SIMPLE-FILE-ERROR : File #P"/home/testgrid/cl-test-grid/work-dir/agent/test-runs/20180509182506-ccl-1.10-r16196-f96-linux-x86/fasl/test-grid/work-dir/agent/quicklisp/dists/quicklisp/software/iolib-v0.8.3/src/syscalls/ffi-types-unix.lx32fsl" does not exist.
(LOAD hu.dwim.walker.documentation FAIL) ffi, CFFI:LOAD-FOREIGN-LIBRARY-ERROR : Unable to load any of the alternatives: ("libgvc.so" "libgvc.so.4" "libgvc32.so.4")
(WHOLE-TEST-SUITE FAIL) CCL::SIMPLE-FILE-ERROR : File #P"/home/testgrid/cl-test-grid/work-dir/agent/test-runs/20180413024308-ccl-1.10-r16196-f96-linux-x86/fasl/test-grid/work-dir/agent/quicklisp/dists/quicklisp/software/iolib-v0.8.3/src/syscalls/ffi-types-unix.lx32fsl" does not exist.
ccl-1.11-5-rv1.11.5-f96-linux-x86
(LOAD hu.dwim.walker.documentation FAIL) ffi, CFFI:LOAD-FOREIGN-LIBRARY-ERROR : Unable to load any of the alternatives: ("libgvc.so" "libgvc.so.4" "libgvc32.so.4")
(WHOLE-TEST-SUITE FAIL) CCL::SIMPLE-FILE-ERROR : File #P"/home/testgrid/cl-test-grid/work-dir/agent/test-runs/20180510184539-ccl-1.11-5-rv1.11.5-f96-linux-x86/fasl/test-grid/work-dir/agent/quicklisp/dists/quicklisp/software/iolib-v0.8.3/src/syscalls/ffi-types-unix.lx32fsl" does not exist.
(LOAD hu.dwim.walker.documentation FAIL) ffi, CFFI:LOAD-FOREIGN-LIBRARY-ERROR : Unable to load any of the alternatives: ("libgvc.so" "libgvc.so.4" "libgvc32.so.4")
(WHOLE-TEST-SUITE FAIL) CCL::SIMPLE-FILE-ERROR : File #P"/home/testgrid/cl-test-grid/work-dir/agent/test-runs/20180414014345-ccl-1.11-5-rv1.11.5-f96-linux-x86/fasl/test-grid/work-dir/agent/quicklisp/dists/quicklisp/software/iolib-v0.8.3/src/syscalls/ffi-types-unix.lx32fsl" does not exist.
ccl-1.11-r16635-f101-linux-arm
(LOAD hu.dwim.walker.test FAIL) IOLIB/GROVEL::GROVEL-ERROR : External process exited with code 71. Command was: "g++" "-marm" "-Wno-write-strings" "-I/home/testgrid/cl-test-grid/work-dir/agent/quicklisp/dists/quicklisp/software/iolib-v0.8.3/src/grovel/" "-o" "/home/testgrid/cl-test-grid/work-dir/agent/test-runs/20180510071612-ccl-1.11-r16635-f101-linux-arm/fasl/ql/dists/quicklisp/software/iolib-v0.8.3/src/syscalls/ffi-types-unix" "/home/testgrid/cl-test-grid/work-dir/agent/test-runs/20180510071612-ccl-1.11-r16635-f101-linux-arm/fasl/ql/dists/quicklisp/software/iolib-v0.8.3/src/syscalls/ffi-types-unix.c" Output was: Error output was:
(LOAD hu.dwim.walker.documentation FAIL) IOLIB/GROVEL::GROVEL-ERROR : External process exited with code 71. Command was: "g++" "-marm" "-Wno-write-strings" "-I/home/testgrid/cl-test-grid/work-dir/agent/quicklisp/dists/quicklisp/software/iolib-v0.8.3/src/grovel/" "-o" "/home/testgrid/cl-test-grid/work-dir/agent/test-runs/20180510071612-ccl-1.11-r16635-f101-linux-arm/fasl/ql/dists/quicklisp/software/iolib-v0.8.3/src/syscalls/ffi-types-unix" "/home/testgrid/cl-test-grid/work-dir/agent/test-runs/20180510071612-ccl-1.11-r16635-f101-linux-arm/fasl/ql/dists/quicklisp/software/iolib-v0.8.3/src/syscalls/ffi-types-unix.c" Output was: Error output was:
(WHOLE-TEST-SUITE FAIL) IOLIB/GROVEL::GROVEL-ERROR : External process exited with code 71. Command was: "g++" "-marm" "-Wno-write-strings" "-I/home/testgrid/cl-test-grid/work-dir/agent/quicklisp/dists/quicklisp/software/iolib-v0.8.3/src/grovel/" "-o" "/home/testgrid/cl-test-grid/w... "/home/testgrid/cl-test-grid/w... Output was: Error output was:
ccl-1.11-r16635-f96-linux-x86
(LOAD hu.dwim.walker.documentation FAIL) ffi, CFFI:LOAD-FOREIGN-LIBRARY-ERROR : Unable to load any of the alternatives: ("libgvc.so" "libgvc.so.4" "libgvc32.so.4")
(WHOLE-TEST-SUITE FAIL) CCL::SIMPLE-FILE-ERROR : File #P"/home/testgrid/cl-test-grid/work-dir/agent/test-runs/20180510230036-ccl-1.11-r16635-f96-linux-x86/fasl/test-grid/work-dir/agent/quicklisp/dists/quicklisp/software/iolib-v0.8.3/src/syscalls/ffi-types-unix.lx32fsl" does not exist.
(LOAD hu.dwim.walker.documentation FAIL) ffi, CFFI:LOAD-FOREIGN-LIBRARY-ERROR : Unable to load any of the alternatives: ("libgvc.so" "libgvc.so.4" "libgvc32.so.4")
(WHOLE-TEST-SUITE FAIL) CCL::SIMPLE-FILE-ERROR : File #P"/home/testgrid/cl-test-grid/work-dir/agent/test-runs/20180414054603-ccl-1.11-r16635-f96-linux-x86/fasl/test-grid/work-dir/agent/quicklisp/dists/quicklisp/software/iolib-v0.8.3/src/syscalls/ffi-types-unix.lx32fsl" does not exist.
ccl-1.11-r16702m-f101-linux-arm
(LOAD hu.dwim.walker.test FAIL) IOLIB/GROVEL::GROVEL-ERROR : External process exited with code 1. Command was: "g++" "-marm" "-Wno-write-strings" "-I/home/testgrid/cl-test-grid/work-dir/agent/quicklisp/dists/quicklisp/software/iolib-v0.8.3/src/grovel/" "-o" "/home/testgrid/cl-test-grid/work-dir/agent/test-runs/20180401030522-ccl-1.11-r16702m-f101-linux-arm/fasl/ql/dists/quicklisp/software/iolib-v0.8.3/src/syscalls/ffi-types-unix" "/home/testgrid/cl-test-grid/work-dir/agent/test-runs/20180401030522-ccl-1.11-r16702m-f101-linux-arm/fasl/ql/dists/quicklisp/software/iolib-v0.8.3/src/syscalls/ffi-types-unix.c" Output was: Error output was: /home/testgrid/cl-test-grid/work-dir/agent/test-runs/20180401030522-ccl-1.11-r16702m-f101-linux-arm/fasl/ql/dists/quicklisp/software/iolib-v0.8.3/src/syscalls/ffi-types-unix.c:14:17: fatal error: lfp.h: No such file or directory compilation terminated.
(LOAD hu.dwim.walker.documentation FAIL) IOLIB/GROVEL::GROVEL-ERROR : External process exited with code 1. Command was: "g++" "-marm" "-Wno-write-strings" "-I/home/testgrid/cl-test-grid/work-dir/agent/quicklisp/dists/quicklisp/software/iolib-v0.8.3/src/grovel/" "-o" "/home/testgrid/cl-test-grid/work-dir/agent/test-runs/20180401030522-ccl-1.11-r16702m-f101-linux-arm/fasl/ql/dists/quicklisp/software/iolib-v0.8.3/src/syscalls/ffi-types-unix" "/home/testgrid/cl-test-grid/work-dir/agent/test-runs/20180401030522-ccl-1.11-r16702m-f101-linux-arm/fasl/ql/dists/quicklisp/software/iolib-v0.8.3/src/syscalls/ffi-types-unix.c" Output was: Error output was: /home/testgrid/cl-test-grid/work-dir/agent/test-runs/20180401030522-ccl-1.11-r16702m-f101-linux-arm/fasl/ql/dists/quicklisp/software/iolib-v0.8.3/src/syscalls/ffi-types-unix.c:14:17: fatal error: lfp.h: No such file or directory compilation terminated.
(WHOLE-TEST-SUITE FAIL) IOLIB/GROVEL::GROVEL-ERROR : External process exited with code 1. Command was: "g++" "-marm" "-Wno-write-strings" "-I/home/testgrid/cl-test-grid/work-dir/agent/quicklisp/dists/quicklisp/software/iolib-v0.8.3/src/grovel/" "-o" "/home/testgrid/cl-test-grid/w... "/home/testgrid/cl-test-grid/w... Output was: Error output was: /home/testgrid/cl-test-grid/wo... fatal error: lfp.h: No such file or directory compilation terminated.
ccl-1.8-r15286m-f95-linux-x86
(LOAD hu.dwim.walker.test FAIL) needs newer ASDF, ASDF:LOAD-SYSTEM-DEFINITION-ERROR : Error while trying to load definition for system hu.dwim.walker.test from pathname /home/testgrid/cl-test-grid/work-dir/agent/quicklisp/dists/quicklisp/software/hu.dwim.walker-20151218-darcs/hu\.dwim\.walker\.test.asd: Cannot IMPORT "NON-PROPAGATING-OPERATION" from package "ASDF"
(LOAD hu.dwim.walker.documentation FAIL) needs newer ASDF, ASDF:LOAD-SYSTEM-DEFINITION-ERROR : Error while trying to load definition for system hu.dwim.walker.documentation from pathname /home/testgrid/cl-test-grid/work-dir/agent/quicklisp/dists/quicklisp/software/hu.dwim.walker-20151218-darcs/hu\.dwim\.walker\.documentation.asd: Cannot IMPORT "NON-PROPAGATING-OPERATION" from package "ASDF"
(LOAD hu.dwim.walker FAIL) needs newer ASDF, ASDF:LOAD-SYSTEM-DEFINITION-ERROR : Error while trying to load definition for system hu.dwim.walker from pathname /home/testgrid/cl-test-grid/work-dir/agent/quicklisp/dists/quicklisp/software/hu.dwim.walker-20151218-darcs/hu\.dwim\.walker.asd: Cannot IMPORT "NON-PROPAGATING-OPERATION" from package "ASDF"
(WHOLE-TEST-SUITE FAIL) needs newer ASDF, ASDF:LOAD-SYSTEM-DEFINITION-ERROR : Error while trying to load definition for system hu.dwim.walker.test from pathname /home/testgrid/cl-test-grid/work-dir/agent/quicklisp/dists/quicklisp/software/hu.dwim.walker-20151218-darcs/hu\.dwim\.walker\.test.asd: Cannot IMPORT "NON-PROPAGATING-OPERATION" from package "ASDF"
ccl-1.9-r15756-f96-linux-x86
(LOAD hu.dwim.walker.test FAIL) needs newer ASDF, ASDF/FIND-SYSTEM:LOAD-SYSTEM-DEFINITION-ERROR : Error while trying to load definition for system hu.dwim.walker.test from pathname /home/testgrid/cl-test-grid/work-dir/agent/quicklisp/dists/quicklisp/software/hu.dwim.walker-20151218-darcs/hu\.dwim\.walker\.test.asd: Cannot IMPORT "NON-PROPAGATING-OPERATION" from package "ASDF"
(LOAD hu.dwim.walker.documentation FAIL) needs newer ASDF, ASDF/FIND-SYSTEM:LOAD-SYSTEM-DEFINITION-ERROR : Error while trying to load definition for system hu.dwim.walker.documentation from pathname /home/testgrid/cl-test-grid/work-dir/agent/quicklisp/dists/quicklisp/software/hu.dwim.walker-20151218-darcs/hu\.dwim\.walker\.documentation.asd: Cannot IMPORT "NON-PROPAGATING-OPERATION" from package "ASDF"
(LOAD hu.dwim.walker FAIL) needs newer ASDF, ASDF/FIND-SYSTEM:LOAD-SYSTEM-DEFINITION-ERROR : Error while trying to load definition for system hu.dwim.walker from pathname /home/testgrid/cl-test-grid/work-dir/agent/quicklisp/dists/quicklisp/software/hu.dwim.walker-20151218-darcs/hu\.dwim\.walker.asd: Cannot IMPORT "NON-PROPAGATING-OPERATION" from package "ASDF"
(WHOLE-TEST-SUITE FAIL) needs newer ASDF, ASDF/FIND-SYSTEM:LOAD-SYSTEM-DEFINITION-ERROR : Error while trying to load definition for system hu.dwim.walker.test from pathname /home/testgrid/cl-test-grid/work-dir/agent/quicklisp/dists/quicklisp/software/hu.dwim.walker-20151218-darcs/hu\.dwim\.walker\.test.asd: Cannot IMPORT "NON-PROPAGATING-OPERATION" from package "ASDF"
clisp-2.49-unix-x86
(LOAD hu.dwim.walker.test FAIL) needs newer ASDF, ASDF:LOAD-SYSTEM-DEFINITION-ERROR : Error while trying to load definition for system hu.dwim.walker.test from pathname /home/testgrid/cl-test-grid/work-dir/agent/quicklisp/dists/quicklisp/software/hu.dwim.walker-20151218-darcs/hu.dwim.walker.test.asd: DEFPACKAGE HU.DWIM.ASDF: There is no symbol ASDF::NON-PROPAGATING-OPERATION .
(LOAD hu.dwim.walker.documentation FAIL) needs newer ASDF, ASDF:LOAD-SYSTEM-DEFINITION-ERROR : Error while trying to load definition for system hu.dwim.walker.documentation from pathname /home/testgrid/cl-test-grid/work-dir/agent/quicklisp/dists/quicklisp/software/hu.dwim.walker-20151218-darcs/hu.dwim.walker.documentation.asd: DEFPACKAGE HU.DWIM.ASDF: There is no symbol ASDF::NON-PROPAGATING-OPERATION .
(LOAD hu.dwim.walker FAIL) needs newer ASDF, ASDF:LOAD-SYSTEM-DEFINITION-ERROR : Error while trying to load definition for system hu.dwim.walker from pathname /home/testgrid/cl-test-grid/work-dir/agent/quicklisp/dists/quicklisp/software/hu.dwim.walker-20151218-darcs/hu.dwim.walker.asd: DEFPACKAGE HU.DWIM.ASDF: There is no symbol ASDF::NON-PROPAGATING-OPERATION .
(WHOLE-TEST-SUITE FAIL) needs newer ASDF, ASDF:LOAD-SYSTEM-DEFINITION-ERROR : Error while trying to load definition for system hu.dwim.walker.test from pathname /home/testgrid/cl-test-grid/work-dir/agent/quicklisp/dists/quicklisp/software/hu.dwim.walker-20151218-darcs/hu.dwim.walker.test.asd: DEFPACKAGE HU.DWIM.ASDF: There is no symbol ASDF::NON-PROPAGATING-OPERATION .
(LOAD hu.dwim.walker.test FAIL) needs newer ASDF, ASDF:LOAD-SYSTEM-DEFINITION-ERROR : Error while trying to load definition for system hu.dwim.walker.test from pathname /home/testgrid/cl-test-grid/work-dir/agent/quicklisp/dists/quicklisp/software/hu.dwim.walker-20151218-darcs/hu.dwim.walker.test.asd: DEFPACKAGE HU.DWIM.ASDF: There is no symbol ASDF::NON-PROPAGATING-OPERATION .
(LOAD hu.dwim.walker.documentation FAIL) needs newer ASDF, ASDF:LOAD-SYSTEM-DEFINITION-ERROR : Error while trying to load definition for system hu.dwim.walker.documentation from pathname /home/testgrid/cl-test-grid/work-dir/agent/quicklisp/dists/quicklisp/software/hu.dwim.walker-20151218-darcs/hu.dwim.walker.documentation.asd: DEFPACKAGE HU.DWIM.ASDF: There is no symbol ASDF::NON-PROPAGATING-OPERATION .
(LOAD hu.dwim.walker FAIL) needs newer ASDF, ASDF:LOAD-SYSTEM-DEFINITION-ERROR : Error while trying to load definition for system hu.dwim.walker from pathname /home/testgrid/cl-test-grid/work-dir/agent/quicklisp/dists/quicklisp/software/hu.dwim.walker-20151218-darcs/hu.dwim.walker.asd: DEFPACKAGE HU.DWIM.ASDF: There is no symbol ASDF::NON-PROPAGATING-OPERATION .
(WHOLE-TEST-SUITE FAIL) needs newer ASDF, ASDF:LOAD-SYSTEM-DEFINITION-ERROR : Error while trying to load definition for system hu.dwim.walker.test from pathname /home/testgrid/cl-test-grid/work-dir/agent/quicklisp/dists/quicklisp/software/hu.dwim.walker-20151218-darcs/hu.dwim.walker.test.asd: DEFPACKAGE HU.DWIM.ASDF: There is no symbol ASDF::NON-PROPAGATING-OPERATION .
cmu-snapshot-2013-04__20d_unicode_-linux-x86
(LOAD hu.dwim.walker.test FAIL) needs newer ASDF, ASDF/FIND-SYSTEM:LOAD-SYSTEM-DEFINITION-ERROR : Error while trying to load definition for system hu.dwim.walker.test from pathname /home/testgrid/cl-test-grid/work-dir/agent/quicklisp/dists/quicklisp/software/hu.dwim.walker-20151218-darcs/hu.dwim.walker.test.asd: ASDF/INTERFACE does not contain a symbol NON-PROPAGATING-OPERATION
(LOAD hu.dwim.walker.documentation FAIL) needs newer ASDF, ASDF/FIND-SYSTEM:LOAD-SYSTEM-DEFINITION-ERROR : Error while trying to load definition for system hu.dwim.walker.documentation from pathname /home/testgrid/cl-test-grid/work-dir/agent/quicklisp/dists/quicklisp/software/hu.dwim.walker-20151218-darcs/hu.dwim.walker.documentation.asd: ASDF/INTERFACE does not contain a symbol NON-PROPAGATING-OPERATION
(LOAD hu.dwim.walker FAIL) needs newer ASDF, ASDF/FIND-SYSTEM:LOAD-SYSTEM-DEFINITION-ERROR : Error while trying to load definition for system hu.dwim.walker from pathname /home/testgrid/cl-test-grid/work-dir/agent/quicklisp/dists/quicklisp/software/hu.dwim.walker-20151218-darcs/hu.dwim.walker.asd: ASDF/INTERFACE does not contain a symbol NON-PROPAGATING-OPERATION
(WHOLE-TEST-SUITE FAIL) needs newer ASDF, ASDF/FIND-SYSTEM:LOAD-SYSTEM-DEFINITION-ERROR : Error while trying to load definition for system hu.dwim.walker.test from pathname /home/testgrid/cl-test-grid/work-dir/agent/quicklisp/dists/quicklisp/software/hu.dwim.walker-20151218-darcs/hu.dwim.walker.test.asd: ASDF/INTERFACE does not contain a symbol NON-PROPAGATING-OPERATION
cmu-snapshot-2014-01__20e_unicode_-linux-x86
(LOAD hu.dwim.walker.test FAIL) needs newer ASDF, ASDF/FIND-SYSTEM:LOAD-SYSTEM-DEFINITION-ERROR : Error while trying to load definition for system hu.dwim.walker.test from pathname /home/testgrid/cl-test-grid/work-dir/agent/quicklisp/dists/quicklisp/software/hu.dwim.walker-20151218-darcs/hu.dwim.walker.test.asd: ASDF/INTERFACE does not contain a symbol NON-PROPAGATING-OPERATION
(LOAD hu.dwim.walker.documentation FAIL) needs newer ASDF, ASDF/FIND-SYSTEM:LOAD-SYSTEM-DEFINITION-ERROR : Error while trying to load definition for system hu.dwim.walker.documentation from pathname /home/testgrid/cl-test-grid/work-dir/agent/quicklisp/dists/quicklisp/software/hu.dwim.walker-20151218-darcs/hu.dwim.walker.documentation.asd: ASDF/INTERFACE does not contain a symbol NON-PROPAGATING-OPERATION
(LOAD hu.dwim.walker FAIL) needs newer ASDF, ASDF/FIND-SYSTEM:LOAD-SYSTEM-DEFINITION-ERROR : Error while trying to load definition for system hu.dwim.walker from pathname /home/testgrid/cl-test-grid/work-dir/agent/quicklisp/dists/quicklisp/software/hu.dwim.walker-20151218-darcs/hu.dwim.walker.asd: ASDF/INTERFACE does not contain a symbol NON-PROPAGATING-OPERATION
(WHOLE-TEST-SUITE FAIL) needs newer ASDF, ASDF/FIND-SYSTEM:LOAD-SYSTEM-DEFINITION-ERROR : Error while trying to load definition for system hu.dwim.walker.test from pathname /home/testgrid/cl-test-grid/work-dir/agent/quicklisp/dists/quicklisp/software/hu.dwim.walker-20151218-darcs/hu.dwim.walker.test.asd: ASDF/INTERFACE does not contain a symbol NON-PROPAGATING-OPERATION
cmu-snapshot-2014-05-dirty__20e_unicode_-linux-x86
(LOAD hu.dwim.walker.test FAIL) needs newer ASDF, ASDF/FIND-SYSTEM:LOAD-SYSTEM-DEFINITION-ERROR : Error while trying to load definition for system hu.dwim.walker.test from pathname /home/testgrid/cl-test-grid/work-dir/agent/quicklisp/dists/quicklisp/software/hu.dwim.walker-20151218-darcs/hu.dwim.walker.test.asd: ASDF/INTERFACE does not contain a symbol NON-PROPAGATING-OPERATION
(LOAD hu.dwim.walker.documentation FAIL) needs newer ASDF, ASDF/FIND-SYSTEM:LOAD-SYSTEM-DEFINITION-ERROR : Error while trying to load definition for system hu.dwim.walker.documentation from pathname /home/testgrid/cl-test-grid/work-dir/agent/quicklisp/dists/quicklisp/software/hu.dwim.walker-20151218-darcs/hu.dwim.walker.documentation.asd: ASDF/INTERFACE does not contain a symbol NON-PROPAGATING-OPERATION
(LOAD hu.dwim.walker FAIL) needs newer ASDF, ASDF/FIND-SYSTEM:LOAD-SYSTEM-DEFINITION-ERROR : Error while trying to load definition for system hu.dwim.walker from pathname /home/testgrid/cl-test-grid/work-dir/agent/quicklisp/dists/quicklisp/software/hu.dwim.walker-20151218-darcs/hu.dwim.walker.asd: ASDF/INTERFACE does not contain a symbol NON-PROPAGATING-OPERATION
(WHOLE-TEST-SUITE FAIL) needs newer ASDF, ASDF/FIND-SYSTEM:LOAD-SYSTEM-DEFINITION-ERROR : Error while trying to load definition for system hu.dwim.walker.test from pathname /home/testgrid/cl-test-grid/work-dir/agent/quicklisp/dists/quicklisp/software/hu.dwim.walker-20151218-darcs/hu.dwim.walker.test.asd: ASDF/INTERFACE does not contain a symbol NON-PROPAGATING-OPERATION
cmu-snapshot-2014-12___20f_unicode_-linux-x86
(LOAD hu.dwim.walker.test FAIL) ASDF/FIND-SYSTEM:LOAD-SYSTEM-DEFINITION-ERROR : Error while trying to load definition for system hu.dwim.walker.test from pathname /home/testgrid/cl-test-grid/work-dir/agent/quicklisp/dists/quicklisp/software/hu.dwim.walker-20151218-darcs/hu.dwim.walker.test.asd: (during macroexpansion) Error in FDEFINITION: the function SYSTEM-TEST-SYSTEM-NAME is undefined.
(LOAD hu.dwim.walker.documentation FAIL) ASDF/FIND-SYSTEM:LOAD-SYSTEM-DEFINITION-ERROR : Error while trying to load definition for system hu.dwim.walker.documentation from pathname /home/testgrid/cl-test-grid/work-dir/agent/quicklisp/dists/quicklisp/software/hu.dwim.walker-20151218-darcs/hu.dwim.walker.documentation.asd: (during macroexpansion) Error in FDEFINITION: the function SYSTEM-TEST-SYSTEM-NAME is undefined.
(LOAD hu.dwim.walker FAIL) ASDF/FIND-SYSTEM:LOAD-SYSTEM-DEFINITION-ERROR : Error while trying to load definition for system hu.dwim.walker from pathname /home/testgrid/cl-test-grid/work-dir/agent/quicklisp/dists/quicklisp/software/hu.dwim.walker-20151218-darcs/hu.dwim.walker.asd: (during macroexpansion) Error in FDEFINITION: the function SYSTEM-TEST-SYSTEM-NAME is undefined.
(WHOLE-TEST-SUITE FAIL) ASDF/FIND-SYSTEM:LOAD-SYSTEM-DEFINITION-ERROR : Error while trying to load definition for system hu.dwim.walker.test from pathname /home/testgrid/cl-test-grid/work-dir/agent/quicklisp/dists/quicklisp/software/hu.dwim.walker-20151218-darcs/hu.dwim.walker.test.asd: (during macroexpansion) Error in FDEFINITION: the function SYSTEM-TEST-SYSTEM-NAME is undefined.
cmu-snapshot-2016-12__21b_unicode_-linux-x86
(LOAD hu.dwim.walker.test FAIL) ASDF/FIND-SYSTEM:LOAD-SYSTEM-DEFINITION-ERROR : Error while trying to load definition for system hu.dwim.walker.test from pathname /home/testgrid/cl-test-grid/work-dir/agent/quicklisp/dists/quicklisp/software/hu.dwim.walker-20151218-darcs/hu.dwim.walker.test.asd: (during macroexpansion) Error in FDEFINITION: the function SYSTEM-TEST-SYSTEM-NAME is undefined.
(LOAD hu.dwim.walker.documentation FAIL) ASDF/FIND-SYSTEM:LOAD-SYSTEM-DEFINITION-ERROR : Error while trying to load definition for system hu.dwim.walker.documentation from pathname /home/testgrid/cl-test-grid/work-dir/agent/quicklisp/dists/quicklisp/software/hu.dwim.walker-20151218-darcs/hu.dwim.walker.documentation.asd: (during macroexpansion) Error in FDEFINITION: the function SYSTEM-TEST-SYSTEM-NAME is undefined.
(LOAD hu.dwim.walker FAIL) ASDF/FIND-SYSTEM:LOAD-SYSTEM-DEFINITION-ERROR : Error while trying to load definition for system hu.dwim.walker from pathname /home/testgrid/cl-test-grid/work-dir/agent/quicklisp/dists/quicklisp/software/hu.dwim.walker-20151218-darcs/hu.dwim.walker.asd: (during macroexpansion) Error in FDEFINITION: the function SYSTEM-TEST-SYSTEM-NAME is undefined.
(WHOLE-TEST-SUITE FAIL) ASDF/FIND-SYSTEM:LOAD-SYSTEM-DEFINITION-ERROR : Error while trying to load definition for system hu.dwim.walker.test from pathname /home/testgrid/cl-test-grid/work-dir/agent/quicklisp/dists/quicklisp/software/hu.dwim.walker-20151218-darcs/hu.dwim.walker.test.asd: (during macroexpansion) Error in FDEFINITION: the function SYSTEM-TEST-SYSTEM-NAME is undefined.
(LOAD hu.dwim.walker.test FAIL) ASDF/FIND-SYSTEM:LOAD-SYSTEM-DEFINITION-ERROR : Error while trying to load definition for system hu.dwim.walker.test from pathname /home/testgrid/cl-test-grid/work-dir/agent/quicklisp/dists/quicklisp/software/hu.dwim.walker-20151218-darcs/hu.dwim.walker.test.asd: (during macroexpansion) Error in FDEFINITION: the function SYSTEM-TEST-SYSTEM-NAME is undefined.
(LOAD hu.dwim.walker.documentation FAIL) ASDF/FIND-SYSTEM:LOAD-SYSTEM-DEFINITION-ERROR : Error while trying to load definition for system hu.dwim.walker.documentation from pathname /home/testgrid/cl-test-grid/work-dir/agent/quicklisp/dists/quicklisp/software/hu.dwim.walker-20151218-darcs/hu.dwim.walker.documentation.asd: (during macroexpansion) Error in FDEFINITION: the function SYSTEM-TEST-SYSTEM-NAME is undefined.
(LOAD hu.dwim.walker FAIL) ASDF/FIND-SYSTEM:LOAD-SYSTEM-DEFINITION-ERROR : Error while trying to load definition for system hu.dwim.walker from pathname /home/testgrid/cl-test-grid/work-dir/agent/quicklisp/dists/quicklisp/software/hu.dwim.walker-20151218-darcs/hu.dwim.walker.asd: (during macroexpansion) Error in FDEFINITION: the function SYSTEM-TEST-SYSTEM-NAME is undefined.
(WHOLE-TEST-SUITE FAIL) ASDF/FIND-SYSTEM:LOAD-SYSTEM-DEFINITION-ERROR : Error while trying to load definition for system hu.dwim.walker.test from pathname /home/testgrid/cl-test-grid/work-dir/agent/quicklisp/dists/quicklisp/software/hu.dwim.walker-20151218-darcs/hu.dwim.walker.test.asd: (during macroexpansion) Error in FDEFINITION: the function SYSTEM-TEST-SYSTEM-NAME is undefined.
ecl-13.5.1-unknown-linux-i686-bytecode
(LOAD hu.dwim.walker.test FAIL) needs newer ASDF, ASDF/FIND-SYSTEM:LOAD-SYSTEM-DEFINITION-ERROR : Error while trying to load definition for system hu.dwim.walker.test from pathname /home/testgrid/cl-test-grid/work-dir/agent/quicklisp/dists/quicklisp/software/hu.dwim.walker-20151218-darcs/hu.dwim.walker.test.asd: Cannot find symbol "NON-PROPAGATING-OPERATION" in package #<"ASDF/INTERFACE" package>
(LOAD hu.dwim.walker.documentation FAIL) needs newer ASDF, ASDF/FIND-SYSTEM:LOAD-SYSTEM-DEFINITION-ERROR : Error while trying to load definition for system hu.dwim.walker.documentation from pathname /home/testgrid/cl-test-grid/work-dir/agent/quicklisp/dists/quicklisp/software/hu.dwim.walker-20151218-darcs/hu.dwim.walker.documentation.asd: Cannot find symbol "NON-PROPAGATING-OPERATION" in package #<"ASDF/INTERFACE" package>
(LOAD hu.dwim.walker FAIL) needs newer ASDF, ASDF/FIND-SYSTEM:LOAD-SYSTEM-DEFINITION-ERROR : Error while trying to load definition for system hu.dwim.walker from pathname /home/testgrid/cl-test-grid/work-dir/agent/quicklisp/dists/quicklisp/software/hu.dwim.walker-20151218-darcs/hu.dwim.walker.asd: Cannot find symbol "NON-PROPAGATING-OPERATION" in package #<"ASDF/INTERFACE" package>
(WHOLE-TEST-SUITE FAIL) needs newer ASDF, ASDF/FIND-SYSTEM:LOAD-SYSTEM-DEFINITION-ERROR : Error while trying to load definition for system hu.dwim.walker.test from pathname /home/testgrid/cl-test-grid/work-dir/agent/quicklisp/dists/quicklisp/software/hu.dwim.walker-20151218-darcs/hu.dwim.walker.test.asd: Cannot find symbol "NON-PROPAGATING-OPERATION" in package #<"ASDF/INTERFACE" package>
ecl-13.5.1-unknown-linux-i686-lisp-to-c
(LOAD hu.dwim.walker.test FAIL) ASDF/FIND-SYSTEM:LOAD-SYSTEM-DEFINITION-ERROR : Error while trying to load definition for system hu.dwim.walker.test from pathname /home/testgrid/cl-test-grid/work-dir/agent/quicklisp/dists/quicklisp/software/hu.dwim.walker-20151218-darcs/hu.dwim.walker.test.asd: COMPILE-FILE-ERROR while compiling #<cl-source-file "hu.dwim.asdf" "source" "package">
(LOAD hu.dwim.walker.documentation FAIL) ASDF/FIND-SYSTEM:LOAD-SYSTEM-DEFINITION-ERROR : Error while trying to load definition for system hu.dwim.walker.documentation from pathname /home/testgrid/cl-test-grid/work-dir/agent/quicklisp/dists/quicklisp/software/hu.dwim.walker-20151218-darcs/hu.dwim.walker.documentation.asd: COMPILE-FILE-ERROR while compiling #<cl-source-file "hu.dwim.asdf" "source" "package">
(LOAD hu.dwim.walker FAIL) ASDF/FIND-SYSTEM:LOAD-SYSTEM-DEFINITION-ERROR : Error while trying to load definition for system hu.dwim.walker from pathname /home/testgrid/cl-test-grid/work-dir/agent/quicklisp/dists/quicklisp/software/hu.dwim.walker-20151218-darcs/hu.dwim.walker.asd: COMPILE-FILE-ERROR while compiling #<cl-source-file "hu.dwim.asdf" "source" "package">
(WHOLE-TEST-SUITE FAIL) ASDF/FIND-SYSTEM:LOAD-SYSTEM-DEFINITION-ERROR : Error while trying to load definition for system hu.dwim.walker.test from pathname /home/testgrid/cl-test-grid/work-dir/agent/quicklisp/dists/quicklisp/software/hu.dwim.walker-20151218-darcs/hu.dwim.walker.test.asd: COMPILE-FILE-ERROR while compiling #<cl-source-file "hu.dwim.asdf" "source" "package">
ecl-16.0.0-98fc12d3-linux-i686-bytecode
(LOAD hu.dwim.walker.test FAIL) ASDF/FIND-SYSTEM:LOAD-SYSTEM-DEFINITION-ERROR : Error while trying to load definition for system iolib from pathname /home/testgrid/cl-test-grid/work-dir/agent/quicklisp/dists/quicklisp/software/iolib-v0.8.3/iolib.asd: The variable C::*CC-FLAGS* is unbound.
(LOAD hu.dwim.walker.documentation FAIL) ASDF/FIND-SYSTEM:LOAD-SYSTEM-DEFINITION-ERROR : Error while trying to load definition for system iolib from pathname /home/testgrid/cl-test-grid/work-dir/agent/quicklisp/dists/quicklisp/software/iolib-v0.8.3/iolib.asd: The variable C::*CC-FLAGS* is unbound.
(WHOLE-TEST-SUITE FAIL) ASDF/FIND-SYSTEM:LOAD-SYSTEM-DEFINITION-ERROR : Error while trying to load definition for system iolib from pathname /home/testgrid/cl-test-grid/work-dir/agent/quicklisp/dists/quicklisp/software/iolib-v0.8.3/iolib.asd: The variable C::*CC-FLAGS* is unbound.
ecl-16.0.0-98fc12d3-linux-i686-lisp-to-c
(LOAD hu.dwim.walker.test FAIL) UIOP/LISP-BUILD:COMPILE-FILE-ERROR : COMPILE-FILE-ERROR while compiling #<hu.dwim.cl-source-file "hu.dwim.walker" "source" "infrastructure">
(LOAD hu.dwim.walker.documentation FAIL) UIOP/LISP-BUILD:COMPILE-FILE-ERROR : COMPILE-FILE-ERROR while compiling #<hu.dwim.cl-source-file "hu.dwim.walker" "source" "infrastructure">
(LOAD hu.dwim.walker FAIL) UIOP/LISP-BUILD:COMPILE-FILE-ERROR : COMPILE-FILE-ERROR while compiling #<hu.dwim.cl-source-file "hu.dwim.walker" "source" "infrastructure">
(WHOLE-TEST-SUITE FAIL) COMMON-LISP:FILE-ERROR : Filesystem error with pathname #P"/home/testgrid/cl-test-grid... Either 1) the file does not exist, or 2) we are not allowed to access the file, or 3) the pathname points to a broken symbolic link.
ecl-16.1.2-unknown-linux-x86-bytecode
(LOAD hu.dwim.walker.test FAIL) ASDF/FIND-SYSTEM:LOAD-SYSTEM-DEFINITION-ERROR : Error while trying to load definition for system iolib from pathname /home/testgrid/cl-test-grid/work-dir/agent/quicklisp/dists/quicklisp/software/iolib-v0.8.3/iolib.asd: The variable C::*CC-FLAGS* is unbound.
(LOAD hu.dwim.walker.documentation FAIL) ASDF/FIND-SYSTEM:LOAD-SYSTEM-DEFINITION-ERROR : Error while trying to load definition for system iolib from pathname /home/testgrid/cl-test-grid/work-dir/agent/quicklisp/dists/quicklisp/software/iolib-v0.8.3/iolib.asd: The variable C::*CC-FLAGS* is unbound.
(WHOLE-TEST-SUITE FAIL) ASDF/FIND-SYSTEM:LOAD-SYSTEM-DEFINITION-ERROR : Error while trying to load definition for system iolib from pathname /home/testgrid/cl-test-grid/work-dir/agent/quicklisp/dists/quicklisp/software/iolib-v0.8.3/iolib.asd: The variable C::*CC-FLAGS* is unbound.
(LOAD hu.dwim.walker.test FAIL) ASDF/FIND-SYSTEM:LOAD-SYSTEM-DEFINITION-ERROR : Error while trying to load definition for system iolib from pathname /home/testgrid/cl-test-grid/work-dir/agent/quicklisp/dists/quicklisp/software/iolib-v0.8.3/iolib.asd: The variable C::*CC-FLAGS* is unbound.
(LOAD hu.dwim.walker.documentation FAIL) ASDF/FIND-SYSTEM:LOAD-SYSTEM-DEFINITION-ERROR : Error while trying to load definition for system iolib from pathname /home/testgrid/cl-test-grid/work-dir/agent/quicklisp/dists/quicklisp/software/iolib-v0.8.3/iolib.asd: The variable C::*CC-FLAGS* is unbound.
(WHOLE-TEST-SUITE FAIL) ASDF/FIND-SYSTEM:LOAD-SYSTEM-DEFINITION-ERROR : Error while trying to load definition for system iolib from pathname /home/testgrid/cl-test-grid/work-dir/agent/quicklisp/dists/quicklisp/software/iolib-v0.8.3/iolib.asd: The variable C::*CC-FLAGS* is unbound.
ecl-16.1.2-unknown-linux-x86-lisp-to-c
(LOAD hu.dwim.walker.test FAIL) UIOP/LISP-BUILD:COMPILE-FILE-ERROR : COMPILE-FILE-ERROR while compiling #<hu.dwim.cl-source-file "hu.dwim.walker" "source" "infrastructure">
(LOAD hu.dwim.walker.documentation FAIL) UIOP/LISP-BUILD:COMPILE-FILE-ERROR : COMPILE-FILE-ERROR while compiling #<hu.dwim.cl-source-file "hu.dwim.walker" "source" "infrastructure">
(LOAD hu.dwim.walker FAIL) UIOP/LISP-BUILD:COMPILE-FILE-ERROR : COMPILE-FILE-ERROR while compiling #<hu.dwim.cl-source-file "hu.dwim.walker" "source" "infrastructure">
(WHOLE-TEST-SUITE FAIL) COMMON-LISP:FILE-ERROR : Filesystem error with pathname #P"/home/testgrid/cl-test-grid... Either 1) the file does not exist, or 2) we are not allowed to access the file, or 3) the pathname points to a broken symbolic link.
(LOAD hu.dwim.walker.test FAIL) UIOP/LISP-BUILD:COMPILE-FILE-ERROR : COMPILE-FILE-ERROR while compiling #<hu.dwim.cl-source-file "hu.dwim.walker" "source" "infrastructure">
(LOAD hu.dwim.walker.documentation FAIL) UIOP/LISP-BUILD:COMPILE-FILE-ERROR : COMPILE-FILE-ERROR while compiling #<hu.dwim.cl-source-file "hu.dwim.walker" "source" "infrastructure">
(LOAD hu.dwim.walker FAIL) UIOP/LISP-BUILD:COMPILE-FILE-ERROR : COMPILE-FILE-ERROR while compiling #<hu.dwim.cl-source-file "hu.dwim.walker" "source" "infrastructure">
(WHOLE-TEST-SUITE FAIL) COMMON-LISP:FILE-ERROR : Filesystem error with pathname #P"/home/testgrid/cl-test-grid... Either 1) the file does not exist, or 2) we are not allowed to access the file, or 3) the pathname points to a broken symbolic link.
sbcl-1.0.58-linux-x86
(LOAD hu.dwim.walker.test FAIL) ASDF:LOAD-SYSTEM-DEFINITION-ERROR : Error while trying to load definition for system hu.dwim.walker.test from pathname /home/testgrid/cl-test-grid/work-dir/agent/quicklisp/dists/quicklisp/software/hu.dwim.walker-20151218-darcs/hu.dwim.walker.test.asd: Error while invoking #<COMPILE-OP NIL {B14B799}> on #<CL-SOURCE-FILE "uiop" "image">
(LOAD hu.dwim.walker.documentation FAIL) ASDF:LOAD-SYSTEM-DEFINITION-ERROR : Error while trying to load definition for system hu.dwim.walker.documentation from pathname /home/testgrid/cl-test-grid/work-dir/agent/quicklisp/dists/quicklisp/software/hu.dwim.walker-20151218-darcs/hu.dwim.walker.documentation.asd: Error while invoking #<COMPILE-OP NIL {B14C799}> on #<CL-SOURCE-FILE "uiop" "image">
(LOAD hu.dwim.walker FAIL) ASDF:LOAD-SYSTEM-DEFINITION-ERROR : Error while trying to load definition for system hu.dwim.walker from pathname /home/testgrid/cl-test-grid/work-dir/agent/quicklisp/dists/quicklisp/software/hu.dwim.walker-20151218-darcs/hu.dwim.walker.asd: Error while invoking #<COMPILE-OP NIL {B14E799}> on #<CL-SOURCE-FILE "uiop" "image">
(WHOLE-TEST-SUITE FAIL) ASDF:LOAD-SYSTEM-DEFINITION-ERROR : Error while trying to load definition for system hu.dwim.walker.test from pathname /home/testgrid/cl-test-grid/work-dir/agent/quicklisp/dists/quicklisp/software/hu.dwim.walker-20151218-darcs/hu.dwim.walker.test.asd: Error while invoking #<COMPILE-OP NIL {B834271}> on #<CL-SOURCE-FILE "uiop" "image">
sbcl-1.1.11-linux-x86
(LOAD hu.dwim.walker.test FAIL) needs newer ASDF, ASDF/FIND-SYSTEM:LOAD-SYSTEM-DEFINITION-ERROR : Error while trying to load definition for system hu.dwim.walker.test from pathname /home/testgrid/cl-test-grid/work-dir/agent/quicklisp/dists/quicklisp/software/hu.dwim.walker-20151218-darcs/hu.dwim.walker.test.asd: no symbol named "NON-PROPAGATING-OPERATION" in "ASDF/INTERFACE"
(LOAD hu.dwim.walker.documentation FAIL) needs newer ASDF, ASDF/FIND-SYSTEM:LOAD-SYSTEM-DEFINITION-ERROR : Error while trying to load definition for system hu.dwim.walker.documentation from pathname /home/testgrid/cl-test-grid/work-dir/agent/quicklisp/dists/quicklisp/software/hu.dwim.walker-20151218-darcs/hu.dwim.walker.documentation.asd: no symbol named "NON-PROPAGATING-OPERATION" in "ASDF/INTERFACE"
(LOAD hu.dwim.walker FAIL) needs newer ASDF, ASDF/FIND-SYSTEM:LOAD-SYSTEM-DEFINITION-ERROR : Error while trying to load definition for system hu.dwim.walker from pathname /home/testgrid/cl-test-grid/work-dir/agent/quicklisp/dists/quicklisp/software/hu.dwim.walker-20151218-darcs/hu.dwim.walker.asd: no symbol named "NON-PROPAGATING-OPERATION" in "ASDF/INTERFACE"
(WHOLE-TEST-SUITE FAIL) needs newer ASDF, ASDF/FIND-SYSTEM:LOAD-SYSTEM-DEFINITION-ERROR : Error while trying to load definition for system hu.dwim.walker.test from pathname /home/testgrid/cl-test-grid/work-dir/agent/quicklisp/dists/quicklisp/software/hu.dwim.walker-20151218-darcs/hu.dwim.walker.test.asd: no symbol named "NON-PROPAGATING-OPERATION" in "ASDF/INTERFACE"
sbcl-1.1.16-linux-x86
(LOAD hu.dwim.walker.test FAIL) needs newer ASDF, ASDF/FIND-SYSTEM:LOAD-SYSTEM-DEFINITION-ERROR : Error while trying to load definition for system hu.dwim.walker.test from pathname /home/testgrid/cl-test-grid/work-dir/agent/quicklisp/dists/quicklisp/software/hu.dwim.walker-20151218-darcs/hu.dwim.walker.test.asd: no symbol named "NON-PROPAGATING-OPERATION" in "ASDF/INTERFACE"
(LOAD hu.dwim.walker.documentation FAIL) needs newer ASDF, ASDF/FIND-SYSTEM:LOAD-SYSTEM-DEFINITION-ERROR : Error while trying to load definition for system hu.dwim.walker.documentation from pathname /home/testgrid/cl-test-grid/work-dir/agent/quicklisp/dists/quicklisp/software/hu.dwim.walker-20151218-darcs/hu.dwim.walker.documentation.asd: no symbol named "NON-PROPAGATING-OPERATION" in "ASDF/INTERFACE"
(LOAD hu.dwim.walker FAIL) needs newer ASDF, ASDF/FIND-SYSTEM:LOAD-SYSTEM-DEFINITION-ERROR : Error while trying to load definition for system hu.dwim.walker from pathname /home/testgrid/cl-test-grid/work-dir/agent/quicklisp/dists/quicklisp/software/hu.dwim.walker-20151218-darcs/hu.dwim.walker.asd: no symbol named "NON-PROPAGATING-OPERATION" in "ASDF/INTERFACE"
(WHOLE-TEST-SUITE FAIL) needs newer ASDF, ASDF/FIND-SYSTEM:LOAD-SYSTEM-DEFINITION-ERROR : Error while trying to load definition for system hu.dwim.walker.test from pathname /home/testgrid/cl-test-grid/work-dir/agent/quicklisp/dists/quicklisp/software/hu.dwim.walker-20151218-darcs/hu.dwim.walker.test.asd: no symbol named "NON-PROPAGATING-OPERATION" in "ASDF/INTERFACE"
sbcl-1.2.6-linux-x86
(LOAD hu.dwim.walker.documentation FAIL) ffi, CFFI:LOAD-FOREIGN-LIBRARY-ERROR : Unable to load any of the alternatives: ("libgvc.so" "libgvc.so.4" "libgvc32.so.4")
(WHOLE-TEST-SUITE FAIL) SB-INT:SIMPLE-FILE-ERROR : Couldn't load #P"/home/testgrid/cl-test-grid/work-dir/agent/test-runs/20180419025427-sbcl-1.2.6-linux-x86/fasl/test-grid/work-dir/agent/quicklisp/dists/quicklisp/software/iolib-v0.8.3/src/syscalls/ffi-types-unix.fasl": file does not exist.
sbcl-1.3.12-linux-arm
(LOAD hu.dwim.walker.test FAIL) COMMON-LISP:SIMPLE-ERROR : Couldn't execute "g++": No such file or directory
(LOAD hu.dwim.walker.documentation FAIL) COMMON-LISP:SIMPLE-ERROR : Couldn't execute "g++": No such file or directory
(WHOLE-TEST-SUITE FAIL) COMMON-LISP:SIMPLE-ERROR : Couldn't execute "g++": No such file or directory
sbcl-1.3.12-linux-x86
(LOAD hu.dwim.walker.documentation FAIL) ffi, CFFI:LOAD-FOREIGN-LIBRARY-ERROR : Unable to load any of the alternatives: ("libgvc.so" "libgvc.so.4" "libgvc32.so.4")
(WHOLE-TEST-SUITE FAIL) SB-INT:SIMPLE-FILE-ERROR : Couldn't load #P"/home/testgrid/cl-test-grid/work-dir/agent/test-runs/20180419001131-sbcl-1.3.12-linux-x86/fasl/test-grid/work-dir/agent/quicklisp/dists/quicklisp/software/iolib-v0.8.3/src/syscalls/ffi-types-unix.fasl": file does not exist.
sbcl-1.3.17-linux-x86
(LOAD hu.dwim.walker.documentation FAIL) ffi, CFFI:LOAD-FOREIGN-LIBRARY-ERROR : Unable to load any of the alternatives: ("libgvc.so" "libgvc.so.4" "libgvc32.so.4")
(WHOLE-TEST-SUITE FAIL) SB-INT:SIMPLE-FILE-ERROR : Couldn't load #P"/home/testgrid/cl-test-grid/work-dir/agent/test-runs/20180418213053-sbcl-1.3.17-linux-x86/fasl/test-grid/work-dir/agent/quicklisp/dists/quicklisp/software/iolib-v0.8.3/src/syscalls/ffi-types-unix.fasl": file does not exist.
sbcl-1.3.2.92-4077405-dirty-linux-arm
(LOAD hu.dwim.walker.test FAIL) IOLIB/GROVEL::GROVEL-ERROR : External process exited with code 1. Command was: "g++" "-marm" "-Wno-write-strings" "-I/home/testgrid/cl-test-grid/work-dir/agent/quicklisp/dists/quicklisp/software/iolib-v0.8.3/src/grovel/" "-o" "/home/testgrid/cl-test-grid/work-dir/agent/test-runs/20180502085547-sbcl-1.3.2.92-4077405-dirty-linux-arm/fasl/ql/dists/quicklisp/software/iolib-v0.8.3/src/syscalls/ffi-types-unix" "/home/testgrid/cl-test-grid/work-dir/agent/test-runs/20180502085547-sbcl-1.3.2.92-4077405-dirty-linux-arm/fasl/ql/dists/quicklisp/software/iolib-v0.8.3/src/syscalls/ffi-types-unix.c" Output was: Error output was: /home/testgrid/cl-test-grid/work-dir/agent/test-runs/20180502085547-sbcl-1.3.2.92-4077405-dirty-linux-arm/fasl/ql/dists/quicklisp/software/iolib-v0.8.3/src/syscalls/ffi-types-unix.c:14:17: fatal error: lfp.h: No such file or directory compilation terminated.
(LOAD hu.dwim.walker.documentation FAIL) IOLIB/GROVEL::GROVEL-ERROR : External process exited with code 1. Command was: "g++" "-marm" "-Wno-write-strings" "-I/home/testgrid/cl-test-grid/work-dir/agent/quicklisp/dists/quicklisp/software/iolib-v0.8.3/src/grovel/" "-o" "/home/testgrid/cl-test-grid/work-dir/agent/test-runs/20180502085547-sbcl-1.3.2.92-4077405-dirty-linux-arm/fasl/ql/dists/quicklisp/software/iolib-v0.8.3/src/syscalls/ffi-types-unix" "/home/testgrid/cl-test-grid/work-dir/agent/test-runs/20180502085547-sbcl-1.3.2.92-4077405-dirty-linux-arm/fasl/ql/dists/quicklisp/software/iolib-v0.8.3/src/syscalls/ffi-types-unix.c" Output was: Error output was: /home/testgrid/cl-test-grid/work-dir/agent/test-runs/20180502085547-sbcl-1.3.2.92-4077405-dirty-linux-arm/fasl/ql/dists/quicklisp/software/iolib-v0.8.3/src/syscalls/ffi-types-unix.c:14:17: fatal error: lfp.h: No such file or directory compilation terminated.
(WHOLE-TEST-SUITE FAIL) IOLIB/GROVEL::GROVEL-ERROR : External process exited with code 1. Command was: "g++" "-marm" "-Wno-write-strings" "-I/home/testgrid/cl-test-grid/work-dir/agent/quicklisp/dists/quicklisp/software/iolib-v0.8.3/src/grovel/" "-o" "/home/testgrid/cl-test-grid/w... "/home/testgrid/cl-test-grid/w... Output was: Error output was: /home/testgrid/cl-test-grid/wo... fatal error: lfp.h: No such file or directory compilation terminated.
(LOAD hu.dwim.walker.test FAIL) IOLIB/GROVEL::GROVEL-ERROR : External process exited with code 1. Command was: "g++" "-marm" "-Wno-write-strings" "-I/home/testgrid/cl-test-grid/work-dir/agent/quicklisp/dists/quicklisp/software/iolib-v0.8.3/src/grovel/" "-o" "/home/testgrid/cl-test-grid/work-dir/agent/test-runs/20180402085142-sbcl-1.3.2.92-4077405-dirty-linux-arm/fasl/ql/dists/quicklisp/software/iolib-v0.8.3/src/syscalls/ffi-types-unix" "/home/testgrid/cl-test-grid/work-dir/agent/test-runs/20180402085142-sbcl-1.3.2.92-4077405-dirty-linux-arm/fasl/ql/dists/quicklisp/software/iolib-v0.8.3/src/syscalls/ffi-types-unix.c" Output was: Error output was: /home/testgrid/cl-test-grid/work-dir/agent/test-runs/20180402085142-sbcl-1.3.2.92-4077405-dirty-linux-arm/fasl/ql/dists/quicklisp/software/iolib-v0.8.3/src/syscalls/ffi-types-unix.c:14:17: fatal error: lfp.h: No such file or directory compilation terminated.
(LOAD hu.dwim.walker.documentation FAIL) IOLIB/GROVEL::GROVEL-ERROR : External process exited with code 1. Command was: "g++" "-marm" "-Wno-write-strings" "-I/home/testgrid/cl-test-grid/work-dir/agent/quicklisp/dists/quicklisp/software/iolib-v0.8.3/src/grovel/" "-o" "/home/testgrid/cl-test-grid/work-dir/agent/test-runs/20180402085142-sbcl-1.3.2.92-4077405-dirty-linux-arm/fasl/ql/dists/quicklisp/software/iolib-v0.8.3/src/syscalls/ffi-types-unix" "/home/testgrid/cl-test-grid/work-dir/agent/test-runs/20180402085142-sbcl-1.3.2.92-4077405-dirty-linux-arm/fasl/ql/dists/quicklisp/software/iolib-v0.8.3/src/syscalls/ffi-types-unix.c" Output was: Error output was: /home/testgrid/cl-test-grid/work-dir/agent/test-runs/20180402085142-sbcl-1.3.2.92-4077405-dirty-linux-arm/fasl/ql/dists/quicklisp/software/iolib-v0.8.3/src/syscalls/ffi-types-unix.c:14:17: fatal error: lfp.h: No such file or directory compilation terminated.
(WHOLE-TEST-SUITE FAIL) IOLIB/GROVEL::GROVEL-ERROR : External process exited with code 1. Command was: "g++" "-marm" "-Wno-write-strings" "-I/home/testgrid/cl-test-grid/work-dir/agent/quicklisp/dists/quicklisp/software/iolib-v0.8.3/src/grovel/" "-o" "/home/testgrid/cl-test-grid/w... "/home/testgrid/cl-test-grid/w... Output was: Error output was: /home/testgrid/cl-test-grid/wo... fatal error: lfp.h: No such file or directory compilation terminated.
sbcl-1.3.20-linux-x86
(LOAD hu.dwim.walker.documentation FAIL) ffi, CFFI:LOAD-FOREIGN-LIBRARY-ERROR : Unable to load any of the alternatives: ("libgvc.so" "libgvc.so.4" "libgvc32.so.4")
(WHOLE-TEST-SUITE FAIL) SB-INT:SIMPLE-FILE-ERROR : Couldn't load #P"/home/testgrid/cl-test-grid/work-dir/agent/test-runs/20180418184759-sbcl-1.3.20-linux-x86/fasl/test-grid/work-dir/agent/quicklisp/dists/quicklisp/software/iolib-v0.8.3/src/syscalls/ffi-types-unix.fasl": file does not exist.
sbcl-1.3.21-linux-x86
(LOAD hu.dwim.walker.documentation FAIL) ffi, CFFI:LOAD-FOREIGN-LIBRARY-ERROR : Unable to load any of the alternatives: ("libgvc.so" "libgvc.so.4" "libgvc32.so.4")
(WHOLE-TEST-SUITE FAIL) SB-INT:SIMPLE-FILE-ERROR : Couldn't load #P"/home/testgrid/cl-test-grid/work-dir/agent/test-runs/20180509154017-sbcl-1.3.21-linux-x86/fasl/test-grid/work-dir/agent/quicklisp/dists/quicklisp/software/iolib-v0.8.3/src/syscalls/ffi-types-unix.fasl": file does not exist.
(LOAD hu.dwim.walker.documentation FAIL) ffi, CFFI:LOAD-FOREIGN-LIBRARY-ERROR : Unable to load any of the alternatives: ("libgvc.so" "libgvc.so.4" "libgvc32.so.4")
(WHOLE-TEST-SUITE FAIL) SB-INT:SIMPLE-FILE-ERROR : Couldn't load #P"/home/testgrid/cl-test-grid/work-dir/agent/test-runs/20180412235716-sbcl-1.3.21-linux-x86/fasl/test-grid/work-dir/agent/quicklisp/dists/quicklisp/software/iolib-v0.8.3/src/syscalls/ffi-types-unix.fasl": file does not exist.

Breakdown by testcases: for every failed testcase the lisp implmentations it fails on

There are no failed tescases.

To reports overview

Generated at: 2018-05-11 23:34:49 GMT.