hu.dwim.util results collected by cl-test-grid

Results on the last two Quicklisp distributions

 quicklisp 2018-01-31quicklisp 2017-12-27
abcl-1.2.1-fasl42-linux-x86
(LOAD hu.dwim.util.test FAIL) needs newer ASDF, ASDF/FIND-SYSTEM:LOAD-SYSTEM-DEFINITION-ERROR : Error while trying to load definition for system hu.dwim.util.test from pathname /home/testgrid/cl-test-grid/work-dir/agent/quicklisp/dists/quicklisp/software/hu.dwim.util-20171019-darcs/hu.dwim.util.test.asd: The symbol NON-PROPAGATING-OPERATION is not present in package ASDF/INTERFACE.
(LOAD hu.dwim.util.documentation FAIL) needs newer ASDF, ASDF/FIND-SYSTEM:LOAD-SYSTEM-DEFINITION-ERROR : Error while trying to load definition for system hu.dwim.util.documentation from pathname /home/testgrid/cl-test-grid/work-dir/agent/quicklisp/dists/quicklisp/software/hu.dwim.util-20171019-darcs/hu.dwim.util.documentation.asd: The symbol NON-PROPAGATING-OPERATION is not present in package ASDF/INTERFACE.
(LOAD hu.dwim.util+iolib FAIL) needs newer ASDF, ASDF/FIND-SYSTEM:LOAD-SYSTEM-DEFINITION-ERROR : Error while trying to load definition for system hu.dwim.util+iolib from pathname /home/testgrid/cl-test-grid/work-dir/agent/quicklisp/dists/quicklisp/software/hu.dwim.util-20171019-darcs/hu.dwim.util+iolib.asd: The symbol NON-PROPAGATING-OPERATION is not present in package ASDF/INTERFACE.
(LOAD hu.dwim.util FAIL) needs newer ASDF, ASDF/FIND-SYSTEM:LOAD-SYSTEM-DEFINITION-ERROR : Error while trying to load definition for system hu.dwim.util from pathname /home/testgrid/cl-test-grid/work-dir/agent/quicklisp/dists/quicklisp/software/hu.dwim.util-20171019-darcs/hu.dwim.util.asd: The symbol NON-PROPAGATING-OPERATION is not present in package ASDF/INTERFACE.
(LOAD hu.dwim.util.test FAIL) needs newer ASDF, ASDF/FIND-SYSTEM:LOAD-SYSTEM-DEFINITION-ERROR : Error while trying to load definition for system hu.dwim.util.test from pathname /home/testgrid/cl-test-grid/work-dir/agent/quicklisp/dists/quicklisp/software/hu.dwim.util-20171019-darcs/hu.dwim.util.test.asd: The symbol NON-PROPAGATING-OPERATION is not present in package ASDF/INTERFACE.
(LOAD hu.dwim.util.documentation FAIL) needs newer ASDF, ASDF/FIND-SYSTEM:LOAD-SYSTEM-DEFINITION-ERROR : Error while trying to load definition for system hu.dwim.util.documentation from pathname /home/testgrid/cl-test-grid/work-dir/agent/quicklisp/dists/quicklisp/software/hu.dwim.util-20171019-darcs/hu.dwim.util.documentation.asd: The symbol NON-PROPAGATING-OPERATION is not present in package ASDF/INTERFACE.
(LOAD hu.dwim.util+iolib FAIL) needs newer ASDF, ASDF/FIND-SYSTEM:LOAD-SYSTEM-DEFINITION-ERROR : Error while trying to load definition for system hu.dwim.util+iolib from pathname /home/testgrid/cl-test-grid/work-dir/agent/quicklisp/dists/quicklisp/software/hu.dwim.util-20171019-darcs/hu.dwim.util+iolib.asd: The symbol NON-PROPAGATING-OPERATION is not present in package ASDF/INTERFACE.
(LOAD hu.dwim.util FAIL) needs newer ASDF, ASDF/FIND-SYSTEM:LOAD-SYSTEM-DEFINITION-ERROR : Error while trying to load definition for system hu.dwim.util from pathname /home/testgrid/cl-test-grid/work-dir/agent/quicklisp/dists/quicklisp/software/hu.dwim.util-20171019-darcs/hu.dwim.util.asd: The symbol NON-PROPAGATING-OPERATION is not present in package ASDF/INTERFACE.
abcl-1.3.0-fasl42-linux-x86
(LOAD hu.dwim.util.test FAIL) ASDF/FIND-SYSTEM:LOAD-SYSTEM-DEFINITION-ERROR : Error while trying to load definition for system cffi-libffi from pathname /home/testgrid/cl-test-grid/work-dir/agent/quicklisp/dists/quicklisp/software/cffi_0.19.0/cffi-libffi.asd: Component "asdf" does not match version 3.1.2, required by #<SYSTEM "cffi-toolchain">
(LOAD hu.dwim.util.documentation FAIL) ASDF/FIND-SYSTEM:LOAD-SYSTEM-DEFINITION-ERROR : Error while trying to load definition for system cffi-libffi from pathname /home/testgrid/cl-test-grid/work-dir/agent/quicklisp/dists/quicklisp/software/cffi_0.19.0/cffi-libffi.asd: Component "asdf" does not match version 3.1.2, required by #<SYSTEM "cffi-toolchain">
(LOAD hu.dwim.util.test FAIL) ASDF/FIND-SYSTEM:LOAD-SYSTEM-DEFINITION-ERROR : Error while trying to load definition for system cffi-libffi from pathname /home/testgrid/cl-test-grid/work-dir/agent/quicklisp/dists/quicklisp/software/cffi_0.19.0/cffi-libffi.asd: Component "asdf" does not match version 3.1.2, required by #<SYSTEM "cffi-toolchain">
(LOAD hu.dwim.util.documentation FAIL) ASDF/FIND-SYSTEM:LOAD-SYSTEM-DEFINITION-ERROR : Error while trying to load definition for system cffi-libffi from pathname /home/testgrid/cl-test-grid/work-dir/agent/quicklisp/dists/quicklisp/software/cffi_0.19.0/cffi-libffi.asd: Component "asdf" does not match version 3.1.2, required by #<SYSTEM "cffi-toolchain">
abcl-1.3.1-fasl42-linux-x86
(LOAD hu.dwim.util.test FAIL) ASDF/FIND-SYSTEM:LOAD-SYSTEM-DEFINITION-ERROR : Error while trying to load definition for system cffi-libffi from pathname /home/testgrid/cl-test-grid/work-dir/agent/quicklisp/dists/quicklisp/software/cffi_0.19.0/cffi-libffi.asd: Component "asdf" does not match version 3.1.2, required by #<SYSTEM "cffi-toolchain">
(LOAD hu.dwim.util.documentation FAIL) ASDF/FIND-SYSTEM:LOAD-SYSTEM-DEFINITION-ERROR : Error while trying to load definition for system cffi-libffi from pathname /home/testgrid/cl-test-grid/work-dir/agent/quicklisp/dists/quicklisp/software/cffi_0.19.0/cffi-libffi.asd: Component "asdf" does not match version 3.1.2, required by #<SYSTEM "cffi-toolchain">
(LOAD hu.dwim.util.test FAIL) ASDF/FIND-SYSTEM:LOAD-SYSTEM-DEFINITION-ERROR : Error while trying to load definition for system cffi-libffi from pathname /home/testgrid/cl-test-grid/work-dir/agent/quicklisp/dists/quicklisp/software/cffi_0.19.0/cffi-libffi.asd: Component "asdf" does not match version 3.1.2, required by #<SYSTEM "cffi-toolchain">
(LOAD hu.dwim.util.documentation FAIL) ASDF/FIND-SYSTEM:LOAD-SYSTEM-DEFINITION-ERROR : Error while trying to load definition for system cffi-libffi from pathname /home/testgrid/cl-test-grid/work-dir/agent/quicklisp/dists/quicklisp/software/cffi_0.19.0/cffi-libffi.asd: Component "asdf" does not match version 3.1.2, required by #<SYSTEM "cffi-toolchain">
abcl-1.3.2-fasl42-linux-x86
(LOAD hu.dwim.util.test FAIL) COMMON-LISP:SIMPLE-ERROR : This is not implemented for your lisp, sorry. You may try to continue, but...
(LOAD hu.dwim.util.documentation FAIL) ffi, CFFI:LOAD-FOREIGN-LIBRARY-ERROR : Unable to load any of the alternatives: ("libgvc.so" "libgvc.so.4" "libgvc32.so.4")
(LOAD hu.dwim.util.test FAIL) COMMON-LISP:SIMPLE-ERROR : This is not implemented for your lisp, sorry. You may try to continue, but...
(LOAD hu.dwim.util.documentation FAIL) ffi, CFFI:LOAD-FOREIGN-LIBRARY-ERROR : Unable to load any of the alternatives: ("libgvc.so" "libgvc.so.4" "libgvc32.so.4")
abcl-1.3.3-fasl42-macosx-x64
(LOAD hu.dwim.util.test FAIL) ASDF/FIND-SYSTEM:LOAD-SYSTEM-DEFINITION-ERROR : Error while trying to load definition for system iolib from pathname /Volumes/Transcend/testgrid/cl-test-grid/work-dir/agent/quicklisp/dists/quicklisp/software/iolib-v0.8.3/iolib.asd: Java exception 'java.lang.ClassNotFoundException: com.sun.jna.Native'.
(LOAD hu.dwim.util.documentation FAIL) ASDF/FIND-SYSTEM:LOAD-SYSTEM-DEFINITION-ERROR : Error while trying to load definition for system iolib from pathname /Volumes/Transcend/testgrid/cl-test-grid/work-dir/agent/quicklisp/dists/quicklisp/software/iolib-v0.8.3/iolib.asd: Java exception 'java.lang.ClassNotFoundException: com.sun.jna.Native'.
(LOAD hu.dwim.util+iolib FAIL) ASDF/FIND-SYSTEM:LOAD-SYSTEM-DEFINITION-ERROR : Error while trying to load definition for system iolib from pathname /Volumes/Transcend/testgrid/cl-test-grid/work-dir/agent/quicklisp/dists/quicklisp/software/iolib-v0.8.3/iolib.asd: Java exception 'java.lang.ClassNotFoundException: com.sun.jna.Native'.
abcl-1.4.0-fasl42-linux-x86
(LOAD hu.dwim.util.test FAIL) ASDF/FIND-SYSTEM:LOAD-SYSTEM-DEFINITION-ERROR : Error while trying to load definition for system iolib from pathname /home/testgrid/cl-test-grid/work-dir/agent/quicklisp/dists/quicklisp/software/iolib-v0.8.3/iolib.asd: org.armedbear.lisp.Go
(LOAD hu.dwim.util.documentation FAIL) ASDF/FIND-SYSTEM:LOAD-SYSTEM-DEFINITION-ERROR : Error while trying to load definition for system iolib from pathname /home/testgrid/cl-test-grid/work-dir/agent/quicklisp/dists/quicklisp/software/iolib-v0.8.3/iolib.asd: org.armedbear.lisp.Go
(LOAD hu.dwim.util+iolib FAIL) ASDF/FIND-SYSTEM:LOAD-SYSTEM-DEFINITION-ERROR : Error while trying to load definition for system iolib from pathname /home/testgrid/cl-test-grid/work-dir/agent/quicklisp/dists/quicklisp/software/iolib-v0.8.3/iolib.asd: org.armedbear.lisp.Go
(LOAD hu.dwim.util.test FAIL) ASDF/FIND-SYSTEM:LOAD-SYSTEM-DEFINITION-ERROR : Error while trying to load definition for system iolib from pathname /home/testgrid/cl-test-grid/work-dir/agent/quicklisp/dists/quicklisp/software/iolib-v0.8.3/iolib.asd: org.armedbear.lisp.Go
(LOAD hu.dwim.util.documentation FAIL) ASDF/FIND-SYSTEM:LOAD-SYSTEM-DEFINITION-ERROR : Error while trying to load definition for system iolib from pathname /home/testgrid/cl-test-grid/work-dir/agent/quicklisp/dists/quicklisp/software/iolib-v0.8.3/iolib.asd: org.armedbear.lisp.Go
(LOAD hu.dwim.util+iolib FAIL) ASDF/FIND-SYSTEM:LOAD-SYSTEM-DEFINITION-ERROR : Error while trying to load definition for system iolib from pathname /home/testgrid/cl-test-grid/work-dir/agent/quicklisp/dists/quicklisp/software/iolib-v0.8.3/iolib.asd: org.armedbear.lisp.Go
abcl-1.5.0-fasl43-linux-x86
acl-10.0-linux-x86
(LOAD hu.dwim.util.test FAIL) COMMON-LISP:SIMPLE-ERROR : Attempt to set dispatch macro in system readtable #<readtable @ #x2011feb2>; copy readtable first.
(LOAD hu.dwim.util.documentation FAIL) ffi, CFFI:LOAD-FOREIGN-LIBRARY-ERROR : Unable to load any of the alternatives: ("libgvc.so" "libgvc.so.4" "libgvc32.so.4")
(LOAD hu.dwim.util+iolib FAIL) COMMON-LISP:SIMPLE-ERROR : this platform does not support :unsigned-long-long
(LOAD hu.dwim.util.test FAIL) COMMON-LISP:SIMPLE-ERROR : Attempt to set dispatch macro in system readtable #<readtable @ #x2011feb2>; copy readtable first.
(LOAD hu.dwim.util.documentation FAIL) ffi, CFFI:LOAD-FOREIGN-LIBRARY-ERROR : Unable to load any of the alternatives: ("libgvc.so" "libgvc.so.4" "libgvc32.so.4")
(LOAD hu.dwim.util+iolib FAIL) COMMON-LISP:SIMPLE-ERROR : this platform does not support :unsigned-long-long
acl-10.0m-linux-x86
(LOAD hu.dwim.util.test FAIL) common-lisp:parse-error : Function position must contain a symbol or lambda expression: (NAME :ACCESSOR NAME-OF :INITARG :NAME :TYPE SYMBOL)
(LOAD hu.dwim.util.documentation FAIL) common-lisp:parse-error : Function position must contain a symbol or lambda expression: (NAME :ACCESSOR NAME-OF :INITARG :NAME :TYPE SYMBOL)
(LOAD hu.dwim.util+iolib FAIL) common-lisp:parse-error : Function position must contain a symbol or lambda expression: (NAME :ACCESSOR NAME-OF :INITARG :NAME :TYPE SYMBOL)
(LOAD hu.dwim.util FAIL) common-lisp:parse-error : Function position must contain a symbol or lambda expression: (NAME :ACCESSOR NAME-OF :INITARG :NAME :TYPE SYMBOL)
(LOAD hu.dwim.util.test FAIL) common-lisp:parse-error : Function position must contain a symbol or lambda expression: (NAME :ACCESSOR NAME-OF :INITARG :NAME :TYPE SYMBOL)
(LOAD hu.dwim.util.documentation FAIL) common-lisp:parse-error : Function position must contain a symbol or lambda expression: (NAME :ACCESSOR NAME-OF :INITARG :NAME :TYPE SYMBOL)
(LOAD hu.dwim.util+iolib FAIL) common-lisp:parse-error : Function position must contain a symbol or lambda expression: (NAME :ACCESSOR NAME-OF :INITARG :NAME :TYPE SYMBOL)
(LOAD hu.dwim.util FAIL) common-lisp:parse-error : Function position must contain a symbol or lambda expression: (NAME :ACCESSOR NAME-OF :INITARG :NAME :TYPE SYMBOL)
acl-10.0ms-linux-x86
(LOAD hu.dwim.util.test FAIL) common-lisp:parse-error : Function position must contain a symbol or lambda expression: (NAME :ACCESSOR NAME-OF :INITARG :NAME :TYPE SYMBOL)
(LOAD hu.dwim.util.documentation FAIL) common-lisp:parse-error : Function position must contain a symbol or lambda expression: (NAME :ACCESSOR NAME-OF :INITARG :NAME :TYPE SYMBOL)
(LOAD hu.dwim.util+iolib FAIL) common-lisp:parse-error : Function position must contain a symbol or lambda expression: (NAME :ACCESSOR NAME-OF :INITARG :NAME :TYPE SYMBOL)
(LOAD hu.dwim.util FAIL) common-lisp:parse-error : Function position must contain a symbol or lambda expression: (NAME :ACCESSOR NAME-OF :INITARG :NAME :TYPE SYMBOL)
(LOAD hu.dwim.util.test FAIL) common-lisp:parse-error : Function position must contain a symbol or lambda expression: (NAME :ACCESSOR NAME-OF :INITARG :NAME :TYPE SYMBOL)
(LOAD hu.dwim.util.documentation FAIL) common-lisp:parse-error : Function position must contain a symbol or lambda expression: (NAME :ACCESSOR NAME-OF :INITARG :NAME :TYPE SYMBOL)
(LOAD hu.dwim.util+iolib FAIL) common-lisp:parse-error : Function position must contain a symbol or lambda expression: (NAME :ACCESSOR NAME-OF :INITARG :NAME :TYPE SYMBOL)
(LOAD hu.dwim.util FAIL) common-lisp:parse-error : Function position must contain a symbol or lambda expression: (NAME :ACCESSOR NAME-OF :INITARG :NAME :TYPE SYMBOL)
acl-10.0s-linux-x86
(LOAD hu.dwim.util.test FAIL) COMMON-LISP:SIMPLE-ERROR : Attempt to set dispatch macro in system readtable #<readtable @ #x20121cfa>; copy readtable first.
(LOAD hu.dwim.util.documentation FAIL) ffi, CFFI:LOAD-FOREIGN-LIBRARY-ERROR : Unable to load any of the alternatives: ("libgvc.so" "libgvc.so.4" "libgvc32.so.4")
(LOAD hu.dwim.util+iolib FAIL) COMMON-LISP:SIMPLE-ERROR : this platform does not support :unsigned-long-long
(LOAD hu.dwim.util.test FAIL) COMMON-LISP:SIMPLE-ERROR : Attempt to set dispatch macro in system readtable #<readtable @ #x20121cfa>; copy readtable first.
(LOAD hu.dwim.util.documentation FAIL) ffi, CFFI:LOAD-FOREIGN-LIBRARY-ERROR : Unable to load any of the alternatives: ("libgvc.so" "libgvc.so.4" "libgvc32.so.4")
(LOAD hu.dwim.util+iolib FAIL) COMMON-LISP:SIMPLE-ERROR : this platform does not support :unsigned-long-long
ccl-1.10-r16196-f96-linux-x86
(LOAD hu.dwim.util.test FAIL) CCL::SIMPLE-PROGRAM-ERROR : Incorrect keyword arguments in (:TEST #<Compiled-function EQUAL #x1007AD36> :SYNCHRONIZED T) .
(LOAD hu.dwim.util.documentation FAIL) ffi, CFFI:LOAD-FOREIGN-LIBRARY-ERROR : Unable to load any of the alternatives: ("libgvc.so" "libgvc.so.4" "libgvc32.so.4")
(LOAD hu.dwim.util.test FAIL) CCL::SIMPLE-PROGRAM-ERROR : Incorrect keyword arguments in (:TEST #<Compiled-function EQUAL #x1007AD36> :SYNCHRONIZED T) .
(LOAD hu.dwim.util.documentation FAIL) ffi, CFFI:LOAD-FOREIGN-LIBRARY-ERROR : Unable to load any of the alternatives: ("libgvc.so" "libgvc.so.4" "libgvc32.so.4")
ccl-1.11-5-rv1.11.5-f96-linux-x86
(LOAD hu.dwim.util.test FAIL) CCL::SIMPLE-PROGRAM-ERROR : Incorrect keyword arguments in (:TEST #<Compiled-function EQUAL #x1007A3EE> :SYNCHRONIZED T) .
(LOAD hu.dwim.util.documentation FAIL) ffi, CFFI:LOAD-FOREIGN-LIBRARY-ERROR : Unable to load any of the alternatives: ("libgvc.so" "libgvc.so.4" "libgvc32.so.4")
(LOAD hu.dwim.util.test FAIL) CCL::SIMPLE-PROGRAM-ERROR : Incorrect keyword arguments in (:TEST #<Compiled-function EQUAL #x1007A3EE> :SYNCHRONIZED T) .
(LOAD hu.dwim.util.documentation FAIL) ffi, CFFI:LOAD-FOREIGN-LIBRARY-ERROR : Unable to load any of the alternatives: ("libgvc.so" "libgvc.so.4" "libgvc32.so.4")
ccl-1.11-r16635-f101-linux-arm
(LOAD hu.dwim.util.test FAIL) CCL::SIMPLE-PROGRAM-ERROR : Incorrect keyword arguments in (:TEST #<Compiled-function EQUAL #x140078A6> :SYNCHRONIZED T) .
(LOAD hu.dwim.util.documentation FAIL) ffi, CFFI:LOAD-FOREIGN-LIBRARY-ERROR : Unable to load any of the alternatives: ("libgvc.so" "libgvc.so.4" "libgvc32.so.4")
(LOAD hu.dwim.util+iolib FAIL) IOLIB/GROVEL::GROVEL-ERROR : External process exited with code 71. Command was: "g++" "-marm" "-Wno-write-strings" "-I/home/testgrid/cl-test-grid/work-dir/agent/quicklisp/dists/quicklisp/software/iolib-v0.8.3/src/grovel/" "-o" "/home/testgrid/cl-test-grid/work-dir/agent/test-runs/20180203194046-ccl-1.11-r16635-f101-linux-arm/fasl/ql/dists/quicklisp/software/iolib-v0.8.3/src/syscalls/ffi-types-unix" "/home/testgrid/cl-test-grid/work-dir/agent/test-runs/20180203194046-ccl-1.11-r16635-f101-linux-arm/fasl/ql/dists/quicklisp/software/iolib-v0.8.3/src/syscalls/ffi-types-unix.c" Output was: Error output was:
(LOAD hu.dwim.util.test FAIL) CCL::SIMPLE-PROGRAM-ERROR : Incorrect keyword arguments in (:TEST #<Compiled-function EQUAL #x140078A6> :SYNCHRONIZED T) .
(LOAD hu.dwim.util.documentation FAIL) ffi, CFFI:LOAD-FOREIGN-LIBRARY-ERROR : Unable to load any of the alternatives: ("libgvc.so" "libgvc.so.4" "libgvc32.so.4")
(LOAD hu.dwim.util+iolib FAIL) IOLIB/GROVEL::GROVEL-ERROR : External process exited with code 71. Command was: "g++" "-marm" "-Wno-write-strings" "-I/home/testgrid/cl-test-grid/work-dir/agent/quicklisp/dists/quicklisp/software/iolib-v0.8.3/src/grovel/" "-o" "/home/testgrid/cl-test-grid/work-dir/agent/test-runs/20171230190254-ccl-1.11-r16635-f101-linux-arm/fasl/ql/dists/quicklisp/software/iolib-v0.8.3/src/syscalls/ffi-types-unix" "/home/testgrid/cl-test-grid/work-dir/agent/test-runs/20171230190254-ccl-1.11-r16635-f101-linux-arm/fasl/ql/dists/quicklisp/software/iolib-v0.8.3/src/syscalls/ffi-types-unix.c" Output was: Error output was:
ccl-1.11-r16635-f96-linux-x86
(LOAD hu.dwim.util.test FAIL) #ccl/1157, CCL:NO-APPLICABLE-METHOD-EXISTS : There is no applicable method for the generic function: #<STANDARD-GENERIC-FUNCTION CCL:SLOT-VALUE-USING-CLASS #x18014C66> when called with arguments: (#<STANDARD-CLASS CL-L10N.LDML:LANGUAGE> #<LANGUAGE language #x19AC6C66> 0)
(LOAD hu.dwim.util.documentation FAIL) ffi, CFFI:LOAD-FOREIGN-LIBRARY-ERROR : Unable to load any of the alternatives: ("libgvc.so" "libgvc.so.4" "libgvc32.so.4")
(LOAD hu.dwim.util.test FAIL) #ccl/1157, CCL:NO-APPLICABLE-METHOD-EXISTS : There is no applicable method for the generic function: #<STANDARD-GENERIC-FUNCTION CCL:SLOT-VALUE-USING-CLASS #x18014C66> when called with arguments: (#<STANDARD-CLASS CL-L10N.LDML:LANGUAGE> #<LANGUAGE language #x19ABB8A6> 0)
(LOAD hu.dwim.util.documentation FAIL) ffi, CFFI:LOAD-FOREIGN-LIBRARY-ERROR : Unable to load any of the alternatives: ("libgvc.so" "libgvc.so.4" "libgvc32.so.4")
ccl-1.11-r16635-f96-macosx-x64
(LOAD hu.dwim.util.test FAIL) CCL::SIMPLE-PROGRAM-ERROR : Incorrect keyword arguments in (:TEST #<Compiled-function EQUAL #x300000085B2F> :SYNCHRONIZED T) .
(LOAD hu.dwim.util.documentation FAIL) ffi, CFFI:LOAD-FOREIGN-LIBRARY-ERROR : Unable to load any of the alternatives: ("libgvc.so" "libgvc.so.4" "libgvc32.so.4")
(LOAD hu.dwim.util+iolib FAIL) IOLIB/GROVEL::GROVEL-ERROR : External process exited with code 1. Command was: "g++" "-m64" "-Wno-write-strings" "-I" "/opt/local/include/" "-I/Volumes/Transcend/testgrid/cl-test-grid/work-dir/agent/quicklisp/dists/quicklisp/software/iolib-v0.8.3/src/grovel/" "-o" "/Volumes/Transcend/testgrid/cl-test-grid/work-dir/agent/test-runs/20180114033720-ccl-1.11-r16635-f96-macosx-x64/fasl/ql/dists/quicklisp/software/iolib-v0.8.3/src/syscalls/ffi-types-unix" "/Volumes/Transcend/testgrid/cl-test-grid/work-dir/agent/test-runs/20180114033720-ccl-1.11-r16635-f96-macosx-x64/fasl/ql/dists/quicklisp/software/iolib-v0.8.3/src/syscalls/ffi-types-unix.c" Output was: Error output was: clang: warning: treating 'c' input as 'c++' when in C++ mode, this behavior is deprecated /Volumes/Transcend/testgrid/cl-test-grid/work-dir/agent/test-runs/20180114033720-ccl-1.11-r16635-f96-macosx-x64/fasl/ql/dists/quicklisp/software/iolib-v0.8.3/src/syscalls/ffi-types-unix.c:6:10: fatal error: 'lfp.h' file not found #include <lfp.h> ^ 1 error generated.
ccl-1.11-r16635-f96-macosx-x86
(LOAD hu.dwim.util.test FAIL) #ccl/1157, CCL:NO-APPLICABLE-METHOD-EXISTS : There is no applicable method for the generic function: #<STANDARD-GENERIC-FUNCTION CCL:SLOT-VALUE-USING-CLASS #xC015186> when called with arguments: (#<STANDARD-CLASS CL-L10N.LDML:LANGUAGE> #<LANGUAGE language #xDB0BBF6> 0)
(LOAD hu.dwim.util.documentation FAIL) ffi, CFFI:LOAD-FOREIGN-LIBRARY-ERROR : Unable to load any of the alternatives: ("libgvc.so" "libgvc.so.4" "libgvc32.so.4")
(LOAD hu.dwim.util+iolib FAIL) IOLIB/GROVEL::GROVEL-ERROR : External process exited with code 1. Command was: "g++" "-m32" "-Wno-write-strings" "-I" "/opt/local/include/" "-I/Volumes/Transcend/testgrid/cl-test-grid/work-dir/agent/quicklisp/dists/quicklisp/software/iolib-v0.8.3/src/grovel/" "-o" "/Volumes/Transcend/testgrid/cl-test-grid/work-dir/agent/test-runs/20180113224129-ccl-1.11-r16635-f96-macosx-x86/fasl/ql/dists/quicklisp/software/iolib-v0.8.3/src/syscalls/ffi-types-unix" "/Volumes/Transcend/testgrid/cl-test-grid/work-dir/agent/test-runs/20180113224129-ccl-1.11-r16635-f96-macosx-x86/fasl/ql/dists/quicklisp/software/iolib-v0.8.3/src/syscalls/ffi-types-unix.c" Output was: Error output was: clang: warning: treating 'c' input as 'c++' when in C++ mode, this behavior is deprecated /Volumes/Transcend/testgrid/cl-test-grid/work-dir/agent/test-runs/20180113224129-ccl-1.11-r16635-f96-macosx-x86/fasl/ql/dists/quicklisp/software/iolib-v0.8.3/src/syscalls/ffi-types-unix.c:6:10: fatal error: 'lfp.h' file not found #include <lfp.h> ^ 1 error generated.
ccl-1.8-r15286m-f95-linux-x86
(LOAD hu.dwim.util.test FAIL) needs newer ASDF, ASDF:LOAD-SYSTEM-DEFINITION-ERROR : Error while trying to load definition for system hu.dwim.util.test from pathname /home/testgrid/cl-test-grid/work-dir/agent/quicklisp/dists/quicklisp/software/hu.dwim.util-20171019-darcs/hu\.dwim\.util\.test.asd: Cannot IMPORT "NON-PROPAGATING-OPERATION" from package "ASDF"
(LOAD hu.dwim.util.documentation FAIL) needs newer ASDF, ASDF:LOAD-SYSTEM-DEFINITION-ERROR : Error while trying to load definition for system hu.dwim.util.documentation from pathname /home/testgrid/cl-test-grid/work-dir/agent/quicklisp/dists/quicklisp/software/hu.dwim.util-20171019-darcs/hu\.dwim\.util\.documentation.asd: Cannot IMPORT "NON-PROPAGATING-OPERATION" from package "ASDF"
(LOAD hu.dwim.util+iolib FAIL) needs newer ASDF, ASDF:LOAD-SYSTEM-DEFINITION-ERROR : Error while trying to load definition for system hu.dwim.util+iolib from pathname /home/testgrid/cl-test-grid/work-dir/agent/quicklisp/dists/quicklisp/software/hu.dwim.util-20171019-darcs/hu\.dwim\.util+iolib.asd: Cannot IMPORT "NON-PROPAGATING-OPERATION" from package "ASDF"
(LOAD hu.dwim.util FAIL) needs newer ASDF, ASDF:LOAD-SYSTEM-DEFINITION-ERROR : Error while trying to load definition for system hu.dwim.util from pathname /home/testgrid/cl-test-grid/work-dir/agent/quicklisp/dists/quicklisp/software/hu.dwim.util-20171019-darcs/hu\.dwim\.util.asd: Cannot IMPORT "NON-PROPAGATING-OPERATION" from package "ASDF"
(LOAD hu.dwim.util.test FAIL) needs newer ASDF, ASDF:LOAD-SYSTEM-DEFINITION-ERROR : Error while trying to load definition for system hu.dwim.util.test from pathname /home/testgrid/cl-test-grid/work-dir/agent/quicklisp/dists/quicklisp/software/hu.dwim.util-20171019-darcs/hu\.dwim\.util\.test.asd: Cannot IMPORT "NON-PROPAGATING-OPERATION" from package "ASDF"
(LOAD hu.dwim.util.documentation FAIL) needs newer ASDF, ASDF:LOAD-SYSTEM-DEFINITION-ERROR : Error while trying to load definition for system hu.dwim.util.documentation from pathname /home/testgrid/cl-test-grid/work-dir/agent/quicklisp/dists/quicklisp/software/hu.dwim.util-20171019-darcs/hu\.dwim\.util\.documentation.asd: Cannot IMPORT "NON-PROPAGATING-OPERATION" from package "ASDF"
(LOAD hu.dwim.util+iolib FAIL) needs newer ASDF, ASDF:LOAD-SYSTEM-DEFINITION-ERROR : Error while trying to load definition for system hu.dwim.util+iolib from pathname /home/testgrid/cl-test-grid/work-dir/agent/quicklisp/dists/quicklisp/software/hu.dwim.util-20171019-darcs/hu\.dwim\.util+iolib.asd: Cannot IMPORT "NON-PROPAGATING-OPERATION" from package "ASDF"
(LOAD hu.dwim.util FAIL) needs newer ASDF, ASDF:LOAD-SYSTEM-DEFINITION-ERROR : Error while trying to load definition for system hu.dwim.util from pathname /home/testgrid/cl-test-grid/work-dir/agent/quicklisp/dists/quicklisp/software/hu.dwim.util-20171019-darcs/hu\.dwim\.util.asd: Cannot IMPORT "NON-PROPAGATING-OPERATION" from package "ASDF"
ccl-1.9-r15756-f96-linux-x86
(LOAD hu.dwim.util.test FAIL) needs newer ASDF, ASDF/FIND-SYSTEM:LOAD-SYSTEM-DEFINITION-ERROR : Error while trying to load definition for system hu.dwim.util.test from pathname /home/testgrid/cl-test-grid/work-dir/agent/quicklisp/dists/quicklisp/software/hu.dwim.util-20171019-darcs/hu\.dwim\.util\.test.asd: Cannot IMPORT "NON-PROPAGATING-OPERATION" from package "ASDF"
(LOAD hu.dwim.util.documentation FAIL) needs newer ASDF, ASDF/FIND-SYSTEM:LOAD-SYSTEM-DEFINITION-ERROR : Error while trying to load definition for system hu.dwim.util.documentation from pathname /home/testgrid/cl-test-grid/work-dir/agent/quicklisp/dists/quicklisp/software/hu.dwim.util-20171019-darcs/hu\.dwim\.util\.documentation.asd: Cannot IMPORT "NON-PROPAGATING-OPERATION" from package "ASDF"
(LOAD hu.dwim.util+iolib FAIL) needs newer ASDF, ASDF/FIND-SYSTEM:LOAD-SYSTEM-DEFINITION-ERROR : Error while trying to load definition for system hu.dwim.util+iolib from pathname /home/testgrid/cl-test-grid/work-dir/agent/quicklisp/dists/quicklisp/software/hu.dwim.util-20171019-darcs/hu\.dwim\.util+iolib.asd: Cannot IMPORT "NON-PROPAGATING-OPERATION" from package "ASDF"
(LOAD hu.dwim.util FAIL) needs newer ASDF, ASDF/FIND-SYSTEM:LOAD-SYSTEM-DEFINITION-ERROR : Error while trying to load definition for system hu.dwim.util from pathname /home/testgrid/cl-test-grid/work-dir/agent/quicklisp/dists/quicklisp/software/hu.dwim.util-20171019-darcs/hu\.dwim\.util.asd: Cannot IMPORT "NON-PROPAGATING-OPERATION" from package "ASDF"
(LOAD hu.dwim.util.test FAIL) needs newer ASDF, ASDF/FIND-SYSTEM:LOAD-SYSTEM-DEFINITION-ERROR : Error while trying to load definition for system hu.dwim.util.test from pathname /home/testgrid/cl-test-grid/work-dir/agent/quicklisp/dists/quicklisp/software/hu.dwim.util-20171019-darcs/hu\.dwim\.util\.test.asd: Cannot IMPORT "NON-PROPAGATING-OPERATION" from package "ASDF"
(LOAD hu.dwim.util.documentation FAIL) needs newer ASDF, ASDF/FIND-SYSTEM:LOAD-SYSTEM-DEFINITION-ERROR : Error while trying to load definition for system hu.dwim.util.documentation from pathname /home/testgrid/cl-test-grid/work-dir/agent/quicklisp/dists/quicklisp/software/hu.dwim.util-20171019-darcs/hu\.dwim\.util\.documentation.asd: Cannot IMPORT "NON-PROPAGATING-OPERATION" from package "ASDF"
(LOAD hu.dwim.util+iolib FAIL) needs newer ASDF, ASDF/FIND-SYSTEM:LOAD-SYSTEM-DEFINITION-ERROR : Error while trying to load definition for system hu.dwim.util+iolib from pathname /home/testgrid/cl-test-grid/work-dir/agent/quicklisp/dists/quicklisp/software/hu.dwim.util-20171019-darcs/hu\.dwim\.util+iolib.asd: Cannot IMPORT "NON-PROPAGATING-OPERATION" from package "ASDF"
(LOAD hu.dwim.util FAIL) needs newer ASDF, ASDF/FIND-SYSTEM:LOAD-SYSTEM-DEFINITION-ERROR : Error while trying to load definition for system hu.dwim.util from pathname /home/testgrid/cl-test-grid/work-dir/agent/quicklisp/dists/quicklisp/software/hu.dwim.util-20171019-darcs/hu\.dwim\.util.asd: Cannot IMPORT "NON-PROPAGATING-OPERATION" from package "ASDF"
clisp-2.49-unix-x86
(LOAD hu.dwim.util.test FAIL) needs newer ASDF, ASDF:LOAD-SYSTEM-DEFINITION-ERROR : Error while trying to load definition for system hu.dwim.util.test from pathname /home/testgrid/cl-test-grid/work-dir/agent/quicklisp/dists/quicklisp/software/hu.dwim.util-20171019-darcs/hu.dwim.util.test.asd: DEFPACKAGE HU.DWIM.ASDF: There is no symbol ASDF::NON-PROPAGATING-OPERATION .
(LOAD hu.dwim.util.documentation FAIL) needs newer ASDF, ASDF:LOAD-SYSTEM-DEFINITION-ERROR : Error while trying to load definition for system hu.dwim.util.documentation from pathname /home/testgrid/cl-test-grid/work-dir/agent/quicklisp/dists/quicklisp/software/hu.dwim.util-20171019-darcs/hu.dwim.util.documentation.asd: DEFPACKAGE HU.DWIM.ASDF: There is no symbol ASDF::NON-PROPAGATING-OPERATION .
(LOAD hu.dwim.util+iolib FAIL) needs newer ASDF, ASDF:LOAD-SYSTEM-DEFINITION-ERROR : Error while trying to load definition for system hu.dwim.util+iolib from pathname /home/testgrid/cl-test-grid/work-dir/agent/quicklisp/dists/quicklisp/software/hu.dwim.util-20171019-darcs/hu.dwim.util+iolib.asd: DEFPACKAGE HU.DWIM.ASDF: There is no symbol ASDF::NON-PROPAGATING-OPERATION .
(LOAD hu.dwim.util FAIL) needs newer ASDF, ASDF:LOAD-SYSTEM-DEFINITION-ERROR : Error while trying to load definition for system hu.dwim.util from pathname /home/testgrid/cl-test-grid/work-dir/agent/quicklisp/dists/quicklisp/software/hu.dwim.util-20171019-darcs/hu.dwim.util.asd: DEFPACKAGE HU.DWIM.ASDF: There is no symbol ASDF::NON-PROPAGATING-OPERATION .
(LOAD hu.dwim.util.test FAIL) needs newer ASDF, ASDF:LOAD-SYSTEM-DEFINITION-ERROR : Error while trying to load definition for system hu.dwim.util.test from pathname /home/testgrid/cl-test-grid/work-dir/agent/quicklisp/dists/quicklisp/software/hu.dwim.util-20171019-darcs/hu.dwim.util.test.asd: DEFPACKAGE HU.DWIM.ASDF: There is no symbol ASDF::NON-PROPAGATING-OPERATION .
(LOAD hu.dwim.util.documentation FAIL) needs newer ASDF, ASDF:LOAD-SYSTEM-DEFINITION-ERROR : Error while trying to load definition for system hu.dwim.util.documentation from pathname /home/testgrid/cl-test-grid/work-dir/agent/quicklisp/dists/quicklisp/software/hu.dwim.util-20171019-darcs/hu.dwim.util.documentation.asd: DEFPACKAGE HU.DWIM.ASDF: There is no symbol ASDF::NON-PROPAGATING-OPERATION .
(LOAD hu.dwim.util+iolib FAIL) needs newer ASDF, ASDF:LOAD-SYSTEM-DEFINITION-ERROR : Error while trying to load definition for system hu.dwim.util+iolib from pathname /home/testgrid/cl-test-grid/work-dir/agent/quicklisp/dists/quicklisp/software/hu.dwim.util-20171019-darcs/hu.dwim.util+iolib.asd: DEFPACKAGE HU.DWIM.ASDF: There is no symbol ASDF::NON-PROPAGATING-OPERATION .
(LOAD hu.dwim.util FAIL) needs newer ASDF, ASDF:LOAD-SYSTEM-DEFINITION-ERROR : Error while trying to load definition for system hu.dwim.util from pathname /home/testgrid/cl-test-grid/work-dir/agent/quicklisp/dists/quicklisp/software/hu.dwim.util-20171019-darcs/hu.dwim.util.asd: DEFPACKAGE HU.DWIM.ASDF: There is no symbol ASDF::NON-PROPAGATING-OPERATION .
cmu-snapshot-2013-04__20d_unicode_-linux-x86
(LOAD hu.dwim.util.test FAIL) needs newer ASDF, ASDF/FIND-SYSTEM:LOAD-SYSTEM-DEFINITION-ERROR : Error while trying to load definition for system hu.dwim.util.test from pathname /home/testgrid/cl-test-grid/work-dir/agent/quicklisp/dists/quicklisp/software/hu.dwim.util-20171019-darcs/hu.dwim.util.test.asd: ASDF/INTERFACE does not contain a symbol NON-PROPAGATING-OPERATION
(LOAD hu.dwim.util.documentation FAIL) needs newer ASDF, ASDF/FIND-SYSTEM:LOAD-SYSTEM-DEFINITION-ERROR : Error while trying to load definition for system hu.dwim.util.documentation from pathname /home/testgrid/cl-test-grid/work-dir/agent/quicklisp/dists/quicklisp/software/hu.dwim.util-20171019-darcs/hu.dwim.util.documentation.asd: ASDF/INTERFACE does not contain a symbol NON-PROPAGATING-OPERATION
(LOAD hu.dwim.util+iolib FAIL) needs newer ASDF, ASDF/FIND-SYSTEM:LOAD-SYSTEM-DEFINITION-ERROR : Error while trying to load definition for system hu.dwim.util+iolib from pathname /home/testgrid/cl-test-grid/work-dir/agent/quicklisp/dists/quicklisp/software/hu.dwim.util-20171019-darcs/hu.dwim.util+iolib.asd: ASDF/INTERFACE does not contain a symbol NON-PROPAGATING-OPERATION
(LOAD hu.dwim.util FAIL) needs newer ASDF, ASDF/FIND-SYSTEM:LOAD-SYSTEM-DEFINITION-ERROR : Error while trying to load definition for system hu.dwim.util from pathname /home/testgrid/cl-test-grid/work-dir/agent/quicklisp/dists/quicklisp/software/hu.dwim.util-20171019-darcs/hu.dwim.util.asd: ASDF/INTERFACE does not contain a symbol NON-PROPAGATING-OPERATION
(LOAD hu.dwim.util.test FAIL) needs newer ASDF, ASDF/FIND-SYSTEM:LOAD-SYSTEM-DEFINITION-ERROR : Error while trying to load definition for system hu.dwim.util.test from pathname /home/testgrid/cl-test-grid/work-dir/agent/quicklisp/dists/quicklisp/software/hu.dwim.util-20171019-darcs/hu.dwim.util.test.asd: ASDF/INTERFACE does not contain a symbol NON-PROPAGATING-OPERATION
(LOAD hu.dwim.util.documentation FAIL) needs newer ASDF, ASDF/FIND-SYSTEM:LOAD-SYSTEM-DEFINITION-ERROR : Error while trying to load definition for system hu.dwim.util.documentation from pathname /home/testgrid/cl-test-grid/work-dir/agent/quicklisp/dists/quicklisp/software/hu.dwim.util-20171019-darcs/hu.dwim.util.documentation.asd: ASDF/INTERFACE does not contain a symbol NON-PROPAGATING-OPERATION
(LOAD hu.dwim.util+iolib FAIL) needs newer ASDF, ASDF/FIND-SYSTEM:LOAD-SYSTEM-DEFINITION-ERROR : Error while trying to load definition for system hu.dwim.util+iolib from pathname /home/testgrid/cl-test-grid/work-dir/agent/quicklisp/dists/quicklisp/software/hu.dwim.util-20171019-darcs/hu.dwim.util+iolib.asd: ASDF/INTERFACE does not contain a symbol NON-PROPAGATING-OPERATION
(LOAD hu.dwim.util FAIL) needs newer ASDF, ASDF/FIND-SYSTEM:LOAD-SYSTEM-DEFINITION-ERROR : Error while trying to load definition for system hu.dwim.util from pathname /home/testgrid/cl-test-grid/work-dir/agent/quicklisp/dists/quicklisp/software/hu.dwim.util-20171019-darcs/hu.dwim.util.asd: ASDF/INTERFACE does not contain a symbol NON-PROPAGATING-OPERATION
cmu-snapshot-2014-01__20e_unicode_-linux-x86
(LOAD hu.dwim.util.test FAIL) needs newer ASDF, ASDF/FIND-SYSTEM:LOAD-SYSTEM-DEFINITION-ERROR : Error while trying to load definition for system hu.dwim.util.test from pathname /home/testgrid/cl-test-grid/work-dir/agent/quicklisp/dists/quicklisp/software/hu.dwim.util-20171019-darcs/hu.dwim.util.test.asd: ASDF/INTERFACE does not contain a symbol NON-PROPAGATING-OPERATION
(LOAD hu.dwim.util.documentation FAIL) needs newer ASDF, ASDF/FIND-SYSTEM:LOAD-SYSTEM-DEFINITION-ERROR : Error while trying to load definition for system hu.dwim.util.documentation from pathname /home/testgrid/cl-test-grid/work-dir/agent/quicklisp/dists/quicklisp/software/hu.dwim.util-20171019-darcs/hu.dwim.util.documentation.asd: ASDF/INTERFACE does not contain a symbol NON-PROPAGATING-OPERATION
(LOAD hu.dwim.util+iolib FAIL) needs newer ASDF, ASDF/FIND-SYSTEM:LOAD-SYSTEM-DEFINITION-ERROR : Error while trying to load definition for system hu.dwim.util+iolib from pathname /home/testgrid/cl-test-grid/work-dir/agent/quicklisp/dists/quicklisp/software/hu.dwim.util-20171019-darcs/hu.dwim.util+iolib.asd: ASDF/INTERFACE does not contain a symbol NON-PROPAGATING-OPERATION
(LOAD hu.dwim.util FAIL) needs newer ASDF, ASDF/FIND-SYSTEM:LOAD-SYSTEM-DEFINITION-ERROR : Error while trying to load definition for system hu.dwim.util from pathname /home/testgrid/cl-test-grid/work-dir/agent/quicklisp/dists/quicklisp/software/hu.dwim.util-20171019-darcs/hu.dwim.util.asd: ASDF/INTERFACE does not contain a symbol NON-PROPAGATING-OPERATION
(LOAD hu.dwim.util.test FAIL) needs newer ASDF, ASDF/FIND-SYSTEM:LOAD-SYSTEM-DEFINITION-ERROR : Error while trying to load definition for system hu.dwim.util.test from pathname /home/testgrid/cl-test-grid/work-dir/agent/quicklisp/dists/quicklisp/software/hu.dwim.util-20171019-darcs/hu.dwim.util.test.asd: ASDF/INTERFACE does not contain a symbol NON-PROPAGATING-OPERATION
(LOAD hu.dwim.util.documentation FAIL) needs newer ASDF, ASDF/FIND-SYSTEM:LOAD-SYSTEM-DEFINITION-ERROR : Error while trying to load definition for system hu.dwim.util.documentation from pathname /home/testgrid/cl-test-grid/work-dir/agent/quicklisp/dists/quicklisp/software/hu.dwim.util-20171019-darcs/hu.dwim.util.documentation.asd: ASDF/INTERFACE does not contain a symbol NON-PROPAGATING-OPERATION
(LOAD hu.dwim.util+iolib FAIL) needs newer ASDF, ASDF/FIND-SYSTEM:LOAD-SYSTEM-DEFINITION-ERROR : Error while trying to load definition for system hu.dwim.util+iolib from pathname /home/testgrid/cl-test-grid/work-dir/agent/quicklisp/dists/quicklisp/software/hu.dwim.util-20171019-darcs/hu.dwim.util+iolib.asd: ASDF/INTERFACE does not contain a symbol NON-PROPAGATING-OPERATION
(LOAD hu.dwim.util FAIL) needs newer ASDF, ASDF/FIND-SYSTEM:LOAD-SYSTEM-DEFINITION-ERROR : Error while trying to load definition for system hu.dwim.util from pathname /home/testgrid/cl-test-grid/work-dir/agent/quicklisp/dists/quicklisp/software/hu.dwim.util-20171019-darcs/hu.dwim.util.asd: ASDF/INTERFACE does not contain a symbol NON-PROPAGATING-OPERATION
cmu-snapshot-2014-05-dirty__20e_unicode_-linux-x86
(LOAD hu.dwim.util.test FAIL) needs newer ASDF, ASDF/FIND-SYSTEM:LOAD-SYSTEM-DEFINITION-ERROR : Error while trying to load definition for system hu.dwim.util.test from pathname /home/testgrid/cl-test-grid/work-dir/agent/quicklisp/dists/quicklisp/software/hu.dwim.util-20171019-darcs/hu.dwim.util.test.asd: ASDF/INTERFACE does not contain a symbol NON-PROPAGATING-OPERATION
(LOAD hu.dwim.util.documentation FAIL) needs newer ASDF, ASDF/FIND-SYSTEM:LOAD-SYSTEM-DEFINITION-ERROR : Error while trying to load definition for system hu.dwim.util.documentation from pathname /home/testgrid/cl-test-grid/work-dir/agent/quicklisp/dists/quicklisp/software/hu.dwim.util-20171019-darcs/hu.dwim.util.documentation.asd: ASDF/INTERFACE does not contain a symbol NON-PROPAGATING-OPERATION
(LOAD hu.dwim.util+iolib FAIL) needs newer ASDF, ASDF/FIND-SYSTEM:LOAD-SYSTEM-DEFINITION-ERROR : Error while trying to load definition for system hu.dwim.util+iolib from pathname /home/testgrid/cl-test-grid/work-dir/agent/quicklisp/dists/quicklisp/software/hu.dwim.util-20171019-darcs/hu.dwim.util+iolib.asd: ASDF/INTERFACE does not contain a symbol NON-PROPAGATING-OPERATION
(LOAD hu.dwim.util FAIL) needs newer ASDF, ASDF/FIND-SYSTEM:LOAD-SYSTEM-DEFINITION-ERROR : Error while trying to load definition for system hu.dwim.util from pathname /home/testgrid/cl-test-grid/work-dir/agent/quicklisp/dists/quicklisp/software/hu.dwim.util-20171019-darcs/hu.dwim.util.asd: ASDF/INTERFACE does not contain a symbol NON-PROPAGATING-OPERATION
(LOAD hu.dwim.util.test FAIL) needs newer ASDF, ASDF/FIND-SYSTEM:LOAD-SYSTEM-DEFINITION-ERROR : Error while trying to load definition for system hu.dwim.util.test from pathname /home/testgrid/cl-test-grid/work-dir/agent/quicklisp/dists/quicklisp/software/hu.dwim.util-20171019-darcs/hu.dwim.util.test.asd: ASDF/INTERFACE does not contain a symbol NON-PROPAGATING-OPERATION
(LOAD hu.dwim.util.documentation FAIL) needs newer ASDF, ASDF/FIND-SYSTEM:LOAD-SYSTEM-DEFINITION-ERROR : Error while trying to load definition for system hu.dwim.util.documentation from pathname /home/testgrid/cl-test-grid/work-dir/agent/quicklisp/dists/quicklisp/software/hu.dwim.util-20171019-darcs/hu.dwim.util.documentation.asd: ASDF/INTERFACE does not contain a symbol NON-PROPAGATING-OPERATION
(LOAD hu.dwim.util+iolib FAIL) needs newer ASDF, ASDF/FIND-SYSTEM:LOAD-SYSTEM-DEFINITION-ERROR : Error while trying to load definition for system hu.dwim.util+iolib from pathname /home/testgrid/cl-test-grid/work-dir/agent/quicklisp/dists/quicklisp/software/hu.dwim.util-20171019-darcs/hu.dwim.util+iolib.asd: ASDF/INTERFACE does not contain a symbol NON-PROPAGATING-OPERATION
(LOAD hu.dwim.util FAIL) needs newer ASDF, ASDF/FIND-SYSTEM:LOAD-SYSTEM-DEFINITION-ERROR : Error while trying to load definition for system hu.dwim.util from pathname /home/testgrid/cl-test-grid/work-dir/agent/quicklisp/dists/quicklisp/software/hu.dwim.util-20171019-darcs/hu.dwim.util.asd: ASDF/INTERFACE does not contain a symbol NON-PROPAGATING-OPERATION
cmu-snapshot-2014-12___20f_unicode_-linux-x86
(LOAD hu.dwim.util.test FAIL) ASDF/FIND-SYSTEM:LOAD-SYSTEM-DEFINITION-ERROR : Error while trying to load definition for system hu.dwim.util.test from pathname /home/testgrid/cl-test-grid/work-dir/agent/quicklisp/dists/quicklisp/software/hu.dwim.util-20171019-darcs/hu.dwim.util.test.asd: (during macroexpansion) Error in FDEFINITION: the function SYSTEM-TEST-SYSTEM-NAME is undefined.
(LOAD hu.dwim.util.documentation FAIL) ASDF/FIND-SYSTEM:LOAD-SYSTEM-DEFINITION-ERROR : Error while trying to load definition for system hu.dwim.util.documentation from pathname /home/testgrid/cl-test-grid/work-dir/agent/quicklisp/dists/quicklisp/software/hu.dwim.util-20171019-darcs/hu.dwim.util.documentation.asd: (during macroexpansion) Error in FDEFINITION: the function SYSTEM-TEST-SYSTEM-NAME is undefined.
(LOAD hu.dwim.util+iolib FAIL) ASDF/FIND-SYSTEM:LOAD-SYSTEM-DEFINITION-ERROR : Error while trying to load definition for system hu.dwim.util+iolib from pathname /home/testgrid/cl-test-grid/work-dir/agent/quicklisp/dists/quicklisp/software/hu.dwim.util-20171019-darcs/hu.dwim.util+iolib.asd: (during macroexpansion) Error in FDEFINITION: the function SYSTEM-TEST-SYSTEM-NAME is undefined.
(LOAD hu.dwim.util FAIL) ASDF/FIND-SYSTEM:LOAD-SYSTEM-DEFINITION-ERROR : Error while trying to load definition for system hu.dwim.util from pathname /home/testgrid/cl-test-grid/work-dir/agent/quicklisp/dists/quicklisp/software/hu.dwim.util-20171019-darcs/hu.dwim.util.asd: (during macroexpansion) Error in FDEFINITION: the function SYSTEM-TEST-SYSTEM-NAME is undefined.
(LOAD hu.dwim.util.test FAIL) ASDF/FIND-SYSTEM:LOAD-SYSTEM-DEFINITION-ERROR : Error while trying to load definition for system hu.dwim.util.test from pathname /home/testgrid/cl-test-grid/work-dir/agent/quicklisp/dists/quicklisp/software/hu.dwim.util-20171019-darcs/hu.dwim.util.test.asd: (during macroexpansion) Error in FDEFINITION: the function SYSTEM-TEST-SYSTEM-NAME is undefined.
(LOAD hu.dwim.util.documentation FAIL) ASDF/FIND-SYSTEM:LOAD-SYSTEM-DEFINITION-ERROR : Error while trying to load definition for system hu.dwim.util.documentation from pathname /home/testgrid/cl-test-grid/work-dir/agent/quicklisp/dists/quicklisp/software/hu.dwim.util-20171019-darcs/hu.dwim.util.documentation.asd: (during macroexpansion) Error in FDEFINITION: the function SYSTEM-TEST-SYSTEM-NAME is undefined.
(LOAD hu.dwim.util+iolib FAIL) ASDF/FIND-SYSTEM:LOAD-SYSTEM-DEFINITION-ERROR : Error while trying to load definition for system hu.dwim.util+iolib from pathname /home/testgrid/cl-test-grid/work-dir/agent/quicklisp/dists/quicklisp/software/hu.dwim.util-20171019-darcs/hu.dwim.util+iolib.asd: (during macroexpansion) Error in FDEFINITION: the function SYSTEM-TEST-SYSTEM-NAME is undefined.
(LOAD hu.dwim.util FAIL) ASDF/FIND-SYSTEM:LOAD-SYSTEM-DEFINITION-ERROR : Error while trying to load definition for system hu.dwim.util from pathname /home/testgrid/cl-test-grid/work-dir/agent/quicklisp/dists/quicklisp/software/hu.dwim.util-20171019-darcs/hu.dwim.util.asd: (during macroexpansion) Error in FDEFINITION: the function SYSTEM-TEST-SYSTEM-NAME is undefined.
cmu-snapshot-2016-12__21b_unicode_-linux-x86
(LOAD hu.dwim.util.test FAIL) ASDF/FIND-SYSTEM:LOAD-SYSTEM-DEFINITION-ERROR : Error while trying to load definition for system hu.dwim.util.test from pathname /home/testgrid/cl-test-grid/work-dir/agent/quicklisp/dists/quicklisp/software/hu.dwim.util-20171019-darcs/hu.dwim.util.test.asd: (during macroexpansion) Error in FDEFINITION: the function SYSTEM-TEST-SYSTEM-NAME is undefined.
(LOAD hu.dwim.util.documentation FAIL) ASDF/FIND-SYSTEM:LOAD-SYSTEM-DEFINITION-ERROR : Error while trying to load definition for system hu.dwim.util.documentation from pathname /home/testgrid/cl-test-grid/work-dir/agent/quicklisp/dists/quicklisp/software/hu.dwim.util-20171019-darcs/hu.dwim.util.documentation.asd: (during macroexpansion) Error in FDEFINITION: the function SYSTEM-TEST-SYSTEM-NAME is undefined.
(LOAD hu.dwim.util+iolib FAIL) ASDF/FIND-SYSTEM:LOAD-SYSTEM-DEFINITION-ERROR : Error while trying to load definition for system hu.dwim.util+iolib from pathname /home/testgrid/cl-test-grid/work-dir/agent/quicklisp/dists/quicklisp/software/hu.dwim.util-20171019-darcs/hu.dwim.util+iolib.asd: (during macroexpansion) Error in FDEFINITION: the function SYSTEM-TEST-SYSTEM-NAME is undefined.
(LOAD hu.dwim.util FAIL) ASDF/FIND-SYSTEM:LOAD-SYSTEM-DEFINITION-ERROR : Error while trying to load definition for system hu.dwim.util from pathname /home/testgrid/cl-test-grid/work-dir/agent/quicklisp/dists/quicklisp/software/hu.dwim.util-20171019-darcs/hu.dwim.util.asd: (during macroexpansion) Error in FDEFINITION: the function SYSTEM-TEST-SYSTEM-NAME is undefined.
(LOAD hu.dwim.util.test FAIL) ASDF/FIND-SYSTEM:LOAD-SYSTEM-DEFINITION-ERROR : Error while trying to load definition for system hu.dwim.util.test from pathname /home/testgrid/cl-test-grid/work-dir/agent/quicklisp/dists/quicklisp/software/hu.dwim.util-20171019-darcs/hu.dwim.util.test.asd: (during macroexpansion) Error in FDEFINITION: the function SYSTEM-TEST-SYSTEM-NAME is undefined.
(LOAD hu.dwim.util.documentation FAIL) ASDF/FIND-SYSTEM:LOAD-SYSTEM-DEFINITION-ERROR : Error while trying to load definition for system hu.dwim.util.documentation from pathname /home/testgrid/cl-test-grid/work-dir/agent/quicklisp/dists/quicklisp/software/hu.dwim.util-20171019-darcs/hu.dwim.util.documentation.asd: (during macroexpansion) Error in FDEFINITION: the function SYSTEM-TEST-SYSTEM-NAME is undefined.
(LOAD hu.dwim.util+iolib FAIL) ASDF/FIND-SYSTEM:LOAD-SYSTEM-DEFINITION-ERROR : Error while trying to load definition for system hu.dwim.util+iolib from pathname /home/testgrid/cl-test-grid/work-dir/agent/quicklisp/dists/quicklisp/software/hu.dwim.util-20171019-darcs/hu.dwim.util+iolib.asd: (during macroexpansion) Error in FDEFINITION: the function SYSTEM-TEST-SYSTEM-NAME is undefined.
(LOAD hu.dwim.util FAIL) ASDF/FIND-SYSTEM:LOAD-SYSTEM-DEFINITION-ERROR : Error while trying to load definition for system hu.dwim.util from pathname /home/testgrid/cl-test-grid/work-dir/agent/quicklisp/dists/quicklisp/software/hu.dwim.util-20171019-darcs/hu.dwim.util.asd: (during macroexpansion) Error in FDEFINITION: the function SYSTEM-TEST-SYSTEM-NAME is undefined.
ecl-13.5.1-unknown-linux-i686-bytecode
(LOAD hu.dwim.util.test FAIL) needs newer ASDF, ASDF/FIND-SYSTEM:LOAD-SYSTEM-DEFINITION-ERROR : Error while trying to load definition for system hu.dwim.util.test from pathname /home/testgrid/cl-test-grid/work-dir/agent/quicklisp/dists/quicklisp/software/hu.dwim.util-20171019-darcs/hu.dwim.util.test.asd: Cannot find symbol "NON-PROPAGATING-OPERATION" in package #<"ASDF/INTERFACE" package>
(LOAD hu.dwim.util.documentation FAIL) needs newer ASDF, ASDF/FIND-SYSTEM:LOAD-SYSTEM-DEFINITION-ERROR : Error while trying to load definition for system hu.dwim.util.documentation from pathname /home/testgrid/cl-test-grid/work-dir/agent/quicklisp/dists/quicklisp/software/hu.dwim.util-20171019-darcs/hu.dwim.util.documentation.asd: Cannot find symbol "NON-PROPAGATING-OPERATION" in package #<"ASDF/INTERFACE" package>
(LOAD hu.dwim.util+iolib FAIL) needs newer ASDF, ASDF/FIND-SYSTEM:LOAD-SYSTEM-DEFINITION-ERROR : Error while trying to load definition for system hu.dwim.util+iolib from pathname /home/testgrid/cl-test-grid/work-dir/agent/quicklisp/dists/quicklisp/software/hu.dwim.util-20171019-darcs/hu.dwim.util+iolib.asd: Cannot find symbol "NON-PROPAGATING-OPERATION" in package #<"ASDF/INTERFACE" package>
(LOAD hu.dwim.util FAIL) needs newer ASDF, ASDF/FIND-SYSTEM:LOAD-SYSTEM-DEFINITION-ERROR : Error while trying to load definition for system hu.dwim.util from pathname /home/testgrid/cl-test-grid/work-dir/agent/quicklisp/dists/quicklisp/software/hu.dwim.util-20171019-darcs/hu.dwim.util.asd: Cannot find symbol "NON-PROPAGATING-OPERATION" in package #<"ASDF/INTERFACE" package>
(LOAD hu.dwim.util.test FAIL) needs newer ASDF, ASDF/FIND-SYSTEM:LOAD-SYSTEM-DEFINITION-ERROR : Error while trying to load definition for system hu.dwim.util.test from pathname /home/testgrid/cl-test-grid/work-dir/agent/quicklisp/dists/quicklisp/software/hu.dwim.util-20171019-darcs/hu.dwim.util.test.asd: Cannot find symbol "NON-PROPAGATING-OPERATION" in package #<"ASDF/INTERFACE" package>
(LOAD hu.dwim.util.documentation FAIL) needs newer ASDF, ASDF/FIND-SYSTEM:LOAD-SYSTEM-DEFINITION-ERROR : Error while trying to load definition for system hu.dwim.util.documentation from pathname /home/testgrid/cl-test-grid/work-dir/agent/quicklisp/dists/quicklisp/software/hu.dwim.util-20171019-darcs/hu.dwim.util.documentation.asd: Cannot find symbol "NON-PROPAGATING-OPERATION" in package #<"ASDF/INTERFACE" package>
(LOAD hu.dwim.util+iolib FAIL) needs newer ASDF, ASDF/FIND-SYSTEM:LOAD-SYSTEM-DEFINITION-ERROR : Error while trying to load definition for system hu.dwim.util+iolib from pathname /home/testgrid/cl-test-grid/work-dir/agent/quicklisp/dists/quicklisp/software/hu.dwim.util-20171019-darcs/hu.dwim.util+iolib.asd: Cannot find symbol "NON-PROPAGATING-OPERATION" in package #<"ASDF/INTERFACE" package>
(LOAD hu.dwim.util FAIL) needs newer ASDF, ASDF/FIND-SYSTEM:LOAD-SYSTEM-DEFINITION-ERROR : Error while trying to load definition for system hu.dwim.util from pathname /home/testgrid/cl-test-grid/work-dir/agent/quicklisp/dists/quicklisp/software/hu.dwim.util-20171019-darcs/hu.dwim.util.asd: Cannot find symbol "NON-PROPAGATING-OPERATION" in package #<"ASDF/INTERFACE" package>
ecl-13.5.1-unknown-linux-i686-lisp-to-c
(LOAD hu.dwim.util.test FAIL) ASDF/FIND-SYSTEM:LOAD-SYSTEM-DEFINITION-ERROR : Error while trying to load definition for system hu.dwim.util.test from pathname /home/testgrid/cl-test-grid/work-dir/agent/quicklisp/dists/quicklisp/software/hu.dwim.util-20171019-darcs/hu.dwim.util.test.asd: COMPILE-FILE-ERROR while compiling #<cl-source-file "hu.dwim.asdf" "source" "package">
(LOAD hu.dwim.util.documentation FAIL) ASDF/FIND-SYSTEM:LOAD-SYSTEM-DEFINITION-ERROR : Error while trying to load definition for system hu.dwim.util.documentation from pathname /home/testgrid/cl-test-grid/work-dir/agent/quicklisp/dists/quicklisp/software/hu.dwim.util-20171019-darcs/hu.dwim.util.documentation.asd: COMPILE-FILE-ERROR while compiling #<cl-source-file "hu.dwim.asdf" "source" "package">
(LOAD hu.dwim.util+iolib FAIL) ASDF/FIND-SYSTEM:LOAD-SYSTEM-DEFINITION-ERROR : Error while trying to load definition for system hu.dwim.util+iolib from pathname /home/testgrid/cl-test-grid/work-dir/agent/quicklisp/dists/quicklisp/software/hu.dwim.util-20171019-darcs/hu.dwim.util+iolib.asd: COMPILE-FILE-ERROR while compiling #<cl-source-file "hu.dwim.asdf" "source" "package">
(LOAD hu.dwim.util FAIL) ASDF/FIND-SYSTEM:LOAD-SYSTEM-DEFINITION-ERROR : Error while trying to load definition for system hu.dwim.util from pathname /home/testgrid/cl-test-grid/work-dir/agent/quicklisp/dists/quicklisp/software/hu.dwim.util-20171019-darcs/hu.dwim.util.asd: COMPILE-FILE-ERROR while compiling #<cl-source-file "hu.dwim.asdf" "source" "package">
(LOAD hu.dwim.util.test FAIL) ASDF/FIND-SYSTEM:LOAD-SYSTEM-DEFINITION-ERROR : Error while trying to load definition for system hu.dwim.util.test from pathname /home/testgrid/cl-test-grid/work-dir/agent/quicklisp/dists/quicklisp/software/hu.dwim.util-20171019-darcs/hu.dwim.util.test.asd: COMPILE-FILE-ERROR while compiling #<cl-source-file "hu.dwim.asdf" "source" "package">
(LOAD hu.dwim.util.documentation FAIL) ASDF/FIND-SYSTEM:LOAD-SYSTEM-DEFINITION-ERROR : Error while trying to load definition for system hu.dwim.util.documentation from pathname /home/testgrid/cl-test-grid/work-dir/agent/quicklisp/dists/quicklisp/software/hu.dwim.util-20171019-darcs/hu.dwim.util.documentation.asd: COMPILE-FILE-ERROR while compiling #<cl-source-file "hu.dwim.asdf" "source" "package">
(LOAD hu.dwim.util+iolib FAIL) ASDF/FIND-SYSTEM:LOAD-SYSTEM-DEFINITION-ERROR : Error while trying to load definition for system hu.dwim.util+iolib from pathname /home/testgrid/cl-test-grid/work-dir/agent/quicklisp/dists/quicklisp/software/hu.dwim.util-20171019-darcs/hu.dwim.util+iolib.asd: COMPILE-FILE-ERROR while compiling #<cl-source-file "hu.dwim.asdf" "source" "package">
(LOAD hu.dwim.util FAIL) ASDF/FIND-SYSTEM:LOAD-SYSTEM-DEFINITION-ERROR : Error while trying to load definition for system hu.dwim.util from pathname /home/testgrid/cl-test-grid/work-dir/agent/quicklisp/dists/quicklisp/software/hu.dwim.util-20171019-darcs/hu.dwim.util.asd: COMPILE-FILE-ERROR while compiling #<cl-source-file "hu.dwim.asdf" "source" "package">
ecl-16.0.0-98fc12d3-linux-i686-bytecode
(LOAD hu.dwim.util.test FAIL) ASDF/FIND-SYSTEM:LOAD-SYSTEM-DEFINITION-ERROR : Error while trying to load definition for system iolib from pathname /home/testgrid/cl-test-grid/work-dir/agent/quicklisp/dists/quicklisp/software/iolib-v0.8.3/iolib.asd: The variable C::*CC-FLAGS* is unbound.
(LOAD hu.dwim.util.documentation FAIL) ASDF/FIND-SYSTEM:LOAD-SYSTEM-DEFINITION-ERROR : Error while trying to load definition for system iolib from pathname /home/testgrid/cl-test-grid/work-dir/agent/quicklisp/dists/quicklisp/software/iolib-v0.8.3/iolib.asd: The variable C::*CC-FLAGS* is unbound.
(LOAD hu.dwim.util+iolib FAIL) ASDF/FIND-SYSTEM:LOAD-SYSTEM-DEFINITION-ERROR : Error while trying to load definition for system iolib from pathname /home/testgrid/cl-test-grid/work-dir/agent/quicklisp/dists/quicklisp/software/iolib-v0.8.3/iolib.asd: The variable C::*CC-FLAGS* is unbound.
(LOAD hu.dwim.util.test FAIL) ASDF/FIND-SYSTEM:LOAD-SYSTEM-DEFINITION-ERROR : Error while trying to load definition for system iolib from pathname /home/testgrid/cl-test-grid/work-dir/agent/quicklisp/dists/quicklisp/software/iolib-v0.8.3/iolib.asd: The variable C::*CC-FLAGS* is unbound.
(LOAD hu.dwim.util.documentation FAIL) ASDF/FIND-SYSTEM:LOAD-SYSTEM-DEFINITION-ERROR : Error while trying to load definition for system iolib from pathname /home/testgrid/cl-test-grid/work-dir/agent/quicklisp/dists/quicklisp/software/iolib-v0.8.3/iolib.asd: The variable C::*CC-FLAGS* is unbound.
(LOAD hu.dwim.util+iolib FAIL) ASDF/FIND-SYSTEM:LOAD-SYSTEM-DEFINITION-ERROR : Error while trying to load definition for system iolib from pathname /home/testgrid/cl-test-grid/work-dir/agent/quicklisp/dists/quicklisp/software/iolib-v0.8.3/iolib.asd: The variable C::*CC-FLAGS* is unbound.
ecl-16.0.0-98fc12d3-linux-i686-lisp-to-c
(LOAD hu.dwim.util.test FAIL) COMMON-LISP:SIMPLE-TYPE-ERROR : The assertion (<= (LENGTH METACOPY-SYSTEM::PATHS) 1) failed
(LOAD hu.dwim.util.documentation FAIL) ffi, CFFI:LOAD-FOREIGN-LIBRARY-ERROR : Unable to load any of the alternatives: ("libgvc.so" "libgvc.so.4" "libgvc32.so.4")
(LOAD hu.dwim.util.test FAIL) COMMON-LISP:SIMPLE-TYPE-ERROR : The assertion (<= (LENGTH METACOPY-SYSTEM::PATHS) 1) failed
(LOAD hu.dwim.util.documentation FAIL) ffi, CFFI:LOAD-FOREIGN-LIBRARY-ERROR : Unable to load any of the alternatives: ("libgvc.so" "libgvc.so.4" "libgvc32.so.4")
ecl-16.0.0-b2661fd1-macosx-x64-bytecode
(LOAD hu.dwim.util.test FAIL) ASDF/FIND-SYSTEM:LOAD-SYSTEM-DEFINITION-ERROR : Error while trying to load definition for system iolib from pathname /Volumes/Transcend/testgrid/cl-test-grid/work-dir/agent/quicklisp/dists/quicklisp/software/iolib-v0.8.3/iolib.asd: The variable C::*CC-FLAGS* is unbound.
(LOAD hu.dwim.util.documentation FAIL) ASDF/FIND-SYSTEM:LOAD-SYSTEM-DEFINITION-ERROR : Error while trying to load definition for system iolib from pathname /Volumes/Transcend/testgrid/cl-test-grid/work-dir/agent/quicklisp/dists/quicklisp/software/iolib-v0.8.3/iolib.asd: The variable C::*CC-FLAGS* is unbound.
(LOAD hu.dwim.util+iolib FAIL) ASDF/FIND-SYSTEM:LOAD-SYSTEM-DEFINITION-ERROR : Error while trying to load definition for system iolib from pathname /Volumes/Transcend/testgrid/cl-test-grid/work-dir/agent/quicklisp/dists/quicklisp/software/iolib-v0.8.3/iolib.asd: The variable C::*CC-FLAGS* is unbound.
ecl-16.0.0-b2661fd1-macosx-x64-lisp-to-c
(LOAD hu.dwim.util.test FAIL) COMMON-LISP:SIMPLE-TYPE-ERROR : The assertion (<= (LENGTH METACOPY-SYSTEM::PATHS) 1) failed
(LOAD hu.dwim.util.documentation FAIL) ffi, CFFI:LOAD-FOREIGN-LIBRARY-ERROR : Unable to load any of the alternatives: ("libgvc.so" "libgvc.so.4" "libgvc32.so.4")
(LOAD hu.dwim.util+iolib FAIL) IOLIB/GROVEL::GROVEL-ERROR : External process exited with code 1. Command was: "g++" "-m64" "-Wno-write-strings" "-g" "-O2" "-fPIC" "-fno-common" "-D_THREAD_SAFE" "-Ddarwin" "-I" "/opt/local/include/" "-I/Volumes/Transcend/testgrid/cl-test-grid/work-dir/agent/quicklisp/dists/quicklisp/software/iolib-v0.8.3/src/grovel/" "-o" "/Volumes/Transcend/testgrid/cl-test-grid/work-dir/agent/test-runs/20180114194407-ecl-16.0.0-b2661fd1-macosx-x64-lisp-to-c/fasl/ql/dists/quicklisp/software/iolib-v0.8.3/src/syscalls/ffi-types-unix" "/Volumes/Transcend/testgrid/cl-test-grid/work-dir/agent/test-runs/20180114194407-ecl-16.0.0-b2661fd1-macosx-x64-lisp-to-c/fasl/ql/dists/quicklisp/software/iolib-v0.8.3/src/syscalls/ffi-types-unix.c" Output was: Error output was: clang: warning: treating 'c' input as 'c++' when in C++ mode, this behavior is deprecated /Volumes/Transcend/testgrid/cl... fatal error: 'lfp.h' file not found #include <lfp.h> ^ 1 error generated.
ecl-16.1.2-unknown-linux-x86-bytecode
(LOAD hu.dwim.util.test FAIL) ASDF/FIND-SYSTEM:LOAD-SYSTEM-DEFINITION-ERROR : Error while trying to load definition for system iolib from pathname /home/testgrid/cl-test-grid/work-dir/agent/quicklisp/dists/quicklisp/software/iolib-v0.8.3/iolib.asd: The variable C::*CC-FLAGS* is unbound.
(LOAD hu.dwim.util.documentation FAIL) ASDF/FIND-SYSTEM:LOAD-SYSTEM-DEFINITION-ERROR : Error while trying to load definition for system iolib from pathname /home/testgrid/cl-test-grid/work-dir/agent/quicklisp/dists/quicklisp/software/iolib-v0.8.3/iolib.asd: The variable C::*CC-FLAGS* is unbound.
(LOAD hu.dwim.util+iolib FAIL) ASDF/FIND-SYSTEM:LOAD-SYSTEM-DEFINITION-ERROR : Error while trying to load definition for system iolib from pathname /home/testgrid/cl-test-grid/work-dir/agent/quicklisp/dists/quicklisp/software/iolib-v0.8.3/iolib.asd: The variable C::*CC-FLAGS* is unbound.
(LOAD hu.dwim.util.test FAIL) ASDF/FIND-SYSTEM:LOAD-SYSTEM-DEFINITION-ERROR : Error while trying to load definition for system iolib from pathname /home/testgrid/cl-test-grid/work-dir/agent/quicklisp/dists/quicklisp/software/iolib-v0.8.3/iolib.asd: The variable C::*CC-FLAGS* is unbound.
(LOAD hu.dwim.util.documentation FAIL) ASDF/FIND-SYSTEM:LOAD-SYSTEM-DEFINITION-ERROR : Error while trying to load definition for system iolib from pathname /home/testgrid/cl-test-grid/work-dir/agent/quicklisp/dists/quicklisp/software/iolib-v0.8.3/iolib.asd: The variable C::*CC-FLAGS* is unbound.
(LOAD hu.dwim.util+iolib FAIL) ASDF/FIND-SYSTEM:LOAD-SYSTEM-DEFINITION-ERROR : Error while trying to load definition for system iolib from pathname /home/testgrid/cl-test-grid/work-dir/agent/quicklisp/dists/quicklisp/software/iolib-v0.8.3/iolib.asd: The variable C::*CC-FLAGS* is unbound.
ecl-16.1.2-unknown-linux-x86-lisp-to-c
(LOAD hu.dwim.util.test FAIL) COMMON-LISP:SIMPLE-TYPE-ERROR : The assertion (<= (LENGTH METACOPY-SYSTEM::PATHS) 1) failed
(LOAD hu.dwim.util.documentation FAIL) ffi, CFFI:LOAD-FOREIGN-LIBRARY-ERROR : Unable to load any of the alternatives: ("libgvc.so" "libgvc.so.4" "libgvc32.so.4")
(LOAD hu.dwim.util.test FAIL) COMMON-LISP:SIMPLE-TYPE-ERROR : The assertion (<= (LENGTH METACOPY-SYSTEM::PATHS) 1) failed
(LOAD hu.dwim.util.documentation FAIL) ffi, CFFI:LOAD-FOREIGN-LIBRARY-ERROR : Unable to load any of the alternatives: ("libgvc.so" "libgvc.so.4" "libgvc32.so.4")
sbcl-1.0.58-linux-x86
(LOAD hu.dwim.util.test FAIL) ASDF:LOAD-SYSTEM-DEFINITION-ERROR : Error while trying to load definition for system hu.dwim.util.test from pathname /home/testgrid/cl-test-grid/work-dir/agent/quicklisp/dists/quicklisp/software/hu.dwim.util-20171019-darcs/hu.dwim.util.test.asd: Error while invoking #<COMPILE-OP NIL {B14C799}> on #<CL-SOURCE-FILE "uiop" "image">
(LOAD hu.dwim.util.documentation FAIL) ASDF:LOAD-SYSTEM-DEFINITION-ERROR : Error while trying to load definition for system hu.dwim.util.documentation from pathname /home/testgrid/cl-test-grid/work-dir/agent/quicklisp/dists/quicklisp/software/hu.dwim.util-20171019-darcs/hu.dwim.util.documentation.asd: Error while invoking #<COMPILE-OP NIL {B14B799}> on #<CL-SOURCE-FILE "uiop" "image">
(LOAD hu.dwim.util+iolib FAIL) ASDF:LOAD-SYSTEM-DEFINITION-ERROR : Error while trying to load definition for system hu.dwim.util+iolib from pathname /home/testgrid/cl-test-grid/work-dir/agent/quicklisp/dists/quicklisp/software/hu.dwim.util-20171019-darcs/hu.dwim.util+iolib.asd: Error while invoking #<COMPILE-OP NIL {B14A799}> on #<CL-SOURCE-FILE "uiop" "image">
(LOAD hu.dwim.util FAIL) ASDF:LOAD-SYSTEM-DEFINITION-ERROR : Error while trying to load definition for system hu.dwim.util from pathname /home/testgrid/cl-test-grid/work-dir/agent/quicklisp/dists/quicklisp/software/hu.dwim.util-20171019-darcs/hu.dwim.util.asd: Error while invoking #<COMPILE-OP NIL {B14C799}> on #<CL-SOURCE-FILE "uiop" "image">
(LOAD hu.dwim.util.test FAIL) ASDF:LOAD-SYSTEM-DEFINITION-ERROR : Error while trying to load definition for system hu.dwim.util.test from pathname /home/testgrid/cl-test-grid/work-dir/agent/quicklisp/dists/quicklisp/software/hu.dwim.util-20171019-darcs/hu.dwim.util.test.asd: Error while invoking #<COMPILE-OP NIL {B14C799}> on #<CL-SOURCE-FILE "uiop" "image">
(LOAD hu.dwim.util.documentation FAIL) ASDF:LOAD-SYSTEM-DEFINITION-ERROR : Error while trying to load definition for system hu.dwim.util.documentation from pathname /home/testgrid/cl-test-grid/work-dir/agent/quicklisp/dists/quicklisp/software/hu.dwim.util-20171019-darcs/hu.dwim.util.documentation.asd: Error while invoking #<COMPILE-OP NIL {B14B799}> on #<CL-SOURCE-FILE "uiop" "image">
(LOAD hu.dwim.util+iolib FAIL) ASDF:LOAD-SYSTEM-DEFINITION-ERROR : Error while trying to load definition for system hu.dwim.util+iolib from pathname /home/testgrid/cl-test-grid/work-dir/agent/quicklisp/dists/quicklisp/software/hu.dwim.util-20171019-darcs/hu.dwim.util+iolib.asd: Error while invoking #<COMPILE-OP NIL {B14A799}> on #<CL-SOURCE-FILE "uiop" "image">
(LOAD hu.dwim.util FAIL) ASDF:LOAD-SYSTEM-DEFINITION-ERROR : Error while trying to load definition for system hu.dwim.util from pathname /home/testgrid/cl-test-grid/work-dir/agent/quicklisp/dists/quicklisp/software/hu.dwim.util-20171019-darcs/hu.dwim.util.asd: Error while invoking #<COMPILE-OP NIL {B14C799}> on #<CL-SOURCE-FILE "uiop" "image">
sbcl-1.1.11-linux-x86
(LOAD hu.dwim.util.test FAIL) needs newer ASDF, ASDF/FIND-SYSTEM:LOAD-SYSTEM-DEFINITION-ERROR : Error while trying to load definition for system hu.dwim.util.test from pathname /home/testgrid/cl-test-grid/work-dir/agent/quicklisp/dists/quicklisp/software/hu.dwim.util-20171019-darcs/hu.dwim.util.test.asd: no symbol named "NON-PROPAGATING-OPERATION" in "ASDF/INTERFACE"
(LOAD hu.dwim.util.documentation FAIL) needs newer ASDF, ASDF/FIND-SYSTEM:LOAD-SYSTEM-DEFINITION-ERROR : Error while trying to load definition for system hu.dwim.util.documentation from pathname /home/testgrid/cl-test-grid/work-dir/agent/quicklisp/dists/quicklisp/software/hu.dwim.util-20171019-darcs/hu.dwim.util.documentation.asd: no symbol named "NON-PROPAGATING-OPERATION" in "ASDF/INTERFACE"
(LOAD hu.dwim.util+iolib FAIL) needs newer ASDF, ASDF/FIND-SYSTEM:LOAD-SYSTEM-DEFINITION-ERROR : Error while trying to load definition for system hu.dwim.util+iolib from pathname /home/testgrid/cl-test-grid/work-dir/agent/quicklisp/dists/quicklisp/software/hu.dwim.util-20171019-darcs/hu.dwim.util+iolib.asd: no symbol named "NON-PROPAGATING-OPERATION" in "ASDF/INTERFACE"
(LOAD hu.dwim.util FAIL) needs newer ASDF, ASDF/FIND-SYSTEM:LOAD-SYSTEM-DEFINITION-ERROR : Error while trying to load definition for system hu.dwim.util from pathname /home/testgrid/cl-test-grid/work-dir/agent/quicklisp/dists/quicklisp/software/hu.dwim.util-20171019-darcs/hu.dwim.util.asd: no symbol named "NON-PROPAGATING-OPERATION" in "ASDF/INTERFACE"
(LOAD hu.dwim.util.test FAIL) needs newer ASDF, ASDF/FIND-SYSTEM:LOAD-SYSTEM-DEFINITION-ERROR : Error while trying to load definition for system hu.dwim.util.test from pathname /home/testgrid/cl-test-grid/work-dir/agent/quicklisp/dists/quicklisp/software/hu.dwim.util-20171019-darcs/hu.dwim.util.test.asd: no symbol named "NON-PROPAGATING-OPERATION" in "ASDF/INTERFACE"
(LOAD hu.dwim.util.documentation FAIL) needs newer ASDF, ASDF/FIND-SYSTEM:LOAD-SYSTEM-DEFINITION-ERROR : Error while trying to load definition for system hu.dwim.util.documentation from pathname /home/testgrid/cl-test-grid/work-dir/agent/quicklisp/dists/quicklisp/software/hu.dwim.util-20171019-darcs/hu.dwim.util.documentation.asd: no symbol named "NON-PROPAGATING-OPERATION" in "ASDF/INTERFACE"
(LOAD hu.dwim.util+iolib FAIL) needs newer ASDF, ASDF/FIND-SYSTEM:LOAD-SYSTEM-DEFINITION-ERROR : Error while trying to load definition for system hu.dwim.util+iolib from pathname /home/testgrid/cl-test-grid/work-dir/agent/quicklisp/dists/quicklisp/software/hu.dwim.util-20171019-darcs/hu.dwim.util+iolib.asd: no symbol named "NON-PROPAGATING-OPERATION" in "ASDF/INTERFACE"
(LOAD hu.dwim.util FAIL) needs newer ASDF, ASDF/FIND-SYSTEM:LOAD-SYSTEM-DEFINITION-ERROR : Error while trying to load definition for system hu.dwim.util from pathname /home/testgrid/cl-test-grid/work-dir/agent/quicklisp/dists/quicklisp/software/hu.dwim.util-20171019-darcs/hu.dwim.util.asd: no symbol named "NON-PROPAGATING-OPERATION" in "ASDF/INTERFACE"
sbcl-1.1.16-linux-x86
(LOAD hu.dwim.util.test FAIL) needs newer ASDF, ASDF/FIND-SYSTEM:LOAD-SYSTEM-DEFINITION-ERROR : Error while trying to load definition for system hu.dwim.util.test from pathname /home/testgrid/cl-test-grid/work-dir/agent/quicklisp/dists/quicklisp/software/hu.dwim.util-20171019-darcs/hu.dwim.util.test.asd: no symbol named "NON-PROPAGATING-OPERATION" in "ASDF/INTERFACE"
(LOAD hu.dwim.util.documentation FAIL) needs newer ASDF, ASDF/FIND-SYSTEM:LOAD-SYSTEM-DEFINITION-ERROR : Error while trying to load definition for system hu.dwim.util.documentation from pathname /home/testgrid/cl-test-grid/work-dir/agent/quicklisp/dists/quicklisp/software/hu.dwim.util-20171019-darcs/hu.dwim.util.documentation.asd: no symbol named "NON-PROPAGATING-OPERATION" in "ASDF/INTERFACE"
(LOAD hu.dwim.util+iolib FAIL) needs newer ASDF, ASDF/FIND-SYSTEM:LOAD-SYSTEM-DEFINITION-ERROR : Error while trying to load definition for system hu.dwim.util+iolib from pathname /home/testgrid/cl-test-grid/work-dir/agent/quicklisp/dists/quicklisp/software/hu.dwim.util-20171019-darcs/hu.dwim.util+iolib.asd: no symbol named "NON-PROPAGATING-OPERATION" in "ASDF/INTERFACE"
(LOAD hu.dwim.util FAIL) needs newer ASDF, ASDF/FIND-SYSTEM:LOAD-SYSTEM-DEFINITION-ERROR : Error while trying to load definition for system hu.dwim.util from pathname /home/testgrid/cl-test-grid/work-dir/agent/quicklisp/dists/quicklisp/software/hu.dwim.util-20171019-darcs/hu.dwim.util.asd: no symbol named "NON-PROPAGATING-OPERATION" in "ASDF/INTERFACE"
(LOAD hu.dwim.util.test FAIL) needs newer ASDF, ASDF/FIND-SYSTEM:LOAD-SYSTEM-DEFINITION-ERROR : Error while trying to load definition for system hu.dwim.util.test from pathname /home/testgrid/cl-test-grid/work-dir/agent/quicklisp/dists/quicklisp/software/hu.dwim.util-20171019-darcs/hu.dwim.util.test.asd: no symbol named "NON-PROPAGATING-OPERATION" in "ASDF/INTERFACE"
(LOAD hu.dwim.util.documentation FAIL) needs newer ASDF, ASDF/FIND-SYSTEM:LOAD-SYSTEM-DEFINITION-ERROR : Error while trying to load definition for system hu.dwim.util.documentation from pathname /home/testgrid/cl-test-grid/work-dir/agent/quicklisp/dists/quicklisp/software/hu.dwim.util-20171019-darcs/hu.dwim.util.documentation.asd: no symbol named "NON-PROPAGATING-OPERATION" in "ASDF/INTERFACE"
(LOAD hu.dwim.util+iolib FAIL) needs newer ASDF, ASDF/FIND-SYSTEM:LOAD-SYSTEM-DEFINITION-ERROR : Error while trying to load definition for system hu.dwim.util+iolib from pathname /home/testgrid/cl-test-grid/work-dir/agent/quicklisp/dists/quicklisp/software/hu.dwim.util-20171019-darcs/hu.dwim.util+iolib.asd: no symbol named "NON-PROPAGATING-OPERATION" in "ASDF/INTERFACE"
(LOAD hu.dwim.util FAIL) needs newer ASDF, ASDF/FIND-SYSTEM:LOAD-SYSTEM-DEFINITION-ERROR : Error while trying to load definition for system hu.dwim.util from pathname /home/testgrid/cl-test-grid/work-dir/agent/quicklisp/dists/quicklisp/software/hu.dwim.util-20171019-darcs/hu.dwim.util.asd: no symbol named "NON-PROPAGATING-OPERATION" in "ASDF/INTERFACE"
sbcl-1.2.6-linux-x86
(LOAD hu.dwim.util.test FAIL) ffi, CFFI:LOAD-FOREIGN-LIBRARY-ERROR : Unable to load foreign library (ZLIB). Error opening shared object "libz.so": libz.so: cannot open shared object file: No such file or directory.
(LOAD hu.dwim.util.documentation FAIL) ffi, CFFI:LOAD-FOREIGN-LIBRARY-ERROR : Unable to load any of the alternatives: ("libgvc.so" "libgvc.so.4" "libgvc32.so.4")
(LOAD hu.dwim.util.test FAIL) ffi, CFFI:LOAD-FOREIGN-LIBRARY-ERROR : Unable to load foreign library (ZLIB). Error opening shared object "libz.so": libz.so: cannot open shared object file: No such file or directory.
(LOAD hu.dwim.util.documentation FAIL) ffi, CFFI:LOAD-FOREIGN-LIBRARY-ERROR : Unable to load any of the alternatives: ("libgvc.so" "libgvc.so.4" "libgvc32.so.4")
sbcl-1.3.12-linux-arm
(LOAD hu.dwim.util.test FAIL) COMMON-LISP:SIMPLE-ERROR : Couldn't execute "g++": No such file or directory
(LOAD hu.dwim.util.documentation FAIL) ffi, CFFI:LOAD-FOREIGN-LIBRARY-ERROR : Unable to load any of the alternatives: ("libgvc.so" "libgvc.so.4" "libgvc32.so.4")
(LOAD hu.dwim.util+iolib FAIL) COMMON-LISP:SIMPLE-ERROR : Couldn't execute "g++": No such file or directory
(LOAD hu.dwim.util.test FAIL) COMMON-LISP:SIMPLE-ERROR : Couldn't execute "g++": No such file or directory
(LOAD hu.dwim.util.documentation FAIL) ffi, CFFI:LOAD-FOREIGN-LIBRARY-ERROR : Unable to load any of the alternatives: ("libgvc.so" "libgvc.so.4" "libgvc32.so.4")
(LOAD hu.dwim.util+iolib FAIL) COMMON-LISP:SIMPLE-ERROR : Couldn't execute "g++": No such file or directory
sbcl-1.3.12-linux-x86
(LOAD hu.dwim.util.test FAIL) ffi, CFFI:LOAD-FOREIGN-LIBRARY-ERROR : Unable to load foreign library (ZLIB). Error opening shared object "libz.so": libz.so: cannot open shared object file: No such file or directory.
(LOAD hu.dwim.util.documentation FAIL) ffi, CFFI:LOAD-FOREIGN-LIBRARY-ERROR : Unable to load any of the alternatives: ("libgvc.so" "libgvc.so.4" "libgvc32.so.4")
(LOAD hu.dwim.util.test FAIL) ffi, CFFI:LOAD-FOREIGN-LIBRARY-ERROR : Unable to load foreign library (ZLIB). Error opening shared object "libz.so": libz.so: cannot open shared object file: No such file or directory.
(LOAD hu.dwim.util.documentation FAIL) ffi, CFFI:LOAD-FOREIGN-LIBRARY-ERROR : Unable to load any of the alternatives: ("libgvc.so" "libgvc.so.4" "libgvc32.so.4")
sbcl-1.3.17-linux-x86
(LOAD hu.dwim.util.test FAIL) ffi, CFFI:LOAD-FOREIGN-LIBRARY-ERROR : Unable to load foreign library (ZLIB). Error opening shared object "libz.so": libz.so: cannot open shared object file: No such file or directory.
(LOAD hu.dwim.util.documentation FAIL) ffi, CFFI:LOAD-FOREIGN-LIBRARY-ERROR : Unable to load any of the alternatives: ("libgvc.so" "libgvc.so.4" "libgvc32.so.4")
(LOAD hu.dwim.util.test FAIL) ffi, CFFI:LOAD-FOREIGN-LIBRARY-ERROR : Unable to load foreign library (ZLIB). Error opening shared object "libz.so": libz.so: cannot open shared object file: No such file or directory.
(LOAD hu.dwim.util.documentation FAIL) ffi, CFFI:LOAD-FOREIGN-LIBRARY-ERROR : Unable to load any of the alternatives: ("libgvc.so" "libgvc.so.4" "libgvc32.so.4")
sbcl-1.3.2.92-4077405-dirty-linux-arm
(LOAD hu.dwim.util.test FAIL) SB-INT:BUG : failed AVER: (OR (SB-ARM-ASM::REGISTER-P SB-ARM-ASM::OPERAND) (TYPEP SB-ARM-ASM::OPERAND '(INTEGER 1 31))) This is probably a bug in SBCL itself. (Alternatively, SBCL might have been corrupted by bad user code, e.g. by an undefined Lisp operation like (FMAKUNBOUND 'COMPILE), or by stray pointers from alien code or from unsafe Lisp code; or there might be a bug in the OS or hardware that SBCL is running on.) If it seems to be a bug in SBCL itself, the maintainers would like to know about it. Bug reports are welcome on the SBCL mailing lists, which you can find at <http://sbcl.sourceforge.net/>.
(LOAD hu.dwim.util.documentation FAIL) ffi, CFFI:LOAD-FOREIGN-LIBRARY-ERROR : Unable to load any of the alternatives: ("libgvc.so" "libgvc.so.4" "libgvc32.so.4")
(LOAD hu.dwim.util+iolib FAIL) IOLIB/GROVEL::GROVEL-ERROR : External process exited with code 1. Command was: "g++" "-marm" "-Wno-write-strings" "-I/home/testgrid/cl-test-grid/work-dir/agent/quicklisp/dists/quicklisp/software/iolib-v0.8.3/src/grovel/" "-o" "/home/testgrid/cl-test-grid/work-dir/agent/test-runs/20180202092014-sbcl-1.3.2.92-4077405-dirty-linux-arm/fasl/ql/dists/quicklisp/software/iolib-v0.8.3/src/syscalls/ffi-types-unix" "/home/testgrid/cl-test-grid/work-dir/agent/test-runs/20180202092014-sbcl-1.3.2.92-4077405-dirty-linux-arm/fasl/ql/dists/quicklisp/software/iolib-v0.8.3/src/syscalls/ffi-types-unix.c" Output was: Error output was: /home/testgrid/cl-test-grid/work-dir/agent/test-runs/20180202092014-sbcl-1.3.2.92-4077405-dirty-linux-arm/fasl/ql/dists/quicklisp/software/iolib-v0.8.3/src/syscalls/ffi-types-unix.c:14:17: fatal error: lfp.h: No such file or directory compilation terminated.
(LOAD hu.dwim.util.test FAIL) SB-INT:BUG : failed AVER: (OR (SB-ARM-ASM::REGISTER-P SB-ARM-ASM::OPERAND) (TYPEP SB-ARM-ASM::OPERAND '(INTEGER 1 31))) This is probably a bug in SBCL itself. (Alternatively, SBCL might have been corrupted by bad user code, e.g. by an undefined Lisp operation like (FMAKUNBOUND 'COMPILE), or by stray pointers from alien code or from unsafe Lisp code; or there might be a bug in the OS or hardware that SBCL is running on.) If it seems to be a bug in SBCL itself, the maintainers would like to know about it. Bug reports are welcome on the SBCL mailing lists, which you can find at <http://sbcl.sourceforge.net/>.
(LOAD hu.dwim.util.documentation FAIL) ffi, CFFI:LOAD-FOREIGN-LIBRARY-ERROR : Unable to load any of the alternatives: ("libgvc.so" "libgvc.so.4" "libgvc32.so.4")
(LOAD hu.dwim.util+iolib FAIL) IOLIB/GROVEL::GROVEL-ERROR : External process exited with code 1. Command was: "g++" "-marm" "-Wno-write-strings" "-I/home/testgrid/cl-test-grid/work-dir/agent/quicklisp/dists/quicklisp/software/iolib-v0.8.3/src/grovel/" "-o" "/home/testgrid/cl-test-grid/work-dir/agent/test-runs/20180114035343-sbcl-1.3.2.92-4077405-dirty-linux-arm/fasl/ql/dists/quicklisp/software/iolib-v0.8.3/src/syscalls/ffi-types-unix" "/home/testgrid/cl-test-grid/work-dir/agent/test-runs/20180114035343-sbcl-1.3.2.92-4077405-dirty-linux-arm/fasl/ql/dists/quicklisp/software/iolib-v0.8.3/src/syscalls/ffi-types-unix.c" Output was: Error output was: /home/testgrid/cl-test-grid/work-dir/agent/test-runs/20180114035343-sbcl-1.3.2.92-4077405-dirty-linux-arm/fasl/ql/dists/quicklisp/software/iolib-v0.8.3/src/syscalls/ffi-types-unix.c:14:17: fatal error: lfp.h: No such file or directory compilation terminated.
sbcl-1.3.2.92-4077405-macosx-x64
(LOAD hu.dwim.util.test FAIL) IOLIB/GROVEL::GROVEL-ERROR : External process exited with code 1. Command was: "g++" "-m64" "-Wno-write-strings" "-I" "/opt/local/include/" "-I/Volumes/Transcend/testgrid/cl-test-grid/work-dir/agent/quicklisp/dists/quicklisp/software/iolib-v0.8.3/src/grovel/" "-o" "/Volumes/Transcend/testgrid/cl-test-grid/work-dir/agent/test-runs/20180114084110-sbcl-1.3.2.92-4077405-macosx-x64/fasl/ql/dists/quicklisp/software/iolib-v0.8.3/src/syscalls/ffi-types-unix" "/Volumes/Transcend/testgrid/cl-test-grid/work-dir/agent/test-runs/20180114084110-sbcl-1.3.2.92-4077405-macosx-x64/fasl/ql/dists/quicklisp/software/iolib-v0.8.3/src/syscalls/ffi-types-unix.c" Output was: Error output was: clang: warning: treating 'c' input as 'c++' when in C++ mode, this behavior is deprecated /Volumes/Transcend/testgrid/cl-test-grid/work-dir/agent/test-runs/20180114084110-sbcl-1.3.2.92-4077405-macosx-x64/fasl/ql/dists/quicklisp/software/iolib-v0.8.3/src/syscalls/ffi-types-unix.c:6:10: fatal error: 'lfp.h' file not found #include <lfp.h> ^ 1 error generated.
(LOAD hu.dwim.util.documentation FAIL) ffi, CFFI:LOAD-FOREIGN-LIBRARY-ERROR : Unable to load any of the alternatives: ("libgvc.so" "libgvc.so.4" "libgvc32.so.4")
(LOAD hu.dwim.util+iolib FAIL) IOLIB/GROVEL::GROVEL-ERROR : External process exited with code 1. Command was: "g++" "-m64" "-Wno-write-strings" "-I" "/opt/local/include/" "-I/Volumes/Transcend/testgrid/cl-test-grid/work-dir/agent/quicklisp/dists/quicklisp/software/iolib-v0.8.3/src/grovel/" "-o" "/Volumes/Transcend/testgrid/cl-test-grid/work-dir/agent/test-runs/20180114084110-sbcl-1.3.2.92-4077405-macosx-x64/fasl/ql/dists/quicklisp/software/iolib-v0.8.3/src/syscalls/ffi-types-unix" "/Volumes/Transcend/testgrid/cl-test-grid/work-dir/agent/test-runs/20180114084110-sbcl-1.3.2.92-4077405-macosx-x64/fasl/ql/dists/quicklisp/software/iolib-v0.8.3/src/syscalls/ffi-types-unix.c" Output was: Error output was: clang: warning: treating 'c' input as 'c++' when in C++ mode, this behavior is deprecated /Volumes/Transcend/testgrid/cl-test-grid/work-dir/agent/test-runs/20180114084110-sbcl-1.3.2.92-4077405-macosx-x64/fasl/ql/dists/quicklisp/software/iolib-v0.8.3/src/syscalls/ffi-types-unix.c:6:10: fatal error: 'lfp.h' file not found #include <lfp.h> ^ 1 error generated.
sbcl-1.3.20-linux-x86
(LOAD hu.dwim.util.test FAIL) ffi, CFFI:LOAD-FOREIGN-LIBRARY-ERROR : Unable to load foreign library (ZLIB). Error opening shared object #A((7) COMMON-LISP:BASE-CHAR . "libz.so"): libz.so: cannot open shared object file: No such file or directory.
(LOAD hu.dwim.util.documentation FAIL) ffi, CFFI:LOAD-FOREIGN-LIBRARY-ERROR : Unable to load any of the alternatives: ("libgvc.so" "libgvc.so.4" "libgvc32.so.4")
(LOAD hu.dwim.util.test FAIL) ffi, CFFI:LOAD-FOREIGN-LIBRARY-ERROR : Unable to load foreign library (ZLIB). Error opening shared object #A((7) COMMON-LISP:BASE-CHAR . "libz.so"): libz.so: cannot open shared object file: No such file or directory.
(LOAD hu.dwim.util.documentation FAIL) ffi, CFFI:LOAD-FOREIGN-LIBRARY-ERROR : Unable to load any of the alternatives: ("libgvc.so" "libgvc.so.4" "libgvc32.so.4")
sbcl-1.3.21-linux-x86
(LOAD hu.dwim.util.test FAIL) ffi, CFFI:LOAD-FOREIGN-LIBRARY-ERROR : Unable to load foreign library (ZLIB). Error opening shared object #A((7) COMMON-LISP:BASE-CHAR . "libz.so"): libz.so: cannot open shared object file: No such file or directory.
(LOAD hu.dwim.util.documentation FAIL) ffi, CFFI:LOAD-FOREIGN-LIBRARY-ERROR : Unable to load any of the alternatives: ("libgvc.so" "libgvc.so.4" "libgvc32.so.4")
(LOAD hu.dwim.util.test FAIL) ffi, CFFI:LOAD-FOREIGN-LIBRARY-ERROR : Unable to load foreign library (ZLIB). Error opening shared object #A((7) COMMON-LISP:BASE-CHAR . "libz.so"): libz.so: cannot open shared object file: No such file or directory.
(LOAD hu.dwim.util.documentation FAIL) ffi, CFFI:LOAD-FOREIGN-LIBRARY-ERROR : Unable to load any of the alternatives: ("libgvc.so" "libgvc.so.4" "libgvc32.so.4")

Breakdown by testcases: for every failed testcase the lisp implmentations it fails on

The library does not have a testsuite adapter for CL Test Grid.

To reports overview

Generated at: 2018-02-13 22:58:24 GMT.