hu.dwim.uri results collected by cl-test-grid

Results on the last two Quicklisp distributions

 quicklisp 2015-06-08quicklisp 2015-05-05
abcl-1.2.1-fasl42-linux-x86
(LOAD hu.dwim.uri.test FAIL) needs newer ASDF, ASDF/FIND-SYSTEM:LOAD-SYSTEM-DEFINITION-ERROR : Error while trying to load definition for system hu.dwim.uri.test from pathname /home/testgrid/cl-test-grid/work-dir/agent/quicklisp/dists/quicklisp/software/hu.dwim.uri-20150608-darcs/hu.dwim.uri.test.asd: The symbol NON-PROPAGATING-OPERATION is not present in package ASDF/INTERFACE.
(LOAD hu.dwim.uri FAIL) needs newer ASDF, ASDF/FIND-SYSTEM:LOAD-SYSTEM-DEFINITION-ERROR : Error while trying to load definition for system hu.dwim.uri from pathname /home/testgrid/cl-test-grid/work-dir/agent/quicklisp/dists/quicklisp/software/hu.dwim.uri-20150608-darcs/hu.dwim.uri.asd: The symbol NON-PROPAGATING-OPERATION is not present in package ASDF/INTERFACE.
(LOAD hu.dwim.uri.test FAIL) ASDF/FIND-SYSTEM:MISSING-COMPONENT : Component "iolib/sockets" not found
(LOAD hu.dwim.uri FAIL) ASDF/FIND-SYSTEM:MISSING-COMPONENT : Component "iolib/sockets" not found
abcl-1.3.0-fasl42-linux-x86
abcl-1.3.1-fasl42-linux-x86
abcl-1.3.2-fasl42-linux-x86
ccl-1.10-r16196-f96-linux-x64
(LOAD hu.dwim.uri.test FAIL) COMMON-LISP:SIMPLE-ERROR : External process exited with code 1. Command was: "g++" "-m64" "-Wno-write-strings" "-I/home/hijarian/systems/cl-test-grid/work-dir/agent/quicklisp/dists/quicklisp/software/iolib-20150302-git/src/grovel/" "-o" "/home/hijarian/systems/cl-test-grid/work-dir/agent/test-runs/20150609102449-ccl-1.10-r16196-f96-linux-x64/fasl/ql/dists/quicklisp/software/iolib-20150302-git/src/syscalls/ffi-types-unix" "/home/hijarian/systems/cl-test-grid/work-dir/agent/test-runs/20150609102449-ccl-1.10-r16196-f96-linux-x64/fasl/ql/dists/quicklisp/software/iolib-20150302-git/src/syscalls/ffi-types-unix.c" Output was: /home/hijarian/systems/cl-test-grid/work-dir/agent/test-runs/20150609102449-ccl-1.10-r16196-f96-linux-x64/fasl/ql/dists/quicklisp/software/iolib-20150302-git/src/syscalls/ffi-types-unix.c:14:17: fatal error: lfp.h: Нет такого файла или каталога #include <lfp.h> ^ compilation terminated.
(LOAD hu.dwim.uri FAIL) COMMON-LISP:SIMPLE-ERROR : External process exited with code 1. Command was: "g++" "-m64" "-Wno-write-strings" "-I/home/hijarian/systems/cl-test-grid/work-dir/agent/quicklisp/dists/quicklisp/software/iolib-20150302-git/src/grovel/" "-o" "/home/hijarian/systems/cl-test-grid/work-dir/agent/test-runs/20150609102449-ccl-1.10-r16196-f96-linux-x64/fasl/ql/dists/quicklisp/software/iolib-20150302-git/src/syscalls/ffi-types-unix" "/home/hijarian/systems/cl-test-grid/work-dir/agent/test-runs/20150609102449-ccl-1.10-r16196-f96-linux-x64/fasl/ql/dists/quicklisp/software/iolib-20150302-git/src/syscalls/ffi-types-unix.c" Output was: /home/hijarian/systems/cl-test-grid/work-dir/agent/test-runs/20150609102449-ccl-1.10-r16196-f96-linux-x64/fasl/ql/dists/quicklisp/software/iolib-20150302-git/src/syscalls/ffi-types-unix.c:14:17: fatal error: lfp.h: Нет такого файла или каталога #include <lfp.h> ^ compilation terminated.
(LOAD hu.dwim.uri.test FAIL) COMMON-LISP:SIMPLE-ERROR : External process exited with code 1. Command was: "g++" "-m64" "-Wno-write-strings" "-I/home/hijarian/systems/cl-test-grid/work-dir/agent/quicklisp/dists/quicklisp/software/iolib-20150302-git/src/grovel/" "-o" "/home/hijarian/systems/cl-test-grid/work-dir/agent/test-runs/20150518161431-ccl-1.10-r16196-f96-linux-x64/fasl/ql/dists/quicklisp/software/iolib-20150302-git/src/syscalls/ffi-types-unix" "/home/hijarian/systems/cl-test-grid/work-dir/agent/test-runs/20150518161431-ccl-1.10-r16196-f96-linux-x64/fasl/ql/dists/quicklisp/software/iolib-20150302-git/src/syscalls/ffi-types-unix.c" Output was: /home/hijarian/systems/cl-test-grid/work-dir/agent/test-runs/20150518161431-ccl-1.10-r16196-f96-linux-x64/fasl/ql/dists/quicklisp/software/iolib-20150302-git/src/syscalls/ffi-types-unix.c:14:17: fatal error: lfp.h: Нет такого файла или каталога #include <lfp.h> ^ compilation terminated.
(LOAD hu.dwim.uri FAIL) COMMON-LISP:SIMPLE-ERROR : External process exited with code 1. Command was: "g++" "-m64" "-Wno-write-strings" "-I/home/hijarian/systems/cl-test-grid/work-dir/agent/quicklisp/dists/quicklisp/software/iolib-20150302-git/src/grovel/" "-o" "/home/hijarian/systems/cl-test-grid/work-dir/agent/test-runs/20150518161431-ccl-1.10-r16196-f96-linux-x64/fasl/ql/dists/quicklisp/software/iolib-20150302-git/src/syscalls/ffi-types-unix" "/home/hijarian/systems/cl-test-grid/work-dir/agent/test-runs/20150518161431-ccl-1.10-r16196-f96-linux-x64/fasl/ql/dists/quicklisp/software/iolib-20150302-git/src/syscalls/ffi-types-unix.c" Output was: /home/hijarian/systems/cl-test-grid/work-dir/agent/test-runs/20150518161431-ccl-1.10-r16196-f96-linux-x64/fasl/ql/dists/quicklisp/software/iolib-20150302-git/src/syscalls/ffi-types-unix.c:14:17: fatal error: lfp.h: Нет такого файла или каталога #include <lfp.h> ^ compilation terminated.
ccl-1.10-r16196-f96-linux-x86
ccl-1.8-r15286m-f95-linux-x86
(LOAD hu.dwim.uri.test FAIL) ASDF:LOAD-SYSTEM-DEFINITION-ERROR : Error while trying to load definition for system hu.dwim.uri.test from pathname /home/testgrid/cl-test-grid/work-dir/agent/quicklisp/dists/quicklisp/software/hu.dwim.uri-20150608-darcs/hu\.dwim\.uri\.test.asd: Cannot IMPORT "NON-PROPAGATING-OPERATION" from package "ASDF"
(LOAD hu.dwim.uri FAIL) ASDF:LOAD-SYSTEM-DEFINITION-ERROR : Error while trying to load definition for system hu.dwim.uri from pathname /home/testgrid/cl-test-grid/work-dir/agent/quicklisp/dists/quicklisp/software/hu.dwim.uri-20150608-darcs/hu\.dwim\.uri.asd: Cannot IMPORT "NON-PROPAGATING-OPERATION" from package "ASDF"
(LOAD hu.dwim.uri.test FAIL) ASDF:LOAD-SYSTEM-DEFINITION-ERROR : Error while trying to load definition for system swap-bytes from pathname /home/testgrid/cl-test-grid/work-dir/agent/quicklisp/dists/quicklisp/software/swap-bytes-20140713-git/swap-bytes.asd: You need ASDF >= 2.32 to load this system correctly.
(LOAD hu.dwim.uri FAIL) ASDF:LOAD-SYSTEM-DEFINITION-ERROR : Error while trying to load definition for system swap-bytes from pathname /home/testgrid/cl-test-grid/work-dir/agent/quicklisp/dists/quicklisp/software/swap-bytes-20140713-git/swap-bytes.asd: You need ASDF >= 2.32 to load this system correctly.
ccl-1.9-r15756-f96-linux-x86
(LOAD hu.dwim.uri.test FAIL) needs newer ASDF, ASDF/FIND-SYSTEM:LOAD-SYSTEM-DEFINITION-ERROR : Error while trying to load definition for system hu.dwim.uri.test from pathname /home/testgrid/cl-test-grid/work-dir/agent/quicklisp/dists/quicklisp/software/hu.dwim.uri-20150608-darcs/hu\.dwim\.uri\.test.asd: Cannot IMPORT "NON-PROPAGATING-OPERATION" from package "ASDF"
(LOAD hu.dwim.uri FAIL) needs newer ASDF, ASDF/FIND-SYSTEM:LOAD-SYSTEM-DEFINITION-ERROR : Error while trying to load definition for system hu.dwim.uri from pathname /home/testgrid/cl-test-grid/work-dir/agent/quicklisp/dists/quicklisp/software/hu.dwim.uri-20150608-darcs/hu\.dwim\.uri.asd: Cannot IMPORT "NON-PROPAGATING-OPERATION" from package "ASDF"
(LOAD hu.dwim.uri.test FAIL) ASDF/FIND-SYSTEM:MISSING-COMPONENT : Component "iolib/sockets" not found
(LOAD hu.dwim.uri FAIL) ASDF/FIND-SYSTEM:MISSING-COMPONENT : Component "iolib/sockets" not found
clisp-2.49-unix-x64
(LOAD hu.dwim.uri.test FAIL) ASDF:LOAD-SYSTEM-DEFINITION-ERROR : Error while trying to load definition for system hu.dwim.uri.test from pathname /home/hijarian/systems/cl-test-grid/work-dir/agent/quicklisp/dists/quicklisp/software/hu.dwim.uri-20150608-darcs/hu.dwim.uri.test.asd: DEFPACKAGE HU.DWIM.ASDF: Не существует символа ASDF::NON-PROPAGATING-OPERATION .
(LOAD hu.dwim.uri FAIL) ASDF:LOAD-SYSTEM-DEFINITION-ERROR : Error while trying to load definition for system hu.dwim.uri from pathname /home/hijarian/systems/cl-test-grid/work-dir/agent/quicklisp/dists/quicklisp/software/hu.dwim.uri-20150608-darcs/hu.dwim.uri.asd: DEFPACKAGE HU.DWIM.ASDF: Не существует символа ASDF::NON-PROPAGATING-OPERATION .
(LOAD hu.dwim.uri.test FAIL) ASDF:LOAD-SYSTEM-DEFINITION-ERROR : Error while trying to load definition for system swap-bytes from pathname /home/hijarian/systems/cl-test-grid/work-dir/agent/quicklisp/dists/quicklisp/software/swap-bytes-20140713-git/swap-bytes.asd: You need ASDF >= 2.32 to load this system correctly.
(LOAD hu.dwim.uri FAIL) ASDF:LOAD-SYSTEM-DEFINITION-ERROR : Error while trying to load definition for system swap-bytes from pathname /home/hijarian/systems/cl-test-grid/work-dir/agent/quicklisp/dists/quicklisp/software/swap-bytes-20140713-git/swap-bytes.asd: You need ASDF >= 2.32 to load this system correctly.
clisp-2.49-unix-x86
(LOAD hu.dwim.uri.test FAIL) ASDF:LOAD-SYSTEM-DEFINITION-ERROR : Error while trying to load definition for system hu.dwim.uri.test from pathname /home/testgrid/cl-test-grid/work-dir/agent/quicklisp/dists/quicklisp/software/hu.dwim.uri-20150608-darcs/hu.dwim.uri.test.asd: DEFPACKAGE HU.DWIM.ASDF: There is no symbol ASDF::NON-PROPAGATING-OPERATION .
(LOAD hu.dwim.uri FAIL) ASDF:LOAD-SYSTEM-DEFINITION-ERROR : Error while trying to load definition for system hu.dwim.uri from pathname /home/testgrid/cl-test-grid/work-dir/agent/quicklisp/dists/quicklisp/software/hu.dwim.uri-20150608-darcs/hu.dwim.uri.asd: DEFPACKAGE HU.DWIM.ASDF: There is no symbol ASDF::NON-PROPAGATING-OPERATION .
(LOAD hu.dwim.uri.test FAIL) ASDF:LOAD-SYSTEM-DEFINITION-ERROR : Error while trying to load definition for system swap-bytes from pathname /home/testgrid/cl-test-grid/work-dir/agent/quicklisp/dists/quicklisp/software/swap-bytes-20140713-git/swap-bytes.asd: You need ASDF >= 2.32 to load this system correctly.
(LOAD hu.dwim.uri FAIL) ASDF:LOAD-SYSTEM-DEFINITION-ERROR : Error while trying to load definition for system swap-bytes from pathname /home/testgrid/cl-test-grid/work-dir/agent/quicklisp/dists/quicklisp/software/swap-bytes-20140713-git/swap-bytes.asd: You need ASDF >= 2.32 to load this system correctly.
cmu-snapshot-2013-04__20d_unicode_-linux-x86
(LOAD hu.dwim.uri.test FAIL) needs newer ASDF, ASDF/FIND-SYSTEM:LOAD-SYSTEM-DEFINITION-ERROR : Error while trying to load definition for system hu.dwim.uri.test from pathname /home/testgrid/cl-test-grid/work-dir/agent/quicklisp/dists/quicklisp/software/hu.dwim.uri-20150608-darcs/hu.dwim.uri.test.asd: ASDF/INTERFACE does not contain a symbol NON-PROPAGATING-OPERATION
(LOAD hu.dwim.uri FAIL) needs newer ASDF, ASDF/FIND-SYSTEM:LOAD-SYSTEM-DEFINITION-ERROR : Error while trying to load definition for system hu.dwim.uri from pathname /home/testgrid/cl-test-grid/work-dir/agent/quicklisp/dists/quicklisp/software/hu.dwim.uri-20150608-darcs/hu.dwim.uri.asd: ASDF/INTERFACE does not contain a symbol NON-PROPAGATING-OPERATION
(LOAD hu.dwim.uri.test FAIL) ASDF/FIND-SYSTEM:MISSING-COMPONENT : Component "iolib/sockets" not found
(LOAD hu.dwim.uri FAIL) ASDF/FIND-SYSTEM:MISSING-COMPONENT : Component "iolib/sockets" not found
cmu-snapshot-2014-01__20e_unicode_-linux-x86
(LOAD hu.dwim.uri.test FAIL) needs newer ASDF, ASDF/FIND-SYSTEM:LOAD-SYSTEM-DEFINITION-ERROR : Error while trying to load definition for system hu.dwim.uri.test from pathname /home/testgrid/cl-test-grid/work-dir/agent/quicklisp/dists/quicklisp/software/hu.dwim.uri-20150608-darcs/hu.dwim.uri.test.asd: ASDF/INTERFACE does not contain a symbol NON-PROPAGATING-OPERATION
(LOAD hu.dwim.uri FAIL) needs newer ASDF, ASDF/FIND-SYSTEM:LOAD-SYSTEM-DEFINITION-ERROR : Error while trying to load definition for system hu.dwim.uri from pathname /home/testgrid/cl-test-grid/work-dir/agent/quicklisp/dists/quicklisp/software/hu.dwim.uri-20150608-darcs/hu.dwim.uri.asd: ASDF/INTERFACE does not contain a symbol NON-PROPAGATING-OPERATION
(LOAD hu.dwim.uri.test FAIL) COMMON-LISP:SIMPLE-ERROR : Error in function USE-PACKAGE: Use'ing package CLOSER-MOP results in name conflicts for these symbols: (TYPEP SUBTYPEP)
(LOAD hu.dwim.uri FAIL) COMMON-LISP:SIMPLE-ERROR : Error in function USE-PACKAGE: Use'ing package CLOSER-MOP results in name conflicts for these symbols: (TYPEP SUBTYPEP)
cmu-snapshot-2014-05-dirty__20e_unicode_-linux-x86
(LOAD hu.dwim.uri.test FAIL) needs newer ASDF, ASDF/FIND-SYSTEM:LOAD-SYSTEM-DEFINITION-ERROR : Error while trying to load definition for system hu.dwim.uri.test from pathname /home/testgrid/cl-test-grid/work-dir/agent/quicklisp/dists/quicklisp/software/hu.dwim.uri-20150608-darcs/hu.dwim.uri.test.asd: ASDF/INTERFACE does not contain a symbol NON-PROPAGATING-OPERATION
(LOAD hu.dwim.uri FAIL) needs newer ASDF, ASDF/FIND-SYSTEM:LOAD-SYSTEM-DEFINITION-ERROR : Error while trying to load definition for system hu.dwim.uri from pathname /home/testgrid/cl-test-grid/work-dir/agent/quicklisp/dists/quicklisp/software/hu.dwim.uri-20150608-darcs/hu.dwim.uri.asd: ASDF/INTERFACE does not contain a symbol NON-PROPAGATING-OPERATION
(LOAD hu.dwim.uri.test FAIL) COMMON-LISP:SIMPLE-ERROR : Error in function USE-PACKAGE: Use'ing package CLOSER-MOP results in name conflicts for these symbols: (TYPEP SUBTYPEP)
(LOAD hu.dwim.uri FAIL) COMMON-LISP:SIMPLE-ERROR : Error in function USE-PACKAGE: Use'ing package CLOSER-MOP results in name conflicts for these symbols: (TYPEP SUBTYPEP)
cmu-snapshot-2014-12___20f_unicode_-linux-x86
(LOAD hu.dwim.uri.test FAIL) COMMON-LISP:SIMPLE-ERROR : Error in function USE-PACKAGE: Use'ing package CLOSER-MOP results in name conflicts for these symbols: (TYPEP SUBTYPEP)
(LOAD hu.dwim.uri FAIL) COMMON-LISP:SIMPLE-ERROR : Error in function USE-PACKAGE: Use'ing package CLOSER-MOP results in name conflicts for these symbols: (TYPEP SUBTYPEP)
(LOAD hu.dwim.uri.test FAIL) COMMON-LISP:SIMPLE-ERROR : Error in function USE-PACKAGE: Use'ing package CLOSER-MOP results in name conflicts for these symbols: (TYPEP SUBTYPEP)
(LOAD hu.dwim.uri FAIL) COMMON-LISP:SIMPLE-ERROR : Error in function USE-PACKAGE: Use'ing package CLOSER-MOP results in name conflicts for these symbols: (TYPEP SUBTYPEP)
ecl-13.5.1-unknown-linux-i686-bytecode
(LOAD hu.dwim.uri.test FAIL) needs newer ASDF, ASDF/FIND-SYSTEM:LOAD-SYSTEM-DEFINITION-ERROR : Error while trying to load definition for system hu.dwim.uri.test from pathname /home/testgrid/cl-test-grid/work-dir/agent/quicklisp/dists/quicklisp/software/hu.dwim.uri-20150608-darcs/hu.dwim.uri.test.asd: Cannot find symbol "NON-PROPAGATING-OPERATION" in package #<"ASDF/INTERFACE" package>
(LOAD hu.dwim.uri FAIL) needs newer ASDF, ASDF/FIND-SYSTEM:LOAD-SYSTEM-DEFINITION-ERROR : Error while trying to load definition for system hu.dwim.uri from pathname /home/testgrid/cl-test-grid/work-dir/agent/quicklisp/dists/quicklisp/software/hu.dwim.uri-20150608-darcs/hu.dwim.uri.asd: Cannot find symbol "NON-PROPAGATING-OPERATION" in package #<"ASDF/INTERFACE" package>
(LOAD hu.dwim.uri.test FAIL) ASDF/FIND-SYSTEM:MISSING-COMPONENT : Component "iolib/sockets" not found
(LOAD hu.dwim.uri FAIL) ASDF/FIND-SYSTEM:MISSING-COMPONENT : Component "iolib/sockets" not found
ecl-13.5.1-unknown-linux-i686-lisp-to-c
(LOAD hu.dwim.uri.test FAIL) ASDF/FIND-SYSTEM:LOAD-SYSTEM-DEFINITION-ERROR : Error while trying to load definition for system hu.dwim.uri.test from pathname /home/testgrid/cl-test-grid/work-dir/agent/quicklisp/dists/quicklisp/software/hu.dwim.uri-20150608-darcs/hu.dwim.uri.test.asd: COMPILE-FILE-ERROR while compiling #<cl-source-file "hu.dwim.asdf" "source" "package">
(LOAD hu.dwim.uri FAIL) ASDF/FIND-SYSTEM:LOAD-SYSTEM-DEFINITION-ERROR : Error while trying to load definition for system hu.dwim.uri from pathname /home/testgrid/cl-test-grid/work-dir/agent/quicklisp/dists/quicklisp/software/hu.dwim.uri-20150608-darcs/hu.dwim.uri.asd: COMPILE-FILE-ERROR while compiling #<cl-source-file "hu.dwim.asdf" "source" "package">
(LOAD hu.dwim.uri.test FAIL) ASDF/FIND-SYSTEM:MISSING-COMPONENT : Component "iolib/sockets" not found
(LOAD hu.dwim.uri FAIL) ASDF/FIND-SYSTEM:MISSING-COMPONENT : Component "iolib/sockets" not found
ecl-15.2.21-ee989b97-linux-i686-bytecode
(LOAD hu.dwim.uri.test FAIL) ASDF/FIND-SYSTEM:LOAD-SYSTEM-DEFINITION-ERROR : Error while trying to load definition for system iolib from pathname /home/testgrid/cl-test-grid/work-dir/agent/quicklisp/dists/quicklisp/software/iolib-20150302-git/iolib.asd: The variable C::*CC-FLAGS* is unbound.
(LOAD hu.dwim.uri FAIL) ASDF/FIND-SYSTEM:LOAD-SYSTEM-DEFINITION-ERROR : Error while trying to load definition for system iolib from pathname /home/testgrid/cl-test-grid/work-dir/agent/quicklisp/dists/quicklisp/software/iolib-20150302-git/iolib.asd: The variable C::*CC-FLAGS* is unbound.
(LOAD hu.dwim.uri.test FAIL) ASDF/FIND-SYSTEM:LOAD-SYSTEM-DEFINITION-ERROR : Error while trying to load definition for system iolib from pathname /home/testgrid/cl-test-grid/work-dir/agent/quicklisp/dists/quicklisp/software/iolib-20150302-git/iolib.asd: The variable C::*CC-FLAGS* is unbound.
(LOAD hu.dwim.uri FAIL) ASDF/FIND-SYSTEM:LOAD-SYSTEM-DEFINITION-ERROR : Error while trying to load definition for system iolib from pathname /home/testgrid/cl-test-grid/work-dir/agent/quicklisp/dists/quicklisp/software/iolib-20150302-git/iolib.asd: The variable C::*CC-FLAGS* is unbound.
ecl-15.2.21-ee989b97-linux-i686-lisp-to-c
(LOAD hu.dwim.uri.test FAIL) ASDF/FIND-SYSTEM:LOAD-SYSTEM-DEFINITION-ERROR : Error while trying to load definition for system iolib from pathname /home/testgrid/cl-test-grid/work-dir/agent/quicklisp/dists/quicklisp/software/iolib-20150302-git/iolib.asd: COMPILE-FILE-ERROR while compiling #<cl-source-file "alexandria" "macros">
(LOAD hu.dwim.uri FAIL) ASDF/FIND-SYSTEM:LOAD-SYSTEM-DEFINITION-ERROR : Error while trying to load definition for system iolib from pathname /home/testgrid/cl-test-grid/work-dir/agent/quicklisp/dists/quicklisp/software/iolib-20150302-git/iolib.asd: COMPILE-FILE-ERROR while compiling #<cl-source-file "alexandria" "macros">
(LOAD hu.dwim.uri.test FAIL) COMMON-LISP:SIMPLE-ERROR : %CLOSE-FOREIGN-LIBRARY unimplemented.
(LOAD hu.dwim.uri FAIL) COMMON-LISP:SIMPLE-ERROR : %CLOSE-FOREIGN-LIBRARY unimplemented.
ecl-15.2.21-ee989b97-linux-x64-bytecode
(LOAD hu.dwim.uri.test FAIL) ASDF/FIND-SYSTEM:LOAD-SYSTEM-DEFINITION-ERROR : Error while trying to load definition for system iolib from pathname /home/hijarian/systems/cl-test-grid/work-dir/agent/quicklisp/dists/quicklisp/software/iolib-20150302-git/iolib.asd: The variable C::*CC-FLAGS* is unbound.
(LOAD hu.dwim.uri FAIL) ASDF/FIND-SYSTEM:LOAD-SYSTEM-DEFINITION-ERROR : Error while trying to load definition for system iolib from pathname /home/hijarian/systems/cl-test-grid/work-dir/agent/quicklisp/dists/quicklisp/software/iolib-20150302-git/iolib.asd: The variable C::*CC-FLAGS* is unbound.
(LOAD hu.dwim.uri.test FAIL) ASDF/FIND-SYSTEM:LOAD-SYSTEM-DEFINITION-ERROR : Error while trying to load definition for system iolib from pathname /home/hijarian/systems/cl-test-grid/work-dir/agent/quicklisp/dists/quicklisp/software/iolib-20150302-git/iolib.asd: The variable C::*CC-FLAGS* is unbound.
(LOAD hu.dwim.uri FAIL) ASDF/FIND-SYSTEM:LOAD-SYSTEM-DEFINITION-ERROR : Error while trying to load definition for system iolib from pathname /home/hijarian/systems/cl-test-grid/work-dir/agent/quicklisp/dists/quicklisp/software/iolib-20150302-git/iolib.asd: The variable C::*CC-FLAGS* is unbound.
ecl-15.2.21-ee989b97-linux-x64-lisp-to-c
(LOAD hu.dwim.uri.test FAIL) ASDF/FIND-SYSTEM:LOAD-SYSTEM-DEFINITION-ERROR : Error while trying to load definition for system iolib from pathname /home/hijarian/systems/cl-test-grid/work-dir/agent/quicklisp/dists/quicklisp/software/iolib-20150302-git/iolib.asd: COMPILE-FILE-ERROR while compiling #<cl-source-file "alexandria" "macros">
(LOAD hu.dwim.uri FAIL) ASDF/FIND-SYSTEM:LOAD-SYSTEM-DEFINITION-ERROR : Error while trying to load definition for system iolib from pathname /home/hijarian/systems/cl-test-grid/work-dir/agent/quicklisp/dists/quicklisp/software/iolib-20150302-git/iolib.asd: COMPILE-FILE-ERROR while compiling #<cl-source-file "alexandria" "macros">
(LOAD hu.dwim.uri.test FAIL) COMMON-LISP:SIMPLE-ERROR : External process exited with code 1. Command was: "g++" "-m64" "-Wno-write-strings" " -D_GNU_SOURCE -D_FILE_OFFSET_BITS=64 -g -O2 -fPIC -D_THREAD_SAFE -Dlinux" "-I/home/hijarian/systems/cl-test-grid/work-dir/agent/quicklisp/dists/quicklisp/software/iolib-20150302-git/src/grovel/" "-o" "/home/hijarian/systems/cl-test-grid/work-dir/agent/test-runs/20150518211124-ecl-15.2.21-ee989b97-linux-x64-lisp-to-c/fasl/ql/dists/quicklisp/software/iolib-20150302-git/src/syscalls/ffi-types-unix" "/home/hijarian/systems/cl-test-grid/work-dir/agent/test-runs/20150518211124-ecl-15.2.21-ee989b97-linux-x64-lisp-to-c/fasl/ql/dists/quicklisp/software/iolib-20150302-git/src/syscalls/ffi-types-unix.c" Output was: <see above>
(LOAD hu.dwim.uri FAIL) COMMON-LISP:SIMPLE-ERROR : External process exited with code 1. Command was: "g++" "-m64" "-Wno-write-strings" " -D_GNU_SOURCE -D_FILE_OFFSET_BITS=64 -g -O2 -fPIC -D_THREAD_SAFE -Dlinux" "-I/home/hijarian/systems/cl-test-grid/work-dir/agent/quicklisp/dists/quicklisp/software/iolib-20150302-git/src/grovel/" "-o" "/home/hijarian/systems/cl-test-grid/work-dir/agent/test-runs/20150518211124-ecl-15.2.21-ee989b97-linux-x64-lisp-to-c/fasl/ql/dists/quicklisp/software/iolib-20150302-git/src/syscalls/ffi-types-unix" "/home/hijarian/systems/cl-test-grid/work-dir/agent/test-runs/20150518211124-ecl-15.2.21-ee989b97-linux-x64-lisp-to-c/fasl/ql/dists/quicklisp/software/iolib-20150302-git/src/syscalls/ffi-types-unix.c" Output was: <see above>
ecl-15.3.7-827d3035-linux-x64-lisp-to-c
(LOAD hu.dwim.uri.test FAIL) COMMON-LISP:SIMPLE-ERROR : External process exited with code 1. Command was: "g++" "-m64" "-Wno-write-strings" " -D_GNU_SOURCE -D_FILE_OFFSET_BITS=64 -g -O2 -fPIC -D_THREAD_SAFE -Dlinux" "-I/home/jack/quicklisp/local-projects/cl-test-grid/work-dir/agent/quicklisp/dists/quicklisp/software/iolib-20150302-git/src/grovel/" "-o" "/home/jack/quicklisp/local-projects/cl-test-grid/work-dir/agent/test-runs/20150517100100-ecl-15.3.7-827d3035-linux-x64-lisp-to-c/fasl/ql/dists/quicklisp/software/iolib-20150302-git/src/syscalls/ffi-types-unix" "/home/jack/quicklisp/local-projects/cl-test-grid/work-dir/agent/test-runs/20150517100100-ecl-15.3.7-827d3035-linux-x64-lisp-to-c/fasl/ql/dists/quicklisp/software/iolib-20150302-git/src/syscalls/ffi-types-unix.c" Output was: <see above>
(LOAD hu.dwim.uri FAIL) COMMON-LISP:SIMPLE-ERROR : External process exited with code 1. Command was: "g++" "-m64" "-Wno-write-strings" " -D_GNU_SOURCE -D_FILE_OFFSET_BITS=64 -g -O2 -fPIC -D_THREAD_SAFE -Dlinux" "-I/home/jack/quicklisp/local-projects/cl-test-grid/work-dir/agent/quicklisp/dists/quicklisp/software/iolib-20150302-git/src/grovel/" "-o" "/home/jack/quicklisp/local-projects/cl-test-grid/work-dir/agent/test-runs/20150517100100-ecl-15.3.7-827d3035-linux-x64-lisp-to-c/fasl/ql/dists/quicklisp/software/iolib-20150302-git/src/syscalls/ffi-types-unix" "/home/jack/quicklisp/local-projects/cl-test-grid/work-dir/agent/test-runs/20150517100100-ecl-15.3.7-827d3035-linux-x64-lisp-to-c/fasl/ql/dists/quicklisp/software/iolib-20150302-git/src/syscalls/ffi-types-unix.c" Output was: <see above>
(LOAD hu.dwim.uri.test FAIL) COMMON-LISP:SIMPLE-ERROR : External process exited with code 1. Command was: "g++" "-m64" "-Wno-write-strings" " -D_GNU_SOURCE -D_FILE_OFFSET_BITS=64 -g -O2 -fPIC -D_THREAD_SAFE -Dlinux" "-I/home/jack/quicklisp/local-projects/cl-test-grid-2.git/work-dir/agent/quicklisp/dists/quicklisp/software/iolib-20150302-git/src/grovel/" "-o" "/home/jack/quicklisp/local-projects/cl-test-grid-2.git/work-dir/agent/test-runs/20150517161137-ecl-15.3.7-827d3035-linux-x64-lisp-to-c/fasl/ql/dists/quicklisp/software/iolib-20150302-git/src/syscalls/ffi-types-unix" "/home/jack/quicklisp/local-projects/cl-test-grid-2.git/work-dir/agent/test-runs/20150517161137-ecl-15.3.7-827d3035-linux-x64-lisp-to-c/fasl/ql/dists/quicklisp/software/iolib-20150302-git/src/syscalls/ffi-types-unix.c" Output was: <see above>
(LOAD hu.dwim.uri FAIL) COMMON-LISP:SIMPLE-ERROR : External process exited with code 1. Command was: "g++" "-m64" "-Wno-write-strings" " -D_GNU_SOURCE -D_FILE_OFFSET_BITS=64 -g -O2 -fPIC -D_THREAD_SAFE -Dlinux" "-I/home/jack/quicklisp/local-projects/cl-test-grid-2.git/work-dir/agent/quicklisp/dists/quicklisp/software/iolib-20150302-git/src/grovel/" "-o" "/home/jack/quicklisp/local-projects/cl-test-grid-2.git/work-dir/agent/test-runs/20150517161137-ecl-15.3.7-827d3035-linux-x64-lisp-to-c/fasl/ql/dists/quicklisp/software/iolib-20150302-git/src/syscalls/ffi-types-unix" "/home/jack/quicklisp/local-projects/cl-test-grid-2.git/work-dir/agent/test-runs/20150517161137-ecl-15.3.7-827d3035-linux-x64-lisp-to-c/fasl/ql/dists/quicklisp/software/iolib-20150302-git/src/syscalls/ffi-types-unix.c" Output was: <see above>
ecl-15.3.7-a014bd2c-linux-x64-lisp-to-c
(LOAD hu.dwim.uri.test FAIL) COMMON-LISP:SIMPLE-ERROR : %CLOSE-FOREIGN-LIBRARY unimplemented.
(LOAD hu.dwim.uri FAIL) COMMON-LISP:SIMPLE-ERROR : %CLOSE-FOREIGN-LIBRARY unimplemented.
sbcl-1.0.58-linux-x86
(LOAD hu.dwim.uri.test FAIL) ASDF:LOAD-SYSTEM-DEFINITION-ERROR : Error while trying to load definition for system hu.dwim.uri.test from pathname /home/testgrid/cl-test-grid/work-dir/agent/quicklisp/dists/quicklisp/software/hu.dwim.uri-20150608-darcs/hu.dwim.uri.test.asd: Error while trying to load definition for system hu.dwim.asdf from pathname /home/testgrid/cl-test-grid/work-dir/agent/quicklisp/dists/quicklisp/software/hu.dwim.asdf-20150608-darcs/hu.dwim.asdf.asd: READ error during COMPILE-FILE: :ASCII stream decoding error on #<SB-SYS:FD-STREAM for "file /home/testgrid/cl-test-grid/work-dir/agent/quicklisp/dists/quicklisp/software/hu.dwim.asdf-20150608-darcs/hu.dwim.asdf.asd" {B0B5A21}>: the octet sequence #(195) cannot be decoded. (in form starting at line: 1, column: 0, file-position: 0)
(LOAD hu.dwim.uri FAIL) ASDF:LOAD-SYSTEM-DEFINITION-ERROR : Error while trying to load definition for system hu.dwim.uri from pathname /home/testgrid/cl-test-grid/work-dir/agent/quicklisp/dists/quicklisp/software/hu.dwim.uri-20150608-darcs/hu.dwim.uri.asd: Error while trying to load definition for system hu.dwim.asdf from pathname /home/testgrid/cl-test-grid/work-dir/agent/quicklisp/dists/quicklisp/software/hu.dwim.asdf-20150608-darcs/hu.dwim.asdf.asd: READ error during COMPILE-FILE: :ASCII stream decoding error on #<SB-SYS:FD-STREAM for "file /home/testgrid/cl-test-grid/work-dir/agent/quicklisp/dists/quicklisp/software/hu.dwim.asdf-20150608-darcs/hu.dwim.asdf.asd" {B0B2A21}>: the octet sequence #(195) cannot be decoded. (in form starting at line: 1, column: 0, file-position: 0)
(LOAD hu.dwim.uri.test FAIL) ASDF:LOAD-SYSTEM-DEFINITION-ERROR : Error while trying to load definition for system hu.dwim.uri.test from pathname /home/testgrid/cl-test-grid/work-dir/agent/quicklisp/dists/quicklisp/software/hu.dwim.uri-20130312-darcs/hu.dwim.uri.test.asd: Error while invoking #<COMPILE-OP NIL {B0CD691}> on #<CL-SOURCE-FILE "hu.dwim.asdf" "source" "system">
(LOAD hu.dwim.uri FAIL) ASDF:LOAD-SYSTEM-DEFINITION-ERROR : Error while trying to load definition for system hu.dwim.uri from pathname /home/testgrid/cl-test-grid/work-dir/agent/quicklisp/dists/quicklisp/software/hu.dwim.uri-20130312-darcs/hu.dwim.uri.asd: Error while invoking #<COMPILE-OP NIL {B0CA691}> on #<CL-SOURCE-FILE "hu.dwim.asdf" "source" "system">
sbcl-1.1.11-linux-x86
(LOAD hu.dwim.uri.test FAIL) needs newer ASDF, ASDF/FIND-SYSTEM:LOAD-SYSTEM-DEFINITION-ERROR : Error while trying to load definition for system hu.dwim.uri.test from pathname /home/testgrid/cl-test-grid/work-dir/agent/quicklisp/dists/quicklisp/software/hu.dwim.uri-20150608-darcs/hu.dwim.uri.test.asd: no symbol named "NON-PROPAGATING-OPERATION" in "ASDF/INTERFACE"
(LOAD hu.dwim.uri FAIL) needs newer ASDF, ASDF/FIND-SYSTEM:LOAD-SYSTEM-DEFINITION-ERROR : Error while trying to load definition for system hu.dwim.uri from pathname /home/testgrid/cl-test-grid/work-dir/agent/quicklisp/dists/quicklisp/software/hu.dwim.uri-20150608-darcs/hu.dwim.uri.asd: no symbol named "NON-PROPAGATING-OPERATION" in "ASDF/INTERFACE"
(LOAD hu.dwim.uri.test FAIL) QUICKLISP-CLIENT:SYSTEM-NOT-FOUND : System "sb-sprof" not found
(LOAD hu.dwim.uri FAIL) QUICKLISP-CLIENT:SYSTEM-NOT-FOUND : System "sb-sprof" not found
sbcl-1.1.16-linux-x86
(LOAD hu.dwim.uri.test FAIL) needs newer ASDF, ASDF/FIND-SYSTEM:LOAD-SYSTEM-DEFINITION-ERROR : Error while trying to load definition for system hu.dwim.uri.test from pathname /home/testgrid/cl-test-grid/work-dir/agent/quicklisp/dists/quicklisp/software/hu.dwim.uri-20150608-darcs/hu.dwim.uri.test.asd: no symbol named "NON-PROPAGATING-OPERATION" in "ASDF/INTERFACE"
(LOAD hu.dwim.uri FAIL) needs newer ASDF, ASDF/FIND-SYSTEM:LOAD-SYSTEM-DEFINITION-ERROR : Error while trying to load definition for system hu.dwim.uri from pathname /home/testgrid/cl-test-grid/work-dir/agent/quicklisp/dists/quicklisp/software/hu.dwim.uri-20150608-darcs/hu.dwim.uri.asd: no symbol named "NON-PROPAGATING-OPERATION" in "ASDF/INTERFACE"
(LOAD hu.dwim.uri.test FAIL) ASDF/FIND-SYSTEM:MISSING-COMPONENT : Component "iolib/sockets" not found
(LOAD hu.dwim.uri FAIL) ASDF/FIND-SYSTEM:MISSING-COMPONENT : Component "iolib/sockets" not found
sbcl-1.2.3-linux-x64
(LOAD hu.dwim.uri.test FAIL) COMMON-LISP:SIMPLE-ERROR : External process exited with code 1. Command was: "g++" "-m64" "-Wno-write-strings" "-I/home/hijarian/systems/cl-test-grid/work-dir/agent/quicklisp/dists/quicklisp/software/iolib-20150302-git/src/grovel/" "-o" "/home/hijarian/systems/cl-test-grid/work-dir/agent/test-runs/20150609131809-sbcl-1.2.3-linux-x64/fasl/ql/dists/quicklisp/software/iolib-20150302-git/src/syscalls/ffi-types-unix" "/home/hijarian/systems/cl-test-grid/work-dir/agent/test-runs/20150609131809-sbcl-1.2.3-linux-x64/fasl/ql/dists/quicklisp/software/iolib-20150302-git/src/syscalls/ffi-types-unix.c" Output was: /home/hijarian/systems/cl-test-grid/work-dir/agent/test-runs/20150609131809-sbcl-1.2.3-linux-x64/fasl/ql/dists/quicklisp/software/iolib-20150302-git/src/syscalls/ffi-types-unix.c:14:17: fatal error: lfp.h: Нет такого файла или каталога #include <lfp.h> ^ compilation terminated.
(LOAD hu.dwim.uri FAIL) COMMON-LISP:SIMPLE-ERROR : External process exited with code 1. Command was: "g++" "-m64" "-Wno-write-strings" "-I/home/hijarian/systems/cl-test-grid/work-dir/agent/quicklisp/dists/quicklisp/software/iolib-20150302-git/src/grovel/" "-o" "/home/hijarian/systems/cl-test-grid/work-dir/agent/test-runs/20150609131809-sbcl-1.2.3-linux-x64/fasl/ql/dists/quicklisp/software/iolib-20150302-git/src/syscalls/ffi-types-unix" "/home/hijarian/systems/cl-test-grid/work-dir/agent/test-runs/20150609131809-sbcl-1.2.3-linux-x64/fasl/ql/dists/quicklisp/software/iolib-20150302-git/src/syscalls/ffi-types-unix.c" Output was: /home/hijarian/systems/cl-test-grid/work-dir/agent/test-runs/20150609131809-sbcl-1.2.3-linux-x64/fasl/ql/dists/quicklisp/software/iolib-20150302-git/src/syscalls/ffi-types-unix.c:14:17: fatal error: lfp.h: Нет такого файла или каталога #include <lfp.h> ^ compilation terminated.
(LOAD hu.dwim.uri.test FAIL) COMMON-LISP:SIMPLE-ERROR : External process exited with code 1. Command was: "g++" "-m64" "-Wno-write-strings" "-I/home/hijarian/systems/cl-test-grid/work-dir/agent/quicklisp/dists/quicklisp/software/iolib-20150302-git/src/grovel/" "-o" "/home/hijarian/systems/cl-test-grid/work-dir/agent/test-runs/20150518190329-sbcl-1.2.3-linux-x64/fasl/ql/dists/quicklisp/software/iolib-20150302-git/src/syscalls/ffi-types-unix" "/home/hijarian/systems/cl-test-grid/work-dir/agent/test-runs/20150518190329-sbcl-1.2.3-linux-x64/fasl/ql/dists/quicklisp/software/iolib-20150302-git/src/syscalls/ffi-types-unix.c" Output was: /home/hijarian/systems/cl-test-grid/work-dir/agent/test-runs/20150518190329-sbcl-1.2.3-linux-x64/fasl/ql/dists/quicklisp/software/iolib-20150302-git/src/syscalls/ffi-types-unix.c:14:17: fatal error: lfp.h: Нет такого файла или каталога #include <lfp.h> ^ compilation terminated.
(LOAD hu.dwim.uri FAIL) COMMON-LISP:SIMPLE-ERROR : External process exited with code 1. Command was: "g++" "-m64" "-Wno-write-strings" "-I/home/hijarian/systems/cl-test-grid/work-dir/agent/quicklisp/dists/quicklisp/software/iolib-20150302-git/src/grovel/" "-o" "/home/hijarian/systems/cl-test-grid/work-dir/agent/test-runs/20150518190329-sbcl-1.2.3-linux-x64/fasl/ql/dists/quicklisp/software/iolib-20150302-git/src/syscalls/ffi-types-unix" "/home/hijarian/systems/cl-test-grid/work-dir/agent/test-runs/20150518190329-sbcl-1.2.3-linux-x64/fasl/ql/dists/quicklisp/software/iolib-20150302-git/src/syscalls/ffi-types-unix.c" Output was: /home/hijarian/systems/cl-test-grid/work-dir/agent/test-runs/20150518190329-sbcl-1.2.3-linux-x64/fasl/ql/dists/quicklisp/software/iolib-20150302-git/src/syscalls/ffi-types-unix.c:14:17: fatal error: lfp.h: Нет такого файла или каталога #include <lfp.h> ^ compilation terminated.
sbcl-1.2.6-linux-x86

Breakdown by testcases: for every failed testcase the lisp implmentations it fails on

The library does not have a testsuite adapter for CL Test Grid.

To reports overview

Generated at: 2015-06-20 14:24:31 GMT.