hu.dwim.quasi-quote results collected by cl-test-grid

Results on the last two Quicklisp distributions

 quicklisp 2015-06-08quicklisp 2015-05-05
abcl-1.2.1-fasl42-linux-x86
(LOAD hu.dwim.quasi-quote.xml+hu.dwim.quasi-quote.js FAIL) needs newer ASDF, ASDF/FIND-SYSTEM:LOAD-SYSTEM-DEFINITION-ERROR : Error while trying to load definition for system hu.dwim.quasi-quote.xml+hu.dwim.quasi-quote.js from pathname /home/testgrid/cl-test-grid/work-dir/agent/quicklisp/dists/quicklisp/software/hu.dwim.quasi-quote-20150608-darcs/hu.dwim.quasi-quote.xml+hu.dwim.quasi-quote.js.asd: The symbol NON-PROPAGATING-OPERATION is not present in package ASDF/INTERFACE.
(LOAD hu.dwim.quasi-quote.xml+cxml FAIL) needs newer ASDF, ASDF/FIND-SYSTEM:LOAD-SYSTEM-DEFINITION-ERROR : Error while trying to load definition for system hu.dwim.quasi-quote.xml+cxml from pathname /home/testgrid/cl-test-grid/work-dir/agent/quicklisp/dists/quicklisp/software/hu.dwim.quasi-quote-20150608-darcs/hu.dwim.quasi-quote.xml+cxml.asd: The symbol NON-PROPAGATING-OPERATION is not present in package ASDF/INTERFACE.
(LOAD hu.dwim.quasi-quote.xml FAIL) needs newer ASDF, ASDF/FIND-SYSTEM:LOAD-SYSTEM-DEFINITION-ERROR : Error while trying to load definition for system hu.dwim.quasi-quote.xml from pathname /home/testgrid/cl-test-grid/work-dir/agent/quicklisp/dists/quicklisp/software/hu.dwim.quasi-quote-20150608-darcs/hu.dwim.quasi-quote.xml.asd: The symbol NON-PROPAGATING-OPERATION is not present in package ASDF/INTERFACE.
(LOAD hu.dwim.quasi-quote.test FAIL) needs newer ASDF, ASDF/FIND-SYSTEM:LOAD-SYSTEM-DEFINITION-ERROR : Error while trying to load definition for system hu.dwim.quasi-quote.test from pathname /home/testgrid/cl-test-grid/work-dir/agent/quicklisp/dists/quicklisp/software/hu.dwim.quasi-quote-20150608-darcs/hu.dwim.quasi-quote.test.asd: The symbol NON-PROPAGATING-OPERATION is not present in package ASDF/INTERFACE.
(LOAD hu.dwim.quasi-quote.js FAIL) needs newer ASDF, ASDF/FIND-SYSTEM:LOAD-SYSTEM-DEFINITION-ERROR : Error while trying to load definition for system hu.dwim.quasi-quote.js from pathname /home/testgrid/cl-test-grid/work-dir/agent/quicklisp/dists/quicklisp/software/hu.dwim.quasi-quote-20150608-darcs/hu.dwim.quasi-quote.js.asd: The symbol NON-PROPAGATING-OPERATION is not present in package ASDF/INTERFACE.
(LOAD hu.dwim.quasi-quote.css FAIL) needs newer ASDF, ASDF/FIND-SYSTEM:LOAD-SYSTEM-DEFINITION-ERROR : Error while trying to load definition for system hu.dwim.quasi-quote.css from pathname /home/testgrid/cl-test-grid/work-dir/agent/quicklisp/dists/quicklisp/software/hu.dwim.quasi-quote-20150608-darcs/hu.dwim.quasi-quote.css.asd: The symbol NON-PROPAGATING-OPERATION is not present in package ASDF/INTERFACE.
(LOAD hu.dwim.quasi-quote FAIL) needs newer ASDF, ASDF/FIND-SYSTEM:LOAD-SYSTEM-DEFINITION-ERROR : Error while trying to load definition for system hu.dwim.quasi-quote from pathname /home/testgrid/cl-test-grid/work-dir/agent/quicklisp/dists/quicklisp/software/hu.dwim.quasi-quote-20150608-darcs/hu.dwim.quasi-quote.asd: The symbol NON-PROPAGATING-OPERATION is not present in package ASDF/INTERFACE.
(LOAD hu.dwim.quasi-quote.xml+hu.dwim.quasi-quote.js FAIL) ASDF/FIND-SYSTEM:MISSING-COMPONENT : Component "iolib/os" not found
(LOAD hu.dwim.quasi-quote.xml+cxml FAIL) COMMON-LISP:SIMPLE-ERROR : This is not implemented for your lisp, sorry. You may try to continue, but...
(LOAD hu.dwim.quasi-quote.xml FAIL) COMMON-LISP:SIMPLE-ERROR : This is not implemented for your lisp, sorry. You may try to continue, but...
(LOAD hu.dwim.quasi-quote.test FAIL) ASDF/FIND-SYSTEM:MISSING-COMPONENT : Component "iolib/os" not found
(LOAD hu.dwim.quasi-quote.js FAIL) ASDF/FIND-SYSTEM:MISSING-COMPONENT : Component "iolib/os" not found
(LOAD hu.dwim.quasi-quote.css FAIL) COMMON-LISP:SIMPLE-ERROR : This is not implemented for your lisp, sorry. You may try to continue, but...
(LOAD hu.dwim.quasi-quote FAIL) COMMON-LISP:SIMPLE-ERROR : This is not implemented for your lisp, sorry. You may try to continue, but...
abcl-1.3.0-fasl42-linux-x86
(LOAD hu.dwim.quasi-quote.xml+hu.dwim.quasi-quote.js FAIL) COMMON-LISP:SIMPLE-ERROR : This is not implemented for your lisp, sorry. You may try to continue, but...
(LOAD hu.dwim.quasi-quote.xml+cxml FAIL) COMMON-LISP:SIMPLE-ERROR : This is not implemented for your lisp, sorry. You may try to continue, but...
(LOAD hu.dwim.quasi-quote.xml FAIL) COMMON-LISP:SIMPLE-ERROR : This is not implemented for your lisp, sorry. You may try to continue, but...
(LOAD hu.dwim.quasi-quote.test FAIL) COMMON-LISP:SIMPLE-ERROR : This is not implemented for your lisp, sorry. You may try to continue, but...
(LOAD hu.dwim.quasi-quote.js FAIL) COMMON-LISP:SIMPLE-ERROR : This is not implemented for your lisp, sorry. You may try to continue, but...
(LOAD hu.dwim.quasi-quote.css FAIL) COMMON-LISP:SIMPLE-ERROR : This is not implemented for your lisp, sorry. You may try to continue, but...
(LOAD hu.dwim.quasi-quote FAIL) COMMON-LISP:SIMPLE-ERROR : This is not implemented for your lisp, sorry. You may try to continue, but...
(LOAD hu.dwim.quasi-quote.xml+hu.dwim.quasi-quote.js FAIL) COMMON-LISP:SIMPLE-ERROR : This is not implemented for your lisp, sorry. You may try to continue, but...
(LOAD hu.dwim.quasi-quote.xml+cxml FAIL) COMMON-LISP:SIMPLE-ERROR : This is not implemented for your lisp, sorry. You may try to continue, but...
(LOAD hu.dwim.quasi-quote.xml FAIL) COMMON-LISP:SIMPLE-ERROR : This is not implemented for your lisp, sorry. You may try to continue, but...
(LOAD hu.dwim.quasi-quote.test FAIL) COMMON-LISP:SIMPLE-ERROR : This is not implemented for your lisp, sorry. You may try to continue, but...
(LOAD hu.dwim.quasi-quote.js FAIL) COMMON-LISP:SIMPLE-ERROR : This is not implemented for your lisp, sorry. You may try to continue, but...
(LOAD hu.dwim.quasi-quote.css FAIL) COMMON-LISP:SIMPLE-ERROR : This is not implemented for your lisp, sorry. You may try to continue, but...
(LOAD hu.dwim.quasi-quote FAIL) COMMON-LISP:SIMPLE-ERROR : This is not implemented for your lisp, sorry. You may try to continue, but...
abcl-1.3.1-fasl42-linux-x86
(LOAD hu.dwim.quasi-quote.xml+hu.dwim.quasi-quote.js FAIL) COMMON-LISP:SIMPLE-ERROR : This is not implemented for your lisp, sorry. You may try to continue, but...
(LOAD hu.dwim.quasi-quote.xml+cxml FAIL) COMMON-LISP:SIMPLE-ERROR : This is not implemented for your lisp, sorry. You may try to continue, but...
(LOAD hu.dwim.quasi-quote.xml FAIL) COMMON-LISP:SIMPLE-ERROR : This is not implemented for your lisp, sorry. You may try to continue, but...
(LOAD hu.dwim.quasi-quote.test FAIL) COMMON-LISP:SIMPLE-ERROR : This is not implemented for your lisp, sorry. You may try to continue, but...
(LOAD hu.dwim.quasi-quote.js FAIL) COMMON-LISP:SIMPLE-ERROR : This is not implemented for your lisp, sorry. You may try to continue, but...
(LOAD hu.dwim.quasi-quote.css FAIL) COMMON-LISP:SIMPLE-ERROR : This is not implemented for your lisp, sorry. You may try to continue, but...
(LOAD hu.dwim.quasi-quote FAIL) COMMON-LISP:SIMPLE-ERROR : This is not implemented for your lisp, sorry. You may try to continue, but...
(LOAD hu.dwim.quasi-quote.xml+hu.dwim.quasi-quote.js FAIL) COMMON-LISP:SIMPLE-ERROR : This is not implemented for your lisp, sorry. You may try to continue, but...
(LOAD hu.dwim.quasi-quote.xml+cxml FAIL) COMMON-LISP:SIMPLE-ERROR : This is not implemented for your lisp, sorry. You may try to continue, but...
(LOAD hu.dwim.quasi-quote.xml FAIL) COMMON-LISP:SIMPLE-ERROR : This is not implemented for your lisp, sorry. You may try to continue, but...
(LOAD hu.dwim.quasi-quote.test FAIL) COMMON-LISP:SIMPLE-ERROR : This is not implemented for your lisp, sorry. You may try to continue, but...
(LOAD hu.dwim.quasi-quote.js FAIL) COMMON-LISP:SIMPLE-ERROR : This is not implemented for your lisp, sorry. You may try to continue, but...
(LOAD hu.dwim.quasi-quote.css FAIL) COMMON-LISP:SIMPLE-ERROR : This is not implemented for your lisp, sorry. You may try to continue, but...
(LOAD hu.dwim.quasi-quote FAIL) COMMON-LISP:SIMPLE-ERROR : This is not implemented for your lisp, sorry. You may try to continue, but...
abcl-1.3.2-fasl42-linux-x86
(LOAD hu.dwim.quasi-quote.xml+hu.dwim.quasi-quote.js FAIL) COMMON-LISP:SIMPLE-ERROR : This is not implemented for your lisp, sorry. You may try to continue, but...
(LOAD hu.dwim.quasi-quote.xml+cxml FAIL) COMMON-LISP:SIMPLE-ERROR : This is not implemented for your lisp, sorry. You may try to continue, but...
(LOAD hu.dwim.quasi-quote.xml FAIL) COMMON-LISP:SIMPLE-ERROR : This is not implemented for your lisp, sorry. You may try to continue, but...
(LOAD hu.dwim.quasi-quote.test FAIL) COMMON-LISP:SIMPLE-ERROR : This is not implemented for your lisp, sorry. You may try to continue, but...
(LOAD hu.dwim.quasi-quote.js FAIL) COMMON-LISP:SIMPLE-ERROR : This is not implemented for your lisp, sorry. You may try to continue, but...
(LOAD hu.dwim.quasi-quote.css FAIL) COMMON-LISP:SIMPLE-ERROR : This is not implemented for your lisp, sorry. You may try to continue, but...
(LOAD hu.dwim.quasi-quote FAIL) COMMON-LISP:SIMPLE-ERROR : This is not implemented for your lisp, sorry. You may try to continue, but...
(LOAD hu.dwim.quasi-quote.xml+hu.dwim.quasi-quote.js FAIL) COMMON-LISP:SIMPLE-ERROR : This is not implemented for your lisp, sorry. You may try to continue, but...
(LOAD hu.dwim.quasi-quote.xml+cxml FAIL) COMMON-LISP:SIMPLE-ERROR : This is not implemented for your lisp, sorry. You may try to continue, but...
(LOAD hu.dwim.quasi-quote.xml FAIL) COMMON-LISP:SIMPLE-ERROR : This is not implemented for your lisp, sorry. You may try to continue, but...
(LOAD hu.dwim.quasi-quote.test FAIL) COMMON-LISP:SIMPLE-ERROR : This is not implemented for your lisp, sorry. You may try to continue, but...
(LOAD hu.dwim.quasi-quote.js FAIL) COMMON-LISP:SIMPLE-ERROR : This is not implemented for your lisp, sorry. You may try to continue, but...
(LOAD hu.dwim.quasi-quote.css FAIL) COMMON-LISP:SIMPLE-ERROR : This is not implemented for your lisp, sorry. You may try to continue, but...
(LOAD hu.dwim.quasi-quote FAIL) COMMON-LISP:SIMPLE-ERROR : This is not implemented for your lisp, sorry. You may try to continue, but...
ccl-1.10-r16196-f96-linux-x64
(LOAD hu.dwim.quasi-quote.xml+hu.dwim.quasi-quote.js FAIL) COMMON-LISP:SIMPLE-ERROR : External process exited with code 1. Command was: "g++" "-m64" "-Wno-write-strings" "-I/home/hijarian/systems/cl-test-grid/work-dir/agent/quicklisp/dists/quicklisp/software/iolib-20150302-git/src/grovel/" "-o" "/home/hijarian/systems/cl-test-grid/work-dir/agent/test-runs/20150609102449-ccl-1.10-r16196-f96-linux-x64/fasl/ql/dists/quicklisp/software/iolib-20150302-git/src/syscalls/ffi-types-unix" "/home/hijarian/systems/cl-test-grid/work-dir/agent/test-runs/20150609102449-ccl-1.10-r16196-f96-linux-x64/fasl/ql/dists/quicklisp/software/iolib-20150302-git/src/syscalls/ffi-types-unix.c" Output was: /home/hijarian/systems/cl-test-grid/work-dir/agent/test-runs/20150609102449-ccl-1.10-r16196-f96-linux-x64/fasl/ql/dists/quicklisp/software/iolib-20150302-git/src/syscalls/ffi-types-unix.c:14:17: fatal error: lfp.h: Нет такого файла или каталога #include <lfp.h> ^ compilation terminated.
(LOAD hu.dwim.quasi-quote.test FAIL) COMMON-LISP:SIMPLE-ERROR : External process exited with code 1. Command was: "g++" "-m64" "-Wno-write-strings" "-I/home/hijarian/systems/cl-test-grid/work-dir/agent/quicklisp/dists/quicklisp/software/iolib-20150302-git/src/grovel/" "-o" "/home/hijarian/systems/cl-test-grid/work-dir/agent/test-runs/20150609102449-ccl-1.10-r16196-f96-linux-x64/fasl/ql/dists/quicklisp/software/iolib-20150302-git/src/syscalls/ffi-types-unix" "/home/hijarian/systems/cl-test-grid/work-dir/agent/test-runs/20150609102449-ccl-1.10-r16196-f96-linux-x64/fasl/ql/dists/quicklisp/software/iolib-20150302-git/src/syscalls/ffi-types-unix.c" Output was: /home/hijarian/systems/cl-test-grid/work-dir/agent/test-runs/20150609102449-ccl-1.10-r16196-f96-linux-x64/fasl/ql/dists/quicklisp/software/iolib-20150302-git/src/syscalls/ffi-types-unix.c:14:17: fatal error: lfp.h: Нет такого файла или каталога #include <lfp.h> ^ compilation terminated.
(LOAD hu.dwim.quasi-quote.js FAIL) COMMON-LISP:SIMPLE-ERROR : External process exited with code 1. Command was: "g++" "-m64" "-Wno-write-strings" "-I/home/hijarian/systems/cl-test-grid/work-dir/agent/quicklisp/dists/quicklisp/software/iolib-20150302-git/src/grovel/" "-o" "/home/hijarian/systems/cl-test-grid/work-dir/agent/test-runs/20150609102449-ccl-1.10-r16196-f96-linux-x64/fasl/ql/dists/quicklisp/software/iolib-20150302-git/src/syscalls/ffi-types-unix" "/home/hijarian/systems/cl-test-grid/work-dir/agent/test-runs/20150609102449-ccl-1.10-r16196-f96-linux-x64/fasl/ql/dists/quicklisp/software/iolib-20150302-git/src/syscalls/ffi-types-unix.c" Output was: /home/hijarian/systems/cl-test-grid/work-dir/agent/test-runs/20150609102449-ccl-1.10-r16196-f96-linux-x64/fasl/ql/dists/quicklisp/software/iolib-20150302-git/src/syscalls/ffi-types-unix.c:14:17: fatal error: lfp.h: Нет такого файла или каталога #include <lfp.h> ^ compilation terminated.
(LOAD hu.dwim.quasi-quote.xml+hu.dwim.quasi-quote.js FAIL) COMMON-LISP:SIMPLE-ERROR : External process exited with code 1. Command was: "g++" "-m64" "-Wno-write-strings" "-I/home/hijarian/systems/cl-test-grid/work-dir/agent/quicklisp/dists/quicklisp/software/iolib-20150302-git/src/grovel/" "-o" "/home/hijarian/systems/cl-test-grid/work-dir/agent/test-runs/20150518161431-ccl-1.10-r16196-f96-linux-x64/fasl/ql/dists/quicklisp/software/iolib-20150302-git/src/syscalls/ffi-types-unix" "/home/hijarian/systems/cl-test-grid/work-dir/agent/test-runs/20150518161431-ccl-1.10-r16196-f96-linux-x64/fasl/ql/dists/quicklisp/software/iolib-20150302-git/src/syscalls/ffi-types-unix.c" Output was: /home/hijarian/systems/cl-test-grid/work-dir/agent/test-runs/20150518161431-ccl-1.10-r16196-f96-linux-x64/fasl/ql/dists/quicklisp/software/iolib-20150302-git/src/syscalls/ffi-types-unix.c:14:17: fatal error: lfp.h: Нет такого файла или каталога #include <lfp.h> ^ compilation terminated.
(LOAD hu.dwim.quasi-quote.test FAIL) COMMON-LISP:SIMPLE-ERROR : External process exited with code 1. Command was: "g++" "-m64" "-Wno-write-strings" "-I/home/hijarian/systems/cl-test-grid/work-dir/agent/quicklisp/dists/quicklisp/software/iolib-20150302-git/src/grovel/" "-o" "/home/hijarian/systems/cl-test-grid/work-dir/agent/test-runs/20150518161431-ccl-1.10-r16196-f96-linux-x64/fasl/ql/dists/quicklisp/software/iolib-20150302-git/src/syscalls/ffi-types-unix" "/home/hijarian/systems/cl-test-grid/work-dir/agent/test-runs/20150518161431-ccl-1.10-r16196-f96-linux-x64/fasl/ql/dists/quicklisp/software/iolib-20150302-git/src/syscalls/ffi-types-unix.c" Output was: /home/hijarian/systems/cl-test-grid/work-dir/agent/test-runs/20150518161431-ccl-1.10-r16196-f96-linux-x64/fasl/ql/dists/quicklisp/software/iolib-20150302-git/src/syscalls/ffi-types-unix.c:14:17: fatal error: lfp.h: Нет такого файла или каталога #include <lfp.h> ^ compilation terminated.
(LOAD hu.dwim.quasi-quote.js FAIL) COMMON-LISP:SIMPLE-ERROR : External process exited with code 1. Command was: "g++" "-m64" "-Wno-write-strings" "-I/home/hijarian/systems/cl-test-grid/work-dir/agent/quicklisp/dists/quicklisp/software/iolib-20150302-git/src/grovel/" "-o" "/home/hijarian/systems/cl-test-grid/work-dir/agent/test-runs/20150518161431-ccl-1.10-r16196-f96-linux-x64/fasl/ql/dists/quicklisp/software/iolib-20150302-git/src/syscalls/ffi-types-unix" "/home/hijarian/systems/cl-test-grid/work-dir/agent/test-runs/20150518161431-ccl-1.10-r16196-f96-linux-x64/fasl/ql/dists/quicklisp/software/iolib-20150302-git/src/syscalls/ffi-types-unix.c" Output was: /home/hijarian/systems/cl-test-grid/work-dir/agent/test-runs/20150518161431-ccl-1.10-r16196-f96-linux-x64/fasl/ql/dists/quicklisp/software/iolib-20150302-git/src/syscalls/ffi-types-unix.c:14:17: fatal error: lfp.h: Нет такого файла или каталога #include <lfp.h> ^ compilation terminated.
ccl-1.10-r16196-f96-linux-x86
ccl-1.8-r15286m-f95-linux-x86
(LOAD hu.dwim.quasi-quote.xml+hu.dwim.quasi-quote.js FAIL) ASDF:LOAD-SYSTEM-DEFINITION-ERROR : Error while trying to load definition for system hu.dwim.quasi-quote.xml+hu.dwim.quasi-quote.js from pathname /home/testgrid/cl-test-grid/work-dir/agent/quicklisp/dists/quicklisp/software/hu.dwim.quasi-quote-20150608-darcs/hu\.dwim\.quasi-quote\.xml+hu\.dwim\.quasi-quote\.js.asd: Cannot IMPORT "NON-PROPAGATING-OPERATION" from package "ASDF"
(LOAD hu.dwim.quasi-quote.xml+cxml FAIL) ASDF:LOAD-SYSTEM-DEFINITION-ERROR : Error while trying to load definition for system hu.dwim.quasi-quote.xml+cxml from pathname /home/testgrid/cl-test-grid/work-dir/agent/quicklisp/dists/quicklisp/software/hu.dwim.quasi-quote-20150608-darcs/hu\.dwim\.quasi-quote\.xml+cxml.asd: Cannot IMPORT "NON-PROPAGATING-OPERATION" from package "ASDF"
(LOAD hu.dwim.quasi-quote.xml FAIL) ASDF:LOAD-SYSTEM-DEFINITION-ERROR : Error while trying to load definition for system hu.dwim.quasi-quote.xml from pathname /home/testgrid/cl-test-grid/work-dir/agent/quicklisp/dists/quicklisp/software/hu.dwim.quasi-quote-20150608-darcs/hu\.dwim\.quasi-quote\.xml.asd: Cannot IMPORT "NON-PROPAGATING-OPERATION" from package "ASDF"
(LOAD hu.dwim.quasi-quote.test FAIL) ASDF:LOAD-SYSTEM-DEFINITION-ERROR : Error while trying to load definition for system hu.dwim.quasi-quote.test from pathname /home/testgrid/cl-test-grid/work-dir/agent/quicklisp/dists/quicklisp/software/hu.dwim.quasi-quote-20150608-darcs/hu\.dwim\.quasi-quote\.test.asd: Cannot IMPORT "NON-PROPAGATING-OPERATION" from package "ASDF"
(LOAD hu.dwim.quasi-quote.js FAIL) ASDF:LOAD-SYSTEM-DEFINITION-ERROR : Error while trying to load definition for system hu.dwim.quasi-quote.js from pathname /home/testgrid/cl-test-grid/work-dir/agent/quicklisp/dists/quicklisp/software/hu.dwim.quasi-quote-20150608-darcs/hu\.dwim\.quasi-quote\.js.asd: Cannot IMPORT "NON-PROPAGATING-OPERATION" from package "ASDF"
(LOAD hu.dwim.quasi-quote.css FAIL) ASDF:LOAD-SYSTEM-DEFINITION-ERROR : Error while trying to load definition for system hu.dwim.quasi-quote.css from pathname /home/testgrid/cl-test-grid/work-dir/agent/quicklisp/dists/quicklisp/software/hu.dwim.quasi-quote-20150608-darcs/hu\.dwim\.quasi-quote\.css.asd: Cannot IMPORT "NON-PROPAGATING-OPERATION" from package "ASDF"
(LOAD hu.dwim.quasi-quote FAIL) ASDF:LOAD-SYSTEM-DEFINITION-ERROR : Error while trying to load definition for system hu.dwim.quasi-quote from pathname /home/testgrid/cl-test-grid/work-dir/agent/quicklisp/dists/quicklisp/software/hu.dwim.quasi-quote-20150608-darcs/hu\.dwim\.quasi-quote.asd: Cannot IMPORT "NON-PROPAGATING-OPERATION" from package "ASDF"
(LOAD hu.dwim.quasi-quote.xml+hu.dwim.quasi-quote.js FAIL) ASDF:MISSING-COMPONENT : Component "iolib/syscalls" not found
(LOAD hu.dwim.quasi-quote.test FAIL) ASDF:MISSING-COMPONENT : Component "iolib/syscalls" not found
(LOAD hu.dwim.quasi-quote.js FAIL) ASDF:MISSING-COMPONENT : Component "iolib/syscalls" not found
ccl-1.9-r15756-f96-linux-x86
(LOAD hu.dwim.quasi-quote.xml+hu.dwim.quasi-quote.js FAIL) needs newer ASDF, ASDF/FIND-SYSTEM:LOAD-SYSTEM-DEFINITION-ERROR : Error while trying to load definition for system hu.dwim.quasi-quote.xml+hu.dwim.quasi-quote.js from pathname /home/testgrid/cl-test-grid/work-dir/agent/quicklisp/dists/quicklisp/software/hu.dwim.quasi-quote-20150608-darcs/hu\.dwim\.quasi-quote\.xml+hu\.dwim\.quasi-quote\.js.asd: Cannot IMPORT "NON-PROPAGATING-OPERATION" from package "ASDF"
(LOAD hu.dwim.quasi-quote.xml+cxml FAIL) needs newer ASDF, ASDF/FIND-SYSTEM:LOAD-SYSTEM-DEFINITION-ERROR : Error while trying to load definition for system hu.dwim.quasi-quote.xml+cxml from pathname /home/testgrid/cl-test-grid/work-dir/agent/quicklisp/dists/quicklisp/software/hu.dwim.quasi-quote-20150608-darcs/hu\.dwim\.quasi-quote\.xml+cxml.asd: Cannot IMPORT "NON-PROPAGATING-OPERATION" from package "ASDF"
(LOAD hu.dwim.quasi-quote.xml FAIL) needs newer ASDF, ASDF/FIND-SYSTEM:LOAD-SYSTEM-DEFINITION-ERROR : Error while trying to load definition for system hu.dwim.quasi-quote.xml from pathname /home/testgrid/cl-test-grid/work-dir/agent/quicklisp/dists/quicklisp/software/hu.dwim.quasi-quote-20150608-darcs/hu\.dwim\.quasi-quote\.xml.asd: Cannot IMPORT "NON-PROPAGATING-OPERATION" from package "ASDF"
(LOAD hu.dwim.quasi-quote.test FAIL) needs newer ASDF, ASDF/FIND-SYSTEM:LOAD-SYSTEM-DEFINITION-ERROR : Error while trying to load definition for system hu.dwim.quasi-quote.test from pathname /home/testgrid/cl-test-grid/work-dir/agent/quicklisp/dists/quicklisp/software/hu.dwim.quasi-quote-20150608-darcs/hu\.dwim\.quasi-quote\.test.asd: Cannot IMPORT "NON-PROPAGATING-OPERATION" from package "ASDF"
(LOAD hu.dwim.quasi-quote.js FAIL) needs newer ASDF, ASDF/FIND-SYSTEM:LOAD-SYSTEM-DEFINITION-ERROR : Error while trying to load definition for system hu.dwim.quasi-quote.js from pathname /home/testgrid/cl-test-grid/work-dir/agent/quicklisp/dists/quicklisp/software/hu.dwim.quasi-quote-20150608-darcs/hu\.dwim\.quasi-quote\.js.asd: Cannot IMPORT "NON-PROPAGATING-OPERATION" from package "ASDF"
(LOAD hu.dwim.quasi-quote.css FAIL) needs newer ASDF, ASDF/FIND-SYSTEM:LOAD-SYSTEM-DEFINITION-ERROR : Error while trying to load definition for system hu.dwim.quasi-quote.css from pathname /home/testgrid/cl-test-grid/work-dir/agent/quicklisp/dists/quicklisp/software/hu.dwim.quasi-quote-20150608-darcs/hu\.dwim\.quasi-quote\.css.asd: Cannot IMPORT "NON-PROPAGATING-OPERATION" from package "ASDF"
(LOAD hu.dwim.quasi-quote FAIL) needs newer ASDF, ASDF/FIND-SYSTEM:LOAD-SYSTEM-DEFINITION-ERROR : Error while trying to load definition for system hu.dwim.quasi-quote from pathname /home/testgrid/cl-test-grid/work-dir/agent/quicklisp/dists/quicklisp/software/hu.dwim.quasi-quote-20150608-darcs/hu\.dwim\.quasi-quote.asd: Cannot IMPORT "NON-PROPAGATING-OPERATION" from package "ASDF"
(LOAD hu.dwim.quasi-quote.xml+hu.dwim.quasi-quote.js FAIL) ASDF/FIND-SYSTEM:MISSING-COMPONENT : Component "iolib/os" not found
(LOAD hu.dwim.quasi-quote.test FAIL) ASDF/FIND-SYSTEM:MISSING-COMPONENT : Component "iolib/os" not found
(LOAD hu.dwim.quasi-quote.js FAIL) ASDF/FIND-SYSTEM:MISSING-COMPONENT : Component "iolib/os" not found
clisp-2.49-unix-x64
(LOAD hu.dwim.quasi-quote.xml+hu.dwim.quasi-quote.js FAIL) ASDF:LOAD-SYSTEM-DEFINITION-ERROR : Error while trying to load definition for system hu.dwim.quasi-quote.xml+hu.dwim.quasi-quote.js from pathname /home/hijarian/systems/cl-test-grid/work-dir/agent/quicklisp/dists/quicklisp/software/hu.dwim.quasi-quote-20150608-darcs/hu.dwim.quasi-quote.xml+hu.dwim.quasi-quote.js.asd: DEFPACKAGE HU.DWIM.ASDF: Не существует символа ASDF::NON-PROPAGATING-OPERATION .
(LOAD hu.dwim.quasi-quote.xml+cxml FAIL) ASDF:LOAD-SYSTEM-DEFINITION-ERROR : Error while trying to load definition for system hu.dwim.quasi-quote.xml+cxml from pathname /home/hijarian/systems/cl-test-grid/work-dir/agent/quicklisp/dists/quicklisp/software/hu.dwim.quasi-quote-20150608-darcs/hu.dwim.quasi-quote.xml+cxml.asd: DEFPACKAGE HU.DWIM.ASDF: Не существует символа ASDF::NON-PROPAGATING-OPERATION .
(LOAD hu.dwim.quasi-quote.xml FAIL) ASDF:LOAD-SYSTEM-DEFINITION-ERROR : Error while trying to load definition for system hu.dwim.quasi-quote.xml from pathname /home/hijarian/systems/cl-test-grid/work-dir/agent/quicklisp/dists/quicklisp/software/hu.dwim.quasi-quote-20150608-darcs/hu.dwim.quasi-quote.xml.asd: DEFPACKAGE HU.DWIM.ASDF: Не существует символа ASDF::NON-PROPAGATING-OPERATION .
(LOAD hu.dwim.quasi-quote.test FAIL) ASDF:LOAD-SYSTEM-DEFINITION-ERROR : Error while trying to load definition for system hu.dwim.quasi-quote.test from pathname /home/hijarian/systems/cl-test-grid/work-dir/agent/quicklisp/dists/quicklisp/software/hu.dwim.quasi-quote-20150608-darcs/hu.dwim.quasi-quote.test.asd: DEFPACKAGE HU.DWIM.ASDF: Не существует символа ASDF::NON-PROPAGATING-OPERATION .
(LOAD hu.dwim.quasi-quote.js FAIL) ASDF:LOAD-SYSTEM-DEFINITION-ERROR : Error while trying to load definition for system hu.dwim.quasi-quote.js from pathname /home/hijarian/systems/cl-test-grid/work-dir/agent/quicklisp/dists/quicklisp/software/hu.dwim.quasi-quote-20150608-darcs/hu.dwim.quasi-quote.js.asd: DEFPACKAGE HU.DWIM.ASDF: Не существует символа ASDF::NON-PROPAGATING-OPERATION .
(LOAD hu.dwim.quasi-quote.css FAIL) ASDF:LOAD-SYSTEM-DEFINITION-ERROR : Error while trying to load definition for system hu.dwim.quasi-quote.css from pathname /home/hijarian/systems/cl-test-grid/work-dir/agent/quicklisp/dists/quicklisp/software/hu.dwim.quasi-quote-20150608-darcs/hu.dwim.quasi-quote.css.asd: DEFPACKAGE HU.DWIM.ASDF: Не существует символа ASDF::NON-PROPAGATING-OPERATION .
(LOAD hu.dwim.quasi-quote FAIL) ASDF:LOAD-SYSTEM-DEFINITION-ERROR : Error while trying to load definition for system hu.dwim.quasi-quote from pathname /home/hijarian/systems/cl-test-grid/work-dir/agent/quicklisp/dists/quicklisp/software/hu.dwim.quasi-quote-20150608-darcs/hu.dwim.quasi-quote.asd: DEFPACKAGE HU.DWIM.ASDF: Не существует символа ASDF::NON-PROPAGATING-OPERATION .
(LOAD hu.dwim.quasi-quote.xml+hu.dwim.quasi-quote.js FAIL) ASDF:MISSING-COMPONENT : Component "iolib/syscalls" not found
(LOAD hu.dwim.quasi-quote.xml+cxml FAIL) COMMON-LISP:SIMPLE-ERROR : This is not implemented for your lisp, sorry. You may try to continue, but...
(LOAD hu.dwim.quasi-quote.xml FAIL) COMMON-LISP:SIMPLE-ERROR : This is not implemented for your lisp, sorry. You may try to continue, but...
(LOAD hu.dwim.quasi-quote.test FAIL) ASDF:MISSING-COMPONENT : Component "iolib/syscalls" not found
(LOAD hu.dwim.quasi-quote.js FAIL) ASDF:MISSING-COMPONENT : Component "iolib/syscalls" not found
(LOAD hu.dwim.quasi-quote.css FAIL) COMMON-LISP:SIMPLE-ERROR : This is not implemented for your lisp, sorry. You may try to continue, but...
(LOAD hu.dwim.quasi-quote FAIL) COMMON-LISP:SIMPLE-ERROR : This is not implemented for your lisp, sorry. You may try to continue, but...
clisp-2.49-unix-x86
(LOAD hu.dwim.quasi-quote.xml+hu.dwim.quasi-quote.js FAIL) ASDF:LOAD-SYSTEM-DEFINITION-ERROR : Error while trying to load definition for system hu.dwim.quasi-quote.xml+hu.dwim.quasi-quote.js from pathname /home/testgrid/cl-test-grid/work-dir/agent/quicklisp/dists/quicklisp/software/hu.dwim.quasi-quote-20150608-darcs/hu.dwim.quasi-quote.xml+hu.dwim.quasi-quote.js.asd: DEFPACKAGE HU.DWIM.ASDF: There is no symbol ASDF::NON-PROPAGATING-OPERATION .
(LOAD hu.dwim.quasi-quote.xml+cxml FAIL) ASDF:LOAD-SYSTEM-DEFINITION-ERROR : Error while trying to load definition for system hu.dwim.quasi-quote.xml+cxml from pathname /home/testgrid/cl-test-grid/work-dir/agent/quicklisp/dists/quicklisp/software/hu.dwim.quasi-quote-20150608-darcs/hu.dwim.quasi-quote.xml+cxml.asd: DEFPACKAGE HU.DWIM.ASDF: There is no symbol ASDF::NON-PROPAGATING-OPERATION .
(LOAD hu.dwim.quasi-quote.xml FAIL) ASDF:LOAD-SYSTEM-DEFINITION-ERROR : Error while trying to load definition for system hu.dwim.quasi-quote.xml from pathname /home/testgrid/cl-test-grid/work-dir/agent/quicklisp/dists/quicklisp/software/hu.dwim.quasi-quote-20150608-darcs/hu.dwim.quasi-quote.xml.asd: DEFPACKAGE HU.DWIM.ASDF: There is no symbol ASDF::NON-PROPAGATING-OPERATION .
(LOAD hu.dwim.quasi-quote.test FAIL) ASDF:LOAD-SYSTEM-DEFINITION-ERROR : Error while trying to load definition for system hu.dwim.quasi-quote.test from pathname /home/testgrid/cl-test-grid/work-dir/agent/quicklisp/dists/quicklisp/software/hu.dwim.quasi-quote-20150608-darcs/hu.dwim.quasi-quote.test.asd: DEFPACKAGE HU.DWIM.ASDF: There is no symbol ASDF::NON-PROPAGATING-OPERATION .
(LOAD hu.dwim.quasi-quote.js FAIL) ASDF:LOAD-SYSTEM-DEFINITION-ERROR : Error while trying to load definition for system hu.dwim.quasi-quote.js from pathname /home/testgrid/cl-test-grid/work-dir/agent/quicklisp/dists/quicklisp/software/hu.dwim.quasi-quote-20150608-darcs/hu.dwim.quasi-quote.js.asd: DEFPACKAGE HU.DWIM.ASDF: There is no symbol ASDF::NON-PROPAGATING-OPERATION .
(LOAD hu.dwim.quasi-quote.css FAIL) ASDF:LOAD-SYSTEM-DEFINITION-ERROR : Error while trying to load definition for system hu.dwim.quasi-quote.css from pathname /home/testgrid/cl-test-grid/work-dir/agent/quicklisp/dists/quicklisp/software/hu.dwim.quasi-quote-20150608-darcs/hu.dwim.quasi-quote.css.asd: DEFPACKAGE HU.DWIM.ASDF: There is no symbol ASDF::NON-PROPAGATING-OPERATION .
(LOAD hu.dwim.quasi-quote FAIL) ASDF:LOAD-SYSTEM-DEFINITION-ERROR : Error while trying to load definition for system hu.dwim.quasi-quote from pathname /home/testgrid/cl-test-grid/work-dir/agent/quicklisp/dists/quicklisp/software/hu.dwim.quasi-quote-20150608-darcs/hu.dwim.quasi-quote.asd: DEFPACKAGE HU.DWIM.ASDF: There is no symbol ASDF::NON-PROPAGATING-OPERATION .
(LOAD hu.dwim.quasi-quote.xml+hu.dwim.quasi-quote.js FAIL) ASDF:MISSING-COMPONENT : Component "iolib/syscalls" not found
(LOAD hu.dwim.quasi-quote.xml+cxml FAIL) COMMON-LISP:SIMPLE-ERROR : This is not implemented for your lisp, sorry. You may try to continue, but...
(LOAD hu.dwim.quasi-quote.xml FAIL) COMMON-LISP:SIMPLE-ERROR : This is not implemented for your lisp, sorry. You may try to continue, but...
(LOAD hu.dwim.quasi-quote.test FAIL) ASDF:MISSING-COMPONENT : Component "iolib/syscalls" not found
(LOAD hu.dwim.quasi-quote.js FAIL) ASDF:MISSING-COMPONENT : Component "iolib/syscalls" not found
(LOAD hu.dwim.quasi-quote.css FAIL) COMMON-LISP:SIMPLE-ERROR : This is not implemented for your lisp, sorry. You may try to continue, but...
(LOAD hu.dwim.quasi-quote FAIL) COMMON-LISP:SIMPLE-ERROR : This is not implemented for your lisp, sorry. You may try to continue, but...
cmu-snapshot-2013-04__20d_unicode_-linux-x86
(LOAD hu.dwim.quasi-quote.xml+hu.dwim.quasi-quote.js FAIL) needs newer ASDF, ASDF/FIND-SYSTEM:LOAD-SYSTEM-DEFINITION-ERROR : Error while trying to load definition for system hu.dwim.quasi-quote.xml+hu.dwim.quasi-quote.js from pathname /home/testgrid/cl-test-grid/work-dir/agent/quicklisp/dists/quicklisp/software/hu.dwim.quasi-quote-20150608-darcs/hu.dwim.quasi-quote.xml+hu.dwim.quasi-quote.js.asd: ASDF/INTERFACE does not contain a symbol NON-PROPAGATING-OPERATION
(LOAD hu.dwim.quasi-quote.xml+cxml FAIL) needs newer ASDF, ASDF/FIND-SYSTEM:LOAD-SYSTEM-DEFINITION-ERROR : Error while trying to load definition for system hu.dwim.quasi-quote.xml+cxml from pathname /home/testgrid/cl-test-grid/work-dir/agent/quicklisp/dists/quicklisp/software/hu.dwim.quasi-quote-20150608-darcs/hu.dwim.quasi-quote.xml+cxml.asd: ASDF/INTERFACE does not contain a symbol NON-PROPAGATING-OPERATION
(LOAD hu.dwim.quasi-quote.xml FAIL) needs newer ASDF, ASDF/FIND-SYSTEM:LOAD-SYSTEM-DEFINITION-ERROR : Error while trying to load definition for system hu.dwim.quasi-quote.xml from pathname /home/testgrid/cl-test-grid/work-dir/agent/quicklisp/dists/quicklisp/software/hu.dwim.quasi-quote-20150608-darcs/hu.dwim.quasi-quote.xml.asd: ASDF/INTERFACE does not contain a symbol NON-PROPAGATING-OPERATION
(LOAD hu.dwim.quasi-quote.test FAIL) needs newer ASDF, ASDF/FIND-SYSTEM:LOAD-SYSTEM-DEFINITION-ERROR : Error while trying to load definition for system hu.dwim.quasi-quote.test from pathname /home/testgrid/cl-test-grid/work-dir/agent/quicklisp/dists/quicklisp/software/hu.dwim.quasi-quote-20150608-darcs/hu.dwim.quasi-quote.test.asd: ASDF/INTERFACE does not contain a symbol NON-PROPAGATING-OPERATION
(LOAD hu.dwim.quasi-quote.js FAIL) needs newer ASDF, ASDF/FIND-SYSTEM:LOAD-SYSTEM-DEFINITION-ERROR : Error while trying to load definition for system hu.dwim.quasi-quote.js from pathname /home/testgrid/cl-test-grid/work-dir/agent/quicklisp/dists/quicklisp/software/hu.dwim.quasi-quote-20150608-darcs/hu.dwim.quasi-quote.js.asd: ASDF/INTERFACE does not contain a symbol NON-PROPAGATING-OPERATION
(LOAD hu.dwim.quasi-quote.css FAIL) needs newer ASDF, ASDF/FIND-SYSTEM:LOAD-SYSTEM-DEFINITION-ERROR : Error while trying to load definition for system hu.dwim.quasi-quote.css from pathname /home/testgrid/cl-test-grid/work-dir/agent/quicklisp/dists/quicklisp/software/hu.dwim.quasi-quote-20150608-darcs/hu.dwim.quasi-quote.css.asd: ASDF/INTERFACE does not contain a symbol NON-PROPAGATING-OPERATION
(LOAD hu.dwim.quasi-quote FAIL) needs newer ASDF, ASDF/FIND-SYSTEM:LOAD-SYSTEM-DEFINITION-ERROR : Error while trying to load definition for system hu.dwim.quasi-quote from pathname /home/testgrid/cl-test-grid/work-dir/agent/quicklisp/dists/quicklisp/software/hu.dwim.quasi-quote-20150608-darcs/hu.dwim.quasi-quote.asd: ASDF/INTERFACE does not contain a symbol NON-PROPAGATING-OPERATION
(LOAD hu.dwim.quasi-quote.xml+hu.dwim.quasi-quote.js FAIL) ASDF/FIND-SYSTEM:MISSING-COMPONENT : Component "iolib/os" not found
(LOAD hu.dwim.quasi-quote.xml+cxml FAIL) COMMON-LISP:SIMPLE-ERROR : Error in function USE-PACKAGE: Use'ing package CLOSER-MOP results in name conflicts for these symbols: (TYPEP SUBTYPEP)
(LOAD hu.dwim.quasi-quote.xml FAIL) COMMON-LISP:SIMPLE-ERROR : Error in function USE-PACKAGE: Use'ing package CLOSER-MOP results in name conflicts for these symbols: (TYPEP SUBTYPEP)
(LOAD hu.dwim.quasi-quote.test FAIL) ASDF/FIND-SYSTEM:MISSING-COMPONENT : Component "iolib/os" not found
(LOAD hu.dwim.quasi-quote.js FAIL) ASDF/FIND-SYSTEM:MISSING-COMPONENT : Component "iolib/os" not found
(LOAD hu.dwim.quasi-quote.css FAIL) COMMON-LISP:SIMPLE-ERROR : Error in function USE-PACKAGE: Use'ing package CLOSER-MOP results in name conflicts for these symbols: (TYPEP SUBTYPEP)
(LOAD hu.dwim.quasi-quote FAIL) COMMON-LISP:SIMPLE-ERROR : Error in function USE-PACKAGE: Use'ing package CLOSER-MOP results in name conflicts for these symbols: (TYPEP SUBTYPEP)
cmu-snapshot-2014-01__20e_unicode_-linux-x86
(LOAD hu.dwim.quasi-quote.xml+hu.dwim.quasi-quote.js FAIL) needs newer ASDF, ASDF/FIND-SYSTEM:LOAD-SYSTEM-DEFINITION-ERROR : Error while trying to load definition for system hu.dwim.quasi-quote.xml+hu.dwim.quasi-quote.js from pathname /home/testgrid/cl-test-grid/work-dir/agent/quicklisp/dists/quicklisp/software/hu.dwim.quasi-quote-20150608-darcs/hu.dwim.quasi-quote.xml+hu.dwim.quasi-quote.js.asd: ASDF/INTERFACE does not contain a symbol NON-PROPAGATING-OPERATION
(LOAD hu.dwim.quasi-quote.xml+cxml FAIL) needs newer ASDF, ASDF/FIND-SYSTEM:LOAD-SYSTEM-DEFINITION-ERROR : Error while trying to load definition for system hu.dwim.quasi-quote.xml+cxml from pathname /home/testgrid/cl-test-grid/work-dir/agent/quicklisp/dists/quicklisp/software/hu.dwim.quasi-quote-20150608-darcs/hu.dwim.quasi-quote.xml+cxml.asd: ASDF/INTERFACE does not contain a symbol NON-PROPAGATING-OPERATION
(LOAD hu.dwim.quasi-quote.xml FAIL) needs newer ASDF, ASDF/FIND-SYSTEM:LOAD-SYSTEM-DEFINITION-ERROR : Error while trying to load definition for system hu.dwim.quasi-quote.xml from pathname /home/testgrid/cl-test-grid/work-dir/agent/quicklisp/dists/quicklisp/software/hu.dwim.quasi-quote-20150608-darcs/hu.dwim.quasi-quote.xml.asd: ASDF/INTERFACE does not contain a symbol NON-PROPAGATING-OPERATION
(LOAD hu.dwim.quasi-quote.test FAIL) needs newer ASDF, ASDF/FIND-SYSTEM:LOAD-SYSTEM-DEFINITION-ERROR : Error while trying to load definition for system hu.dwim.quasi-quote.test from pathname /home/testgrid/cl-test-grid/work-dir/agent/quicklisp/dists/quicklisp/software/hu.dwim.quasi-quote-20150608-darcs/hu.dwim.quasi-quote.test.asd: ASDF/INTERFACE does not contain a symbol NON-PROPAGATING-OPERATION
(LOAD hu.dwim.quasi-quote.js FAIL) needs newer ASDF, ASDF/FIND-SYSTEM:LOAD-SYSTEM-DEFINITION-ERROR : Error while trying to load definition for system hu.dwim.quasi-quote.js from pathname /home/testgrid/cl-test-grid/work-dir/agent/quicklisp/dists/quicklisp/software/hu.dwim.quasi-quote-20150608-darcs/hu.dwim.quasi-quote.js.asd: ASDF/INTERFACE does not contain a symbol NON-PROPAGATING-OPERATION
(LOAD hu.dwim.quasi-quote.css FAIL) needs newer ASDF, ASDF/FIND-SYSTEM:LOAD-SYSTEM-DEFINITION-ERROR : Error while trying to load definition for system hu.dwim.quasi-quote.css from pathname /home/testgrid/cl-test-grid/work-dir/agent/quicklisp/dists/quicklisp/software/hu.dwim.quasi-quote-20150608-darcs/hu.dwim.quasi-quote.css.asd: ASDF/INTERFACE does not contain a symbol NON-PROPAGATING-OPERATION
(LOAD hu.dwim.quasi-quote FAIL) needs newer ASDF, ASDF/FIND-SYSTEM:LOAD-SYSTEM-DEFINITION-ERROR : Error while trying to load definition for system hu.dwim.quasi-quote from pathname /home/testgrid/cl-test-grid/work-dir/agent/quicklisp/dists/quicklisp/software/hu.dwim.quasi-quote-20150608-darcs/hu.dwim.quasi-quote.asd: ASDF/INTERFACE does not contain a symbol NON-PROPAGATING-OPERATION
(LOAD hu.dwim.quasi-quote.xml+hu.dwim.quasi-quote.js FAIL) COMMON-LISP:SIMPLE-ERROR : Error in function USE-PACKAGE: Use'ing package CLOSER-MOP results in name conflicts for these symbols: (TYPEP SUBTYPEP)
(LOAD hu.dwim.quasi-quote.xml+cxml FAIL) COMMON-LISP:SIMPLE-ERROR : Error in function USE-PACKAGE: Use'ing package CLOSER-MOP results in name conflicts for these symbols: (TYPEP SUBTYPEP)
(LOAD hu.dwim.quasi-quote.xml FAIL) COMMON-LISP:SIMPLE-ERROR : Error in function USE-PACKAGE: Use'ing package CLOSER-MOP results in name conflicts for these symbols: (TYPEP SUBTYPEP)
(LOAD hu.dwim.quasi-quote.test FAIL) COMMON-LISP:SIMPLE-ERROR : Error in function USE-PACKAGE: Use'ing package CLOSER-MOP results in name conflicts for these symbols: (TYPEP SUBTYPEP)
(LOAD hu.dwim.quasi-quote.js FAIL) COMMON-LISP:SIMPLE-ERROR : Error in function USE-PACKAGE: Use'ing package CLOSER-MOP results in name conflicts for these symbols: (TYPEP SUBTYPEP)
(LOAD hu.dwim.quasi-quote.css FAIL) COMMON-LISP:SIMPLE-ERROR : Error in function USE-PACKAGE: Use'ing package CLOSER-MOP results in name conflicts for these symbols: (TYPEP SUBTYPEP)
(LOAD hu.dwim.quasi-quote FAIL) COMMON-LISP:SIMPLE-ERROR : Error in function USE-PACKAGE: Use'ing package CLOSER-MOP results in name conflicts for these symbols: (TYPEP SUBTYPEP)
cmu-snapshot-2014-05-dirty__20e_unicode_-linux-x86
(LOAD hu.dwim.quasi-quote.xml+hu.dwim.quasi-quote.js FAIL) needs newer ASDF, ASDF/FIND-SYSTEM:LOAD-SYSTEM-DEFINITION-ERROR : Error while trying to load definition for system hu.dwim.quasi-quote.xml+hu.dwim.quasi-quote.js from pathname /home/testgrid/cl-test-grid/work-dir/agent/quicklisp/dists/quicklisp/software/hu.dwim.quasi-quote-20150608-darcs/hu.dwim.quasi-quote.xml+hu.dwim.quasi-quote.js.asd: ASDF/INTERFACE does not contain a symbol NON-PROPAGATING-OPERATION
(LOAD hu.dwim.quasi-quote.xml+cxml FAIL) needs newer ASDF, ASDF/FIND-SYSTEM:LOAD-SYSTEM-DEFINITION-ERROR : Error while trying to load definition for system hu.dwim.quasi-quote.xml+cxml from pathname /home/testgrid/cl-test-grid/work-dir/agent/quicklisp/dists/quicklisp/software/hu.dwim.quasi-quote-20150608-darcs/hu.dwim.quasi-quote.xml+cxml.asd: ASDF/INTERFACE does not contain a symbol NON-PROPAGATING-OPERATION
(LOAD hu.dwim.quasi-quote.xml FAIL) needs newer ASDF, ASDF/FIND-SYSTEM:LOAD-SYSTEM-DEFINITION-ERROR : Error while trying to load definition for system hu.dwim.quasi-quote.xml from pathname /home/testgrid/cl-test-grid/work-dir/agent/quicklisp/dists/quicklisp/software/hu.dwim.quasi-quote-20150608-darcs/hu.dwim.quasi-quote.xml.asd: ASDF/INTERFACE does not contain a symbol NON-PROPAGATING-OPERATION
(LOAD hu.dwim.quasi-quote.test FAIL) needs newer ASDF, ASDF/FIND-SYSTEM:LOAD-SYSTEM-DEFINITION-ERROR : Error while trying to load definition for system hu.dwim.quasi-quote.test from pathname /home/testgrid/cl-test-grid/work-dir/agent/quicklisp/dists/quicklisp/software/hu.dwim.quasi-quote-20150608-darcs/hu.dwim.quasi-quote.test.asd: ASDF/INTERFACE does not contain a symbol NON-PROPAGATING-OPERATION
(LOAD hu.dwim.quasi-quote.js FAIL) needs newer ASDF, ASDF/FIND-SYSTEM:LOAD-SYSTEM-DEFINITION-ERROR : Error while trying to load definition for system hu.dwim.quasi-quote.js from pathname /home/testgrid/cl-test-grid/work-dir/agent/quicklisp/dists/quicklisp/software/hu.dwim.quasi-quote-20150608-darcs/hu.dwim.quasi-quote.js.asd: ASDF/INTERFACE does not contain a symbol NON-PROPAGATING-OPERATION
(LOAD hu.dwim.quasi-quote.css FAIL) needs newer ASDF, ASDF/FIND-SYSTEM:LOAD-SYSTEM-DEFINITION-ERROR : Error while trying to load definition for system hu.dwim.quasi-quote.css from pathname /home/testgrid/cl-test-grid/work-dir/agent/quicklisp/dists/quicklisp/software/hu.dwim.quasi-quote-20150608-darcs/hu.dwim.quasi-quote.css.asd: ASDF/INTERFACE does not contain a symbol NON-PROPAGATING-OPERATION
(LOAD hu.dwim.quasi-quote FAIL) needs newer ASDF, ASDF/FIND-SYSTEM:LOAD-SYSTEM-DEFINITION-ERROR : Error while trying to load definition for system hu.dwim.quasi-quote from pathname /home/testgrid/cl-test-grid/work-dir/agent/quicklisp/dists/quicklisp/software/hu.dwim.quasi-quote-20150608-darcs/hu.dwim.quasi-quote.asd: ASDF/INTERFACE does not contain a symbol NON-PROPAGATING-OPERATION
(LOAD hu.dwim.quasi-quote.xml+hu.dwim.quasi-quote.js FAIL) COMMON-LISP:SIMPLE-ERROR : Error in function USE-PACKAGE: Use'ing package CLOSER-MOP results in name conflicts for these symbols: (TYPEP SUBTYPEP)
(LOAD hu.dwim.quasi-quote.xml+cxml FAIL) COMMON-LISP:SIMPLE-ERROR : Error in function USE-PACKAGE: Use'ing package CLOSER-MOP results in name conflicts for these symbols: (TYPEP SUBTYPEP)
(LOAD hu.dwim.quasi-quote.xml FAIL) COMMON-LISP:SIMPLE-ERROR : Error in function USE-PACKAGE: Use'ing package CLOSER-MOP results in name conflicts for these symbols: (TYPEP SUBTYPEP)
(LOAD hu.dwim.quasi-quote.test FAIL) COMMON-LISP:SIMPLE-ERROR : Error in function USE-PACKAGE: Use'ing package CLOSER-MOP results in name conflicts for these symbols: (TYPEP SUBTYPEP)
(LOAD hu.dwim.quasi-quote.js FAIL) COMMON-LISP:SIMPLE-ERROR : Error in function USE-PACKAGE: Use'ing package CLOSER-MOP results in name conflicts for these symbols: (TYPEP SUBTYPEP)
(LOAD hu.dwim.quasi-quote.css FAIL) COMMON-LISP:SIMPLE-ERROR : Error in function USE-PACKAGE: Use'ing package CLOSER-MOP results in name conflicts for these symbols: (TYPEP SUBTYPEP)
(LOAD hu.dwim.quasi-quote FAIL) COMMON-LISP:SIMPLE-ERROR : Error in function USE-PACKAGE: Use'ing package CLOSER-MOP results in name conflicts for these symbols: (TYPEP SUBTYPEP)
cmu-snapshot-2014-12___20f_unicode_-linux-x86
(LOAD hu.dwim.quasi-quote.xml+hu.dwim.quasi-quote.js FAIL) COMMON-LISP:SIMPLE-ERROR : Error in function USE-PACKAGE: Use'ing package CLOSER-MOP results in name conflicts for these symbols: (TYPEP SUBTYPEP)
(LOAD hu.dwim.quasi-quote.xml+cxml FAIL) COMMON-LISP:SIMPLE-ERROR : Error in function USE-PACKAGE: Use'ing package CLOSER-MOP results in name conflicts for these symbols: (TYPEP SUBTYPEP)
(LOAD hu.dwim.quasi-quote.xml FAIL) COMMON-LISP:SIMPLE-ERROR : Error in function USE-PACKAGE: Use'ing package CLOSER-MOP results in name conflicts for these symbols: (TYPEP SUBTYPEP)
(LOAD hu.dwim.quasi-quote.test FAIL) COMMON-LISP:SIMPLE-ERROR : Error in function USE-PACKAGE: Use'ing package CLOSER-MOP results in name conflicts for these symbols: (TYPEP SUBTYPEP)
(LOAD hu.dwim.quasi-quote.js FAIL) COMMON-LISP:SIMPLE-ERROR : Error in function USE-PACKAGE: Use'ing package CLOSER-MOP results in name conflicts for these symbols: (TYPEP SUBTYPEP)
(LOAD hu.dwim.quasi-quote.css FAIL) COMMON-LISP:SIMPLE-ERROR : Error in function USE-PACKAGE: Use'ing package CLOSER-MOP results in name conflicts for these symbols: (TYPEP SUBTYPEP)
(LOAD hu.dwim.quasi-quote FAIL) COMMON-LISP:SIMPLE-ERROR : Error in function USE-PACKAGE: Use'ing package CLOSER-MOP results in name conflicts for these symbols: (TYPEP SUBTYPEP)
(LOAD hu.dwim.quasi-quote.xml+hu.dwim.quasi-quote.js FAIL) COMMON-LISP:SIMPLE-ERROR : Error in function USE-PACKAGE: Use'ing package CLOSER-MOP results in name conflicts for these symbols: (TYPEP SUBTYPEP)
(LOAD hu.dwim.quasi-quote.xml+cxml FAIL) COMMON-LISP:SIMPLE-ERROR : Error in function USE-PACKAGE: Use'ing package CLOSER-MOP results in name conflicts for these symbols: (TYPEP SUBTYPEP)
(LOAD hu.dwim.quasi-quote.xml FAIL) COMMON-LISP:SIMPLE-ERROR : Error in function USE-PACKAGE: Use'ing package CLOSER-MOP results in name conflicts for these symbols: (TYPEP SUBTYPEP)
(LOAD hu.dwim.quasi-quote.test FAIL) COMMON-LISP:SIMPLE-ERROR : Error in function USE-PACKAGE: Use'ing package CLOSER-MOP results in name conflicts for these symbols: (TYPEP SUBTYPEP)
(LOAD hu.dwim.quasi-quote.js FAIL) COMMON-LISP:SIMPLE-ERROR : Error in function USE-PACKAGE: Use'ing package CLOSER-MOP results in name conflicts for these symbols: (TYPEP SUBTYPEP)
(LOAD hu.dwim.quasi-quote.css FAIL) COMMON-LISP:SIMPLE-ERROR : Error in function USE-PACKAGE: Use'ing package CLOSER-MOP results in name conflicts for these symbols: (TYPEP SUBTYPEP)
(LOAD hu.dwim.quasi-quote FAIL) COMMON-LISP:SIMPLE-ERROR : Error in function USE-PACKAGE: Use'ing package CLOSER-MOP results in name conflicts for these symbols: (TYPEP SUBTYPEP)
ecl-13.5.1-unknown-linux-i686-bytecode
(LOAD hu.dwim.quasi-quote.xml+hu.dwim.quasi-quote.js FAIL) needs newer ASDF, ASDF/FIND-SYSTEM:LOAD-SYSTEM-DEFINITION-ERROR : Error while trying to load definition for system hu.dwim.quasi-quote.xml+hu.dwim.quasi-quote.js from pathname /home/testgrid/cl-test-grid/work-dir/agent/quicklisp/dists/quicklisp/software/hu.dwim.quasi-quote-20150608-darcs/hu.dwim.quasi-quote.xml+hu.dwim.quasi-quote.js.asd: Cannot find symbol "NON-PROPAGATING-OPERATION" in package #<"ASDF/INTERFACE" package>
(LOAD hu.dwim.quasi-quote.xml+cxml FAIL) needs newer ASDF, ASDF/FIND-SYSTEM:LOAD-SYSTEM-DEFINITION-ERROR : Error while trying to load definition for system hu.dwim.quasi-quote.xml+cxml from pathname /home/testgrid/cl-test-grid/work-dir/agent/quicklisp/dists/quicklisp/software/hu.dwim.quasi-quote-20150608-darcs/hu.dwim.quasi-quote.xml+cxml.asd: Cannot find symbol "NON-PROPAGATING-OPERATION" in package #<"ASDF/INTERFACE" package>
(LOAD hu.dwim.quasi-quote.xml FAIL) needs newer ASDF, ASDF/FIND-SYSTEM:LOAD-SYSTEM-DEFINITION-ERROR : Error while trying to load definition for system hu.dwim.quasi-quote.xml from pathname /home/testgrid/cl-test-grid/work-dir/agent/quicklisp/dists/quicklisp/software/hu.dwim.quasi-quote-20150608-darcs/hu.dwim.quasi-quote.xml.asd: Cannot find symbol "NON-PROPAGATING-OPERATION" in package #<"ASDF/INTERFACE" package>
(LOAD hu.dwim.quasi-quote.test FAIL) needs newer ASDF, ASDF/FIND-SYSTEM:LOAD-SYSTEM-DEFINITION-ERROR : Error while trying to load definition for system hu.dwim.quasi-quote.test from pathname /home/testgrid/cl-test-grid/work-dir/agent/quicklisp/dists/quicklisp/software/hu.dwim.quasi-quote-20150608-darcs/hu.dwim.quasi-quote.test.asd: Cannot find symbol "NON-PROPAGATING-OPERATION" in package #<"ASDF/INTERFACE" package>
(LOAD hu.dwim.quasi-quote.js FAIL) needs newer ASDF, ASDF/FIND-SYSTEM:LOAD-SYSTEM-DEFINITION-ERROR : Error while trying to load definition for system hu.dwim.quasi-quote.js from pathname /home/testgrid/cl-test-grid/work-dir/agent/quicklisp/dists/quicklisp/software/hu.dwim.quasi-quote-20150608-darcs/hu.dwim.quasi-quote.js.asd: Cannot find symbol "NON-PROPAGATING-OPERATION" in package #<"ASDF/INTERFACE" package>
(LOAD hu.dwim.quasi-quote.css FAIL) needs newer ASDF, ASDF/FIND-SYSTEM:LOAD-SYSTEM-DEFINITION-ERROR : Error while trying to load definition for system hu.dwim.quasi-quote.css from pathname /home/testgrid/cl-test-grid/work-dir/agent/quicklisp/dists/quicklisp/software/hu.dwim.quasi-quote-20150608-darcs/hu.dwim.quasi-quote.css.asd: Cannot find symbol "NON-PROPAGATING-OPERATION" in package #<"ASDF/INTERFACE" package>
(LOAD hu.dwim.quasi-quote FAIL) needs newer ASDF, ASDF/FIND-SYSTEM:LOAD-SYSTEM-DEFINITION-ERROR : Error while trying to load definition for system hu.dwim.quasi-quote from pathname /home/testgrid/cl-test-grid/work-dir/agent/quicklisp/dists/quicklisp/software/hu.dwim.quasi-quote-20150608-darcs/hu.dwim.quasi-quote.asd: Cannot find symbol "NON-PROPAGATING-OPERATION" in package #<"ASDF/INTERFACE" package>
(LOAD hu.dwim.quasi-quote.xml+hu.dwim.quasi-quote.js FAIL) ASDF/FIND-SYSTEM:MISSING-COMPONENT : Component "iolib/os" not found
(LOAD hu.dwim.quasi-quote.xml+cxml FAIL) COMMON-LISP:UNDEFINED-FUNCTION : The function C::CMP-ENV-VARIABLES is undefined.
(LOAD hu.dwim.quasi-quote.xml FAIL) COMMON-LISP:UNDEFINED-FUNCTION : The function C::CMP-ENV-VARIABLES is undefined.
(LOAD hu.dwim.quasi-quote.test FAIL) ASDF/FIND-SYSTEM:MISSING-COMPONENT : Component "iolib/os" not found
(LOAD hu.dwim.quasi-quote.js FAIL) ASDF/FIND-SYSTEM:MISSING-COMPONENT : Component "iolib/os" not found
(LOAD hu.dwim.quasi-quote.css FAIL) COMMON-LISP:UNDEFINED-FUNCTION : The function C::CMP-ENV-VARIABLES is undefined.
(LOAD hu.dwim.quasi-quote FAIL) COMMON-LISP:UNDEFINED-FUNCTION : The function C::CMP-ENV-VARIABLES is undefined.
ecl-13.5.1-unknown-linux-i686-lisp-to-c
(LOAD hu.dwim.quasi-quote.xml+hu.dwim.quasi-quote.js FAIL) ASDF/FIND-SYSTEM:LOAD-SYSTEM-DEFINITION-ERROR : Error while trying to load definition for system hu.dwim.quasi-quote.xml+hu.dwim.quasi-quote.js from pathname /home/testgrid/cl-test-grid/work-dir/agent/quicklisp/dists/quicklisp/software/hu.dwim.quasi-quote-20150608-darcs/hu.dwim.quasi-quote.xml+hu.dwim.quasi-quote.js.asd: COMPILE-FILE-ERROR while compiling #<cl-source-file "hu.dwim.asdf" "source" "package">
(LOAD hu.dwim.quasi-quote.xml+cxml FAIL) ASDF/FIND-SYSTEM:LOAD-SYSTEM-DEFINITION-ERROR : Error while trying to load definition for system hu.dwim.quasi-quote.xml+cxml from pathname /home/testgrid/cl-test-grid/work-dir/agent/quicklisp/dists/quicklisp/software/hu.dwim.quasi-quote-20150608-darcs/hu.dwim.quasi-quote.xml+cxml.asd: COMPILE-FILE-ERROR while compiling #<cl-source-file "hu.dwim.asdf" "source" "package">
(LOAD hu.dwim.quasi-quote.xml FAIL) ASDF/FIND-SYSTEM:LOAD-SYSTEM-DEFINITION-ERROR : Error while trying to load definition for system hu.dwim.quasi-quote.xml from pathname /home/testgrid/cl-test-grid/work-dir/agent/quicklisp/dists/quicklisp/software/hu.dwim.quasi-quote-20150608-darcs/hu.dwim.quasi-quote.xml.asd: COMPILE-FILE-ERROR while compiling #<cl-source-file "hu.dwim.asdf" "source" "package">
(LOAD hu.dwim.quasi-quote.test FAIL) ASDF/FIND-SYSTEM:LOAD-SYSTEM-DEFINITION-ERROR : Error while trying to load definition for system hu.dwim.quasi-quote.test from pathname /home/testgrid/cl-test-grid/work-dir/agent/quicklisp/dists/quicklisp/software/hu.dwim.quasi-quote-20150608-darcs/hu.dwim.quasi-quote.test.asd: COMPILE-FILE-ERROR while compiling #<cl-source-file "hu.dwim.asdf" "source" "package">
(LOAD hu.dwim.quasi-quote.js FAIL) ASDF/FIND-SYSTEM:LOAD-SYSTEM-DEFINITION-ERROR : Error while trying to load definition for system hu.dwim.quasi-quote.js from pathname /home/testgrid/cl-test-grid/work-dir/agent/quicklisp/dists/quicklisp/software/hu.dwim.quasi-quote-20150608-darcs/hu.dwim.quasi-quote.js.asd: COMPILE-FILE-ERROR while compiling #<cl-source-file "hu.dwim.asdf" "source" "package">
(LOAD hu.dwim.quasi-quote.css FAIL) ASDF/FIND-SYSTEM:LOAD-SYSTEM-DEFINITION-ERROR : Error while trying to load definition for system hu.dwim.quasi-quote.css from pathname /home/testgrid/cl-test-grid/work-dir/agent/quicklisp/dists/quicklisp/software/hu.dwim.quasi-quote-20150608-darcs/hu.dwim.quasi-quote.css.asd: COMPILE-FILE-ERROR while compiling #<cl-source-file "hu.dwim.asdf" "source" "package">
(LOAD hu.dwim.quasi-quote FAIL) ASDF/FIND-SYSTEM:LOAD-SYSTEM-DEFINITION-ERROR : Error while trying to load definition for system hu.dwim.quasi-quote from pathname /home/testgrid/cl-test-grid/work-dir/agent/quicklisp/dists/quicklisp/software/hu.dwim.quasi-quote-20150608-darcs/hu.dwim.quasi-quote.asd: COMPILE-FILE-ERROR while compiling #<cl-source-file "hu.dwim.asdf" "source" "package">
(LOAD hu.dwim.quasi-quote.xml+hu.dwim.quasi-quote.js FAIL) ASDF/FIND-SYSTEM:MISSING-COMPONENT : Component "iolib/os" not found
(LOAD hu.dwim.quasi-quote.xml+cxml FAIL) UIOP/LISP-BUILD:COMPILE-FILE-ERROR : COMPILE-FILE-ERROR while compiling #<hu.dwim.cl-source-file "hu.dwim.walker" "source" "infrastructure">
(LOAD hu.dwim.quasi-quote.xml FAIL) UIOP/LISP-BUILD:COMPILE-FILE-ERROR : COMPILE-FILE-ERROR while compiling #<hu.dwim.cl-source-file "hu.dwim.walker" "source" "infrastructure">
(LOAD hu.dwim.quasi-quote.test FAIL) ASDF/FIND-SYSTEM:MISSING-COMPONENT : Component "iolib/os" not found
(LOAD hu.dwim.quasi-quote.js FAIL) ASDF/FIND-SYSTEM:MISSING-COMPONENT : Component "iolib/os" not found
(LOAD hu.dwim.quasi-quote.css FAIL) UIOP/LISP-BUILD:COMPILE-FILE-ERROR : COMPILE-FILE-ERROR while compiling #<hu.dwim.cl-source-file "hu.dwim.walker" "source" "infrastructure">
(LOAD hu.dwim.quasi-quote FAIL) UIOP/LISP-BUILD:COMPILE-FILE-ERROR : COMPILE-FILE-ERROR while compiling #<hu.dwim.cl-source-file "hu.dwim.walker" "source" "infrastructure">
ecl-15.2.21-ee989b97-linux-i686-bytecode
(LOAD hu.dwim.quasi-quote.xml+hu.dwim.quasi-quote.js FAIL) ASDF/FIND-SYSTEM:LOAD-SYSTEM-DEFINITION-ERROR : Error while trying to load definition for system iolib from pathname /home/testgrid/cl-test-grid/work-dir/agent/quicklisp/dists/quicklisp/software/iolib-20150302-git/iolib.asd: The variable C::*CC-FLAGS* is unbound.
(LOAD hu.dwim.quasi-quote.xml+cxml FAIL) COMMON-LISP:UNDEFINED-FUNCTION : The function C::CMP-ENV-VARIABLES is undefined.
(LOAD hu.dwim.quasi-quote.xml FAIL) COMMON-LISP:UNDEFINED-FUNCTION : The function C::CMP-ENV-VARIABLES is undefined.
(LOAD hu.dwim.quasi-quote.test FAIL) ASDF/FIND-SYSTEM:LOAD-SYSTEM-DEFINITION-ERROR : Error while trying to load definition for system iolib from pathname /home/testgrid/cl-test-grid/work-dir/agent/quicklisp/dists/quicklisp/software/iolib-20150302-git/iolib.asd: The variable C::*CC-FLAGS* is unbound.
(LOAD hu.dwim.quasi-quote.js FAIL) ASDF/FIND-SYSTEM:LOAD-SYSTEM-DEFINITION-ERROR : Error while trying to load definition for system iolib from pathname /home/testgrid/cl-test-grid/work-dir/agent/quicklisp/dists/quicklisp/software/iolib-20150302-git/iolib.asd: The variable C::*CC-FLAGS* is unbound.
(LOAD hu.dwim.quasi-quote.css FAIL) COMMON-LISP:UNDEFINED-FUNCTION : The function C::CMP-ENV-VARIABLES is undefined.
(LOAD hu.dwim.quasi-quote FAIL) COMMON-LISP:UNDEFINED-FUNCTION : The function C::CMP-ENV-VARIABLES is undefined.
(LOAD hu.dwim.quasi-quote.xml+hu.dwim.quasi-quote.js FAIL) ASDF/FIND-SYSTEM:LOAD-SYSTEM-DEFINITION-ERROR : Error while trying to load definition for system iolib from pathname /home/testgrid/cl-test-grid/work-dir/agent/quicklisp/dists/quicklisp/software/iolib-20150302-git/iolib.asd: The variable C::*CC-FLAGS* is unbound.
(LOAD hu.dwim.quasi-quote.xml+cxml FAIL) COMMON-LISP:UNDEFINED-FUNCTION : The function C::CMP-ENV-VARIABLES is undefined.
(LOAD hu.dwim.quasi-quote.xml FAIL) COMMON-LISP:UNDEFINED-FUNCTION : The function C::CMP-ENV-VARIABLES is undefined.
(LOAD hu.dwim.quasi-quote.test FAIL) ASDF/FIND-SYSTEM:LOAD-SYSTEM-DEFINITION-ERROR : Error while trying to load definition for system iolib from pathname /home/testgrid/cl-test-grid/work-dir/agent/quicklisp/dists/quicklisp/software/iolib-20150302-git/iolib.asd: The variable C::*CC-FLAGS* is unbound.
(LOAD hu.dwim.quasi-quote.js FAIL) ASDF/FIND-SYSTEM:LOAD-SYSTEM-DEFINITION-ERROR : Error while trying to load definition for system iolib from pathname /home/testgrid/cl-test-grid/work-dir/agent/quicklisp/dists/quicklisp/software/iolib-20150302-git/iolib.asd: The variable C::*CC-FLAGS* is unbound.
(LOAD hu.dwim.quasi-quote.css FAIL) COMMON-LISP:UNDEFINED-FUNCTION : The function C::CMP-ENV-VARIABLES is undefined.
(LOAD hu.dwim.quasi-quote FAIL) COMMON-LISP:UNDEFINED-FUNCTION : The function C::CMP-ENV-VARIABLES is undefined.
ecl-15.2.21-ee989b97-linux-i686-lisp-to-c
(LOAD hu.dwim.quasi-quote.xml+hu.dwim.quasi-quote.js FAIL) ASDF/FIND-SYSTEM:LOAD-SYSTEM-DEFINITION-ERROR : Error while trying to load definition for system iolib from pathname /home/testgrid/cl-test-grid/work-dir/agent/quicklisp/dists/quicklisp/software/iolib-20150302-git/iolib.asd: COMPILE-FILE-ERROR while compiling #<cl-source-file "alexandria" "macros">
(LOAD hu.dwim.quasi-quote.xml+cxml FAIL) UIOP/LISP-BUILD:COMPILE-FILE-ERROR : COMPILE-FILE-ERROR while compiling #<cl-source-file "alexandria" "macros">
(LOAD hu.dwim.quasi-quote.xml FAIL) UIOP/LISP-BUILD:COMPILE-FILE-ERROR : COMPILE-FILE-ERROR while compiling #<cl-source-file "alexandria" "macros">
(LOAD hu.dwim.quasi-quote.test FAIL) ASDF/FIND-SYSTEM:LOAD-SYSTEM-DEFINITION-ERROR : Error while trying to load definition for system iolib from pathname /home/testgrid/cl-test-grid/work-dir/agent/quicklisp/dists/quicklisp/software/iolib-20150302-git/iolib.asd: COMPILE-FILE-ERROR while compiling #<cl-source-file "alexandria" "macros">
(LOAD hu.dwim.quasi-quote.js FAIL) ASDF/FIND-SYSTEM:LOAD-SYSTEM-DEFINITION-ERROR : Error while trying to load definition for system iolib from pathname /home/testgrid/cl-test-grid/work-dir/agent/quicklisp/dists/quicklisp/software/iolib-20150302-git/iolib.asd: COMPILE-FILE-ERROR while compiling #<cl-source-file "alexandria" "macros">
(LOAD hu.dwim.quasi-quote.css FAIL) UIOP/LISP-BUILD:COMPILE-FILE-ERROR : COMPILE-FILE-ERROR while compiling #<cl-source-file "alexandria" "macros">
(LOAD hu.dwim.quasi-quote FAIL) UIOP/LISP-BUILD:COMPILE-FILE-ERROR : COMPILE-FILE-ERROR while compiling #<cl-source-file "alexandria" "macros">
(LOAD hu.dwim.quasi-quote.xml+hu.dwim.quasi-quote.js FAIL) UIOP/LISP-BUILD:COMPILE-FILE-ERROR : COMPILE-FILE-ERROR while compiling #<hu.dwim.cl-source-file "hu.dwim.walker" "source" "infrastructure">
(LOAD hu.dwim.quasi-quote.xml+cxml FAIL) UIOP/LISP-BUILD:COMPILE-FILE-ERROR : COMPILE-FILE-ERROR while compiling #<hu.dwim.cl-source-file "hu.dwim.walker" "source" "infrastructure">
(LOAD hu.dwim.quasi-quote.xml FAIL) UIOP/LISP-BUILD:COMPILE-FILE-ERROR : COMPILE-FILE-ERROR while compiling #<hu.dwim.cl-source-file "hu.dwim.walker" "source" "infrastructure">
(LOAD hu.dwim.quasi-quote.test FAIL) UIOP/LISP-BUILD:COMPILE-FILE-ERROR : COMPILE-FILE-ERROR while compiling #<hu.dwim.cl-source-file "hu.dwim.walker" "source" "infrastructure">
(LOAD hu.dwim.quasi-quote.js FAIL) UIOP/LISP-BUILD:COMPILE-FILE-ERROR : COMPILE-FILE-ERROR while compiling #<hu.dwim.cl-source-file "hu.dwim.walker" "source" "infrastructure">
(LOAD hu.dwim.quasi-quote.css FAIL) UIOP/LISP-BUILD:COMPILE-FILE-ERROR : COMPILE-FILE-ERROR while compiling #<hu.dwim.cl-source-file "hu.dwim.walker" "source" "infrastructure">
(LOAD hu.dwim.quasi-quote FAIL) UIOP/LISP-BUILD:COMPILE-FILE-ERROR : COMPILE-FILE-ERROR while compiling #<hu.dwim.cl-source-file "hu.dwim.walker" "source" "infrastructure">
ecl-15.2.21-ee989b97-linux-x64-bytecode
(LOAD hu.dwim.quasi-quote.xml+hu.dwim.quasi-quote.js FAIL) ASDF/FIND-SYSTEM:LOAD-SYSTEM-DEFINITION-ERROR : Error while trying to load definition for system iolib from pathname /home/hijarian/systems/cl-test-grid/work-dir/agent/quicklisp/dists/quicklisp/software/iolib-20150302-git/iolib.asd: The variable C::*CC-FLAGS* is unbound.
(LOAD hu.dwim.quasi-quote.xml+cxml FAIL) COMMON-LISP:UNDEFINED-FUNCTION : The function C::CMP-ENV-VARIABLES is undefined.
(LOAD hu.dwim.quasi-quote.xml FAIL) COMMON-LISP:UNDEFINED-FUNCTION : The function C::CMP-ENV-VARIABLES is undefined.
(LOAD hu.dwim.quasi-quote.test FAIL) ASDF/FIND-SYSTEM:LOAD-SYSTEM-DEFINITION-ERROR : Error while trying to load definition for system iolib from pathname /home/hijarian/systems/cl-test-grid/work-dir/agent/quicklisp/dists/quicklisp/software/iolib-20150302-git/iolib.asd: The variable C::*CC-FLAGS* is unbound.
(LOAD hu.dwim.quasi-quote.js FAIL) ASDF/FIND-SYSTEM:LOAD-SYSTEM-DEFINITION-ERROR : Error while trying to load definition for system iolib from pathname /home/hijarian/systems/cl-test-grid/work-dir/agent/quicklisp/dists/quicklisp/software/iolib-20150302-git/iolib.asd: The variable C::*CC-FLAGS* is unbound.
(LOAD hu.dwim.quasi-quote.css FAIL) COMMON-LISP:UNDEFINED-FUNCTION : The function C::CMP-ENV-VARIABLES is undefined.
(LOAD hu.dwim.quasi-quote FAIL) COMMON-LISP:UNDEFINED-FUNCTION : The function C::CMP-ENV-VARIABLES is undefined.
(LOAD hu.dwim.quasi-quote.xml+hu.dwim.quasi-quote.js FAIL) ASDF/FIND-SYSTEM:LOAD-SYSTEM-DEFINITION-ERROR : Error while trying to load definition for system iolib from pathname /home/hijarian/systems/cl-test-grid/work-dir/agent/quicklisp/dists/quicklisp/software/iolib-20150302-git/iolib.asd: The variable C::*CC-FLAGS* is unbound.
(LOAD hu.dwim.quasi-quote.xml+cxml FAIL) COMMON-LISP:UNDEFINED-FUNCTION : The function C::CMP-ENV-VARIABLES is undefined.
(LOAD hu.dwim.quasi-quote.xml FAIL) COMMON-LISP:UNDEFINED-FUNCTION : The function C::CMP-ENV-VARIABLES is undefined.
(LOAD hu.dwim.quasi-quote.test FAIL) ASDF/FIND-SYSTEM:LOAD-SYSTEM-DEFINITION-ERROR : Error while trying to load definition for system iolib from pathname /home/hijarian/systems/cl-test-grid/work-dir/agent/quicklisp/dists/quicklisp/software/iolib-20150302-git/iolib.asd: The variable C::*CC-FLAGS* is unbound.
(LOAD hu.dwim.quasi-quote.js FAIL) ASDF/FIND-SYSTEM:LOAD-SYSTEM-DEFINITION-ERROR : Error while trying to load definition for system iolib from pathname /home/hijarian/systems/cl-test-grid/work-dir/agent/quicklisp/dists/quicklisp/software/iolib-20150302-git/iolib.asd: The variable C::*CC-FLAGS* is unbound.
(LOAD hu.dwim.quasi-quote.css FAIL) COMMON-LISP:UNDEFINED-FUNCTION : The function C::CMP-ENV-VARIABLES is undefined.
(LOAD hu.dwim.quasi-quote FAIL) COMMON-LISP:UNDEFINED-FUNCTION : The function C::CMP-ENV-VARIABLES is undefined.
ecl-15.2.21-ee989b97-linux-x64-lisp-to-c
(LOAD hu.dwim.quasi-quote.xml+hu.dwim.quasi-quote.js FAIL) ASDF/FIND-SYSTEM:LOAD-SYSTEM-DEFINITION-ERROR : Error while trying to load definition for system iolib from pathname /home/hijarian/systems/cl-test-grid/work-dir/agent/quicklisp/dists/quicklisp/software/iolib-20150302-git/iolib.asd: COMPILE-FILE-ERROR while compiling #<cl-source-file "alexandria" "macros">
(LOAD hu.dwim.quasi-quote.xml+cxml FAIL) UIOP/LISP-BUILD:COMPILE-FILE-ERROR : COMPILE-FILE-ERROR while compiling #<cl-source-file "alexandria" "macros">
(LOAD hu.dwim.quasi-quote.xml FAIL) UIOP/LISP-BUILD:COMPILE-FILE-ERROR : COMPILE-FILE-ERROR while compiling #<cl-source-file "alexandria" "macros">
(LOAD hu.dwim.quasi-quote.test FAIL) ASDF/FIND-SYSTEM:LOAD-SYSTEM-DEFINITION-ERROR : Error while trying to load definition for system iolib from pathname /home/hijarian/systems/cl-test-grid/work-dir/agent/quicklisp/dists/quicklisp/software/iolib-20150302-git/iolib.asd: COMPILE-FILE-ERROR while compiling #<cl-source-file "alexandria" "macros">
(LOAD hu.dwim.quasi-quote.js FAIL) ASDF/FIND-SYSTEM:LOAD-SYSTEM-DEFINITION-ERROR : Error while trying to load definition for system iolib from pathname /home/hijarian/systems/cl-test-grid/work-dir/agent/quicklisp/dists/quicklisp/software/iolib-20150302-git/iolib.asd: COMPILE-FILE-ERROR while compiling #<cl-source-file "alexandria" "macros">
(LOAD hu.dwim.quasi-quote.css FAIL) UIOP/LISP-BUILD:COMPILE-FILE-ERROR : COMPILE-FILE-ERROR while compiling #<cl-source-file "alexandria" "macros">
(LOAD hu.dwim.quasi-quote FAIL) UIOP/LISP-BUILD:COMPILE-FILE-ERROR : COMPILE-FILE-ERROR while compiling #<cl-source-file "alexandria" "macros">
(LOAD hu.dwim.quasi-quote.xml+hu.dwim.quasi-quote.js FAIL) UIOP/LISP-BUILD:COMPILE-FILE-ERROR : COMPILE-FILE-ERROR while compiling #<hu.dwim.cl-source-file "hu.dwim.walker" "source" "infrastructure">
(LOAD hu.dwim.quasi-quote.xml+cxml FAIL) UIOP/LISP-BUILD:COMPILE-FILE-ERROR : COMPILE-FILE-ERROR while compiling #<hu.dwim.cl-source-file "hu.dwim.walker" "source" "infrastructure">
(LOAD hu.dwim.quasi-quote.xml FAIL) UIOP/LISP-BUILD:COMPILE-FILE-ERROR : COMPILE-FILE-ERROR while compiling #<hu.dwim.cl-source-file "hu.dwim.walker" "source" "infrastructure">
(LOAD hu.dwim.quasi-quote.test FAIL) UIOP/LISP-BUILD:COMPILE-FILE-ERROR : COMPILE-FILE-ERROR while compiling #<hu.dwim.cl-source-file "hu.dwim.walker" "source" "infrastructure">
(LOAD hu.dwim.quasi-quote.js FAIL) UIOP/LISP-BUILD:COMPILE-FILE-ERROR : COMPILE-FILE-ERROR while compiling #<hu.dwim.cl-source-file "hu.dwim.walker" "source" "infrastructure">
(LOAD hu.dwim.quasi-quote.css FAIL) UIOP/LISP-BUILD:COMPILE-FILE-ERROR : COMPILE-FILE-ERROR while compiling #<hu.dwim.cl-source-file "hu.dwim.walker" "source" "infrastructure">
(LOAD hu.dwim.quasi-quote FAIL) UIOP/LISP-BUILD:COMPILE-FILE-ERROR : COMPILE-FILE-ERROR while compiling #<hu.dwim.cl-source-file "hu.dwim.walker" "source" "infrastructure">
ecl-15.3.7-827d3035-linux-x64-lisp-to-c
(LOAD hu.dwim.quasi-quote.xml+hu.dwim.quasi-quote.js FAIL) UIOP/LISP-BUILD:COMPILE-FILE-ERROR : COMPILE-FILE-ERROR while compiling #<hu.dwim.cl-source-file "hu.dwim.walker" "source" "infrastructure">
(LOAD hu.dwim.quasi-quote.xml+cxml FAIL) UIOP/LISP-BUILD:COMPILE-FILE-ERROR : COMPILE-FILE-ERROR while compiling #<hu.dwim.cl-source-file "hu.dwim.walker" "source" "infrastructure">
(LOAD hu.dwim.quasi-quote.xml FAIL) UIOP/LISP-BUILD:COMPILE-FILE-ERROR : COMPILE-FILE-ERROR while compiling #<hu.dwim.cl-source-file "hu.dwim.walker" "source" "infrastructure">
(LOAD hu.dwim.quasi-quote.test FAIL) UIOP/LISP-BUILD:COMPILE-FILE-ERROR : COMPILE-FILE-ERROR while compiling #<hu.dwim.cl-source-file "hu.dwim.walker" "source" "infrastructure">
(LOAD hu.dwim.quasi-quote.js FAIL) UIOP/LISP-BUILD:COMPILE-FILE-ERROR : COMPILE-FILE-ERROR while compiling #<hu.dwim.cl-source-file "hu.dwim.walker" "source" "infrastructure">
(LOAD hu.dwim.quasi-quote.css FAIL) UIOP/LISP-BUILD:COMPILE-FILE-ERROR : COMPILE-FILE-ERROR while compiling #<hu.dwim.cl-source-file "hu.dwim.walker" "source" "infrastructure">
(LOAD hu.dwim.quasi-quote FAIL) UIOP/LISP-BUILD:COMPILE-FILE-ERROR : COMPILE-FILE-ERROR while compiling #<hu.dwim.cl-source-file "hu.dwim.walker" "source" "infrastructure">
(LOAD hu.dwim.quasi-quote.xml+hu.dwim.quasi-quote.js FAIL) UIOP/LISP-BUILD:COMPILE-FILE-ERROR : COMPILE-FILE-ERROR while compiling #<hu.dwim.cl-source-file "hu.dwim.walker" "source" "infrastructure">
(LOAD hu.dwim.quasi-quote.xml+cxml FAIL) UIOP/LISP-BUILD:COMPILE-FILE-ERROR : COMPILE-FILE-ERROR while compiling #<hu.dwim.cl-source-file "hu.dwim.walker" "source" "infrastructure">
(LOAD hu.dwim.quasi-quote.xml FAIL) UIOP/LISP-BUILD:COMPILE-FILE-ERROR : COMPILE-FILE-ERROR while compiling #<hu.dwim.cl-source-file "hu.dwim.walker" "source" "infrastructure">
(LOAD hu.dwim.quasi-quote.test FAIL) UIOP/LISP-BUILD:COMPILE-FILE-ERROR : COMPILE-FILE-ERROR while compiling #<hu.dwim.cl-source-file "hu.dwim.walker" "source" "infrastructure">
(LOAD hu.dwim.quasi-quote.js FAIL) UIOP/LISP-BUILD:COMPILE-FILE-ERROR : COMPILE-FILE-ERROR while compiling #<hu.dwim.cl-source-file "hu.dwim.walker" "source" "infrastructure">
(LOAD hu.dwim.quasi-quote.css FAIL) UIOP/LISP-BUILD:COMPILE-FILE-ERROR : COMPILE-FILE-ERROR while compiling #<hu.dwim.cl-source-file "hu.dwim.walker" "source" "infrastructure">
(LOAD hu.dwim.quasi-quote FAIL) UIOP/LISP-BUILD:COMPILE-FILE-ERROR : COMPILE-FILE-ERROR while compiling #<hu.dwim.cl-source-file "hu.dwim.walker" "source" "infrastructure">
ecl-15.3.7-a014bd2c-linux-x64-lisp-to-c
(LOAD hu.dwim.quasi-quote.xml+hu.dwim.quasi-quote.js FAIL) UIOP/LISP-BUILD:COMPILE-FILE-ERROR : COMPILE-FILE-ERROR while compiling #<hu.dwim.cl-source-file "hu.dwim.walker" "source" "infrastructure">
(LOAD hu.dwim.quasi-quote.xml+cxml FAIL) UIOP/LISP-BUILD:COMPILE-FILE-ERROR : COMPILE-FILE-ERROR while compiling #<hu.dwim.cl-source-file "hu.dwim.walker" "source" "infrastructure">
(LOAD hu.dwim.quasi-quote.xml FAIL) UIOP/LISP-BUILD:COMPILE-FILE-ERROR : COMPILE-FILE-ERROR while compiling #<hu.dwim.cl-source-file "hu.dwim.walker" "source" "infrastructure">
(LOAD hu.dwim.quasi-quote.test FAIL) UIOP/LISP-BUILD:COMPILE-FILE-ERROR : COMPILE-FILE-ERROR while compiling #<hu.dwim.cl-source-file "hu.dwim.walker" "source" "infrastructure">
(LOAD hu.dwim.quasi-quote.js FAIL) UIOP/LISP-BUILD:COMPILE-FILE-ERROR : COMPILE-FILE-ERROR while compiling #<hu.dwim.cl-source-file "hu.dwim.walker" "source" "infrastructure">
(LOAD hu.dwim.quasi-quote.css FAIL) UIOP/LISP-BUILD:COMPILE-FILE-ERROR : COMPILE-FILE-ERROR while compiling #<hu.dwim.cl-source-file "hu.dwim.walker" "source" "infrastructure">
(LOAD hu.dwim.quasi-quote FAIL) UIOP/LISP-BUILD:COMPILE-FILE-ERROR : COMPILE-FILE-ERROR while compiling #<hu.dwim.cl-source-file "hu.dwim.walker" "source" "infrastructure">
sbcl-1.0.58-linux-x86
(LOAD hu.dwim.quasi-quote.xml+hu.dwim.quasi-quote.js FAIL) ASDF:LOAD-SYSTEM-DEFINITION-ERROR : Error while trying to load definition for system hu.dwim.quasi-quote.xml+hu.dwim.quasi-quote.js from pathname /home/testgrid/cl-test-grid/work-dir/agent/quicklisp/dists/quicklisp/software/hu.dwim.quasi-quote-20150608-darcs/hu.dwim.quasi-quote.xml+hu.dwim.quasi-quote.js.asd: Error while trying to load definition for system hu.dwim.asdf from pathname /home/testgrid/cl-test-grid/work-dir/agent/quicklisp/dists/quicklisp/software/hu.dwim.asdf-20150608-darcs/hu.dwim.asdf.asd: READ error during COMPILE-FILE: :ASCII stream decoding error on #<SB-SYS:FD-STREAM for "file /home/testgrid/cl-test-grid/work-dir/agent/quicklisp/dists/quicklisp/software/hu.dwim.asdf-20150608-darcs/hu.dwim.asdf.asd" {B0BAA21}>: the octet sequence #(195) cannot be decoded. (in form starting at line: 1, column: 0, file-position: 0)
(LOAD hu.dwim.quasi-quote.xml+cxml FAIL) ASDF:LOAD-SYSTEM-DEFINITION-ERROR : Error while trying to load definition for system hu.dwim.quasi-quote.xml+cxml from pathname /home/testgrid/cl-test-grid/work-dir/agent/quicklisp/dists/quicklisp/software/hu.dwim.quasi-quote-20150608-darcs/hu.dwim.quasi-quote.xml+cxml.asd: Error while trying to load definition for system hu.dwim.asdf from pathname /home/testgrid/cl-test-grid/work-dir/agent/quicklisp/dists/quicklisp/software/hu.dwim.asdf-20150608-darcs/hu.dwim.asdf.asd: READ error during COMPILE-FILE: :ASCII stream decoding error on #<SB-SYS:FD-STREAM for "file /home/testgrid/cl-test-grid/work-dir/agent/quicklisp/dists/quicklisp/software/hu.dwim.asdf-20150608-darcs/hu.dwim.asdf.asd" {B0B6A21}>: the octet sequence #(195) cannot be decoded. (in form starting at line: 1, column: 0, file-position: 0)
(LOAD hu.dwim.quasi-quote.xml FAIL) ASDF:LOAD-SYSTEM-DEFINITION-ERROR : Error while trying to load definition for system hu.dwim.quasi-quote.xml from pathname /home/testgrid/cl-test-grid/work-dir/agent/quicklisp/dists/quicklisp/software/hu.dwim.quasi-quote-20150608-darcs/hu.dwim.quasi-quote.xml.asd: Error while trying to load definition for system hu.dwim.asdf from pathname /home/testgrid/cl-test-grid/work-dir/agent/quicklisp/dists/quicklisp/software/hu.dwim.asdf-20150608-darcs/hu.dwim.asdf.asd: READ error during COMPILE-FILE: :ASCII stream decoding error on #<SB-SYS:FD-STREAM for "file /home/testgrid/cl-test-grid/work-dir/agent/quicklisp/dists/quicklisp/software/hu.dwim.asdf-20150608-darcs/hu.dwim.asdf.asd" {B0B6A21}>: the octet sequence #(195) cannot be decoded. (in form starting at line: 1, column: 0, file-position: 0)
(LOAD hu.dwim.quasi-quote.test FAIL) ASDF:LOAD-SYSTEM-DEFINITION-ERROR : Error while trying to load definition for system hu.dwim.quasi-quote.test from pathname /home/testgrid/cl-test-grid/work-dir/agent/quicklisp/dists/quicklisp/software/hu.dwim.quasi-quote-20150608-darcs/hu.dwim.quasi-quote.test.asd: Error while trying to load definition for system hu.dwim.asdf from pathname /home/testgrid/cl-test-grid/work-dir/agent/quicklisp/dists/quicklisp/software/hu.dwim.asdf-20150608-darcs/hu.dwim.asdf.asd: READ error during COMPILE-FILE: :ASCII stream decoding error on #<SB-SYS:FD-STREAM for "file /home/testgrid/cl-test-grid/work-dir/agent/quicklisp/dists/quicklisp/software/hu.dwim.asdf-20150608-darcs/hu.dwim.asdf.asd" {B0B7A21}>: the octet sequence #(195) cannot be decoded. (in form starting at line: 1, column: 0, file-position: 0)
(LOAD hu.dwim.quasi-quote.js FAIL) ASDF:LOAD-SYSTEM-DEFINITION-ERROR : Error while trying to load definition for system hu.dwim.quasi-quote.js from pathname /home/testgrid/cl-test-grid/work-dir/agent/quicklisp/dists/quicklisp/software/hu.dwim.quasi-quote-20150608-darcs/hu.dwim.quasi-quote.js.asd: Error while trying to load definition for system hu.dwim.asdf from pathname /home/testgrid/cl-test-grid/work-dir/agent/quicklisp/dists/quicklisp/software/hu.dwim.asdf-20150608-darcs/hu.dwim.asdf.asd: READ error during COMPILE-FILE: :ASCII stream decoding error on #<SB-SYS:FD-STREAM for "file /home/testgrid/cl-test-grid/work-dir/agent/quicklisp/dists/quicklisp/software/hu.dwim.asdf-20150608-darcs/hu.dwim.asdf.asd" {B0B7A21}>: the octet sequence #(195) cannot be decoded. (in form starting at line: 1, column: 0, file-position: 0)
(LOAD hu.dwim.quasi-quote.css FAIL) ASDF:LOAD-SYSTEM-DEFINITION-ERROR : Error while trying to load definition for system hu.dwim.quasi-quote.css from pathname /home/testgrid/cl-test-grid/work-dir/agent/quicklisp/dists/quicklisp/software/hu.dwim.quasi-quote-20150608-darcs/hu.dwim.quasi-quote.css.asd: Error while trying to load definition for system hu.dwim.asdf from pathname /home/testgrid/cl-test-grid/work-dir/agent/quicklisp/dists/quicklisp/software/hu.dwim.asdf-20150608-darcs/hu.dwim.asdf.asd: READ error during COMPILE-FILE: :ASCII stream decoding error on #<SB-SYS:FD-STREAM for "file /home/testgrid/cl-test-grid/work-dir/agent/quicklisp/dists/quicklisp/software/hu.dwim.asdf-20150608-darcs/hu.dwim.asdf.asd" {B0B6A21}>: the octet sequence #(195) cannot be decoded. (in form starting at line: 1, column: 0, file-position: 0)
(LOAD hu.dwim.quasi-quote FAIL) ASDF:LOAD-SYSTEM-DEFINITION-ERROR : Error while trying to load definition for system hu.dwim.quasi-quote from pathname /home/testgrid/cl-test-grid/work-dir/agent/quicklisp/dists/quicklisp/software/hu.dwim.quasi-quote-20150608-darcs/hu.dwim.quasi-quote.asd: Error while trying to load definition for system hu.dwim.asdf from pathname /home/testgrid/cl-test-grid/work-dir/agent/quicklisp/dists/quicklisp/software/hu.dwim.asdf-20150608-darcs/hu.dwim.asdf.asd: READ error during COMPILE-FILE: :ASCII stream decoding error on #<SB-SYS:FD-STREAM for "file /home/testgrid/cl-test-grid/work-dir/agent/quicklisp/dists/quicklisp/software/hu.dwim.asdf-20150608-darcs/hu.dwim.asdf.asd" {B0B7A21}>: the octet sequence #(195) cannot be decoded. (in form starting at line: 1, column: 0, file-position: 0)
(LOAD hu.dwim.quasi-quote.xml+hu.dwim.quasi-quote.js FAIL) ASDF:LOAD-SYSTEM-DEFINITION-ERROR : Error while trying to load definition for system hu.dwim.quasi-quote.xml+hu.dwim.quasi-quote.js from pathname /home/testgrid/cl-test-grid/work-dir/agent/quicklisp/dists/quicklisp/software/hu.dwim.quasi-quote-20130813-darcs/hu.dwim.quasi-quote.xml+hu.dwim.quasi-quote.js.asd: Error while invoking #<COMPILE-OP NIL {B0D2691}> on #<CL-SOURCE-FILE "hu.dwim.asdf" "source" "system">
(LOAD hu.dwim.quasi-quote.xml+cxml FAIL) ASDF:LOAD-SYSTEM-DEFINITION-ERROR : Error while trying to load definition for system hu.dwim.quasi-quote.xml+cxml from pathname /home/testgrid/cl-test-grid/work-dir/agent/quicklisp/dists/quicklisp/software/hu.dwim.quasi-quote-20130813-darcs/hu.dwim.quasi-quote.xml+cxml.asd: Error while invoking #<COMPILE-OP NIL {B0CE691}> on #<CL-SOURCE-FILE "hu.dwim.asdf" "source" "system">
(LOAD hu.dwim.quasi-quote.xml FAIL) ASDF:LOAD-SYSTEM-DEFINITION-ERROR : Error while trying to load definition for system hu.dwim.quasi-quote.xml from pathname /home/testgrid/cl-test-grid/work-dir/agent/quicklisp/dists/quicklisp/software/hu.dwim.quasi-quote-20130813-darcs/hu.dwim.quasi-quote.xml.asd: Error while invoking #<COMPILE-OP NIL {B0CE691}> on #<CL-SOURCE-FILE "hu.dwim.asdf" "source" "system">
(LOAD hu.dwim.quasi-quote.test FAIL) ASDF:LOAD-SYSTEM-DEFINITION-ERROR : Error while trying to load definition for system hu.dwim.quasi-quote.test from pathname /home/testgrid/cl-test-grid/work-dir/agent/quicklisp/dists/quicklisp/software/hu.dwim.quasi-quote-20130813-darcs/hu.dwim.quasi-quote.test.asd: Error while invoking #<COMPILE-OP NIL {B0CE691}> on #<CL-SOURCE-FILE "hu.dwim.asdf" "source" "system">
(LOAD hu.dwim.quasi-quote.js FAIL) ASDF:LOAD-SYSTEM-DEFINITION-ERROR : Error while trying to load definition for system hu.dwim.quasi-quote.js from pathname /home/testgrid/cl-test-grid/work-dir/agent/quicklisp/dists/quicklisp/software/hu.dwim.quasi-quote-20130813-darcs/hu.dwim.quasi-quote.js.asd: Error while invoking #<COMPILE-OP NIL {B0CE691}> on #<CL-SOURCE-FILE "hu.dwim.asdf" "source" "system">
(LOAD hu.dwim.quasi-quote.css FAIL) ASDF:LOAD-SYSTEM-DEFINITION-ERROR : Error while trying to load definition for system hu.dwim.quasi-quote.css from pathname /home/testgrid/cl-test-grid/work-dir/agent/quicklisp/dists/quicklisp/software/hu.dwim.quasi-quote-20130813-darcs/hu.dwim.quasi-quote.css.asd: Error while invoking #<COMPILE-OP NIL {B0CE691}> on #<CL-SOURCE-FILE "hu.dwim.asdf" "source" "system">
(LOAD hu.dwim.quasi-quote FAIL) ASDF:LOAD-SYSTEM-DEFINITION-ERROR : Error while trying to load definition for system hu.dwim.quasi-quote from pathname /home/testgrid/cl-test-grid/work-dir/agent/quicklisp/dists/quicklisp/software/hu.dwim.quasi-quote-20130813-darcs/hu.dwim.quasi-quote.asd: Error while invoking #<COMPILE-OP NIL {B0CD691}> on #<CL-SOURCE-FILE "hu.dwim.asdf" "source" "system">
sbcl-1.1.11-linux-x86
(LOAD hu.dwim.quasi-quote.xml+hu.dwim.quasi-quote.js FAIL) needs newer ASDF, ASDF/FIND-SYSTEM:LOAD-SYSTEM-DEFINITION-ERROR : Error while trying to load definition for system hu.dwim.quasi-quote.xml+hu.dwim.quasi-quote.js from pathname /home/testgrid/cl-test-grid/work-dir/agent/quicklisp/dists/quicklisp/software/hu.dwim.quasi-quote-20150608-darcs/hu.dwim.quasi-quote.xml+hu.dwim.quasi-quote.js.asd: no symbol named "NON-PROPAGATING-OPERATION" in "ASDF/INTERFACE"
(LOAD hu.dwim.quasi-quote.xml+cxml FAIL) needs newer ASDF, ASDF/FIND-SYSTEM:LOAD-SYSTEM-DEFINITION-ERROR : Error while trying to load definition for system hu.dwim.quasi-quote.xml+cxml from pathname /home/testgrid/cl-test-grid/work-dir/agent/quicklisp/dists/quicklisp/software/hu.dwim.quasi-quote-20150608-darcs/hu.dwim.quasi-quote.xml+cxml.asd: no symbol named "NON-PROPAGATING-OPERATION" in "ASDF/INTERFACE"
(LOAD hu.dwim.quasi-quote.xml FAIL) needs newer ASDF, ASDF/FIND-SYSTEM:LOAD-SYSTEM-DEFINITION-ERROR : Error while trying to load definition for system hu.dwim.quasi-quote.xml from pathname /home/testgrid/cl-test-grid/work-dir/agent/quicklisp/dists/quicklisp/software/hu.dwim.quasi-quote-20150608-darcs/hu.dwim.quasi-quote.xml.asd: no symbol named "NON-PROPAGATING-OPERATION" in "ASDF/INTERFACE"
(LOAD hu.dwim.quasi-quote.test FAIL) needs newer ASDF, ASDF/FIND-SYSTEM:LOAD-SYSTEM-DEFINITION-ERROR : Error while trying to load definition for system hu.dwim.quasi-quote.test from pathname /home/testgrid/cl-test-grid/work-dir/agent/quicklisp/dists/quicklisp/software/hu.dwim.quasi-quote-20150608-darcs/hu.dwim.quasi-quote.test.asd: no symbol named "NON-PROPAGATING-OPERATION" in "ASDF/INTERFACE"
(LOAD hu.dwim.quasi-quote.js FAIL) needs newer ASDF, ASDF/FIND-SYSTEM:LOAD-SYSTEM-DEFINITION-ERROR : Error while trying to load definition for system hu.dwim.quasi-quote.js from pathname /home/testgrid/cl-test-grid/work-dir/agent/quicklisp/dists/quicklisp/software/hu.dwim.quasi-quote-20150608-darcs/hu.dwim.quasi-quote.js.asd: no symbol named "NON-PROPAGATING-OPERATION" in "ASDF/INTERFACE"
(LOAD hu.dwim.quasi-quote.css FAIL) needs newer ASDF, ASDF/FIND-SYSTEM:LOAD-SYSTEM-DEFINITION-ERROR : Error while trying to load definition for system hu.dwim.quasi-quote.css from pathname /home/testgrid/cl-test-grid/work-dir/agent/quicklisp/dists/quicklisp/software/hu.dwim.quasi-quote-20150608-darcs/hu.dwim.quasi-quote.css.asd: no symbol named "NON-PROPAGATING-OPERATION" in "ASDF/INTERFACE"
(LOAD hu.dwim.quasi-quote FAIL) needs newer ASDF, ASDF/FIND-SYSTEM:LOAD-SYSTEM-DEFINITION-ERROR : Error while trying to load definition for system hu.dwim.quasi-quote from pathname /home/testgrid/cl-test-grid/work-dir/agent/quicklisp/dists/quicklisp/software/hu.dwim.quasi-quote-20150608-darcs/hu.dwim.quasi-quote.asd: no symbol named "NON-PROPAGATING-OPERATION" in "ASDF/INTERFACE"
(LOAD hu.dwim.quasi-quote.xml+hu.dwim.quasi-quote.js FAIL) QUICKLISP-CLIENT:SYSTEM-NOT-FOUND : System "sb-sprof" not found
(LOAD hu.dwim.quasi-quote.xml+cxml FAIL) QUICKLISP-CLIENT:SYSTEM-NOT-FOUND : System "sb-sprof" not found
(LOAD hu.dwim.quasi-quote.xml FAIL) QUICKLISP-CLIENT:SYSTEM-NOT-FOUND : System "sb-sprof" not found
(LOAD hu.dwim.quasi-quote.test FAIL) QUICKLISP-CLIENT:SYSTEM-NOT-FOUND : System "sb-sprof" not found
(LOAD hu.dwim.quasi-quote.js FAIL) QUICKLISP-CLIENT:SYSTEM-NOT-FOUND : System "sb-sprof" not found
(LOAD hu.dwim.quasi-quote.css FAIL) QUICKLISP-CLIENT:SYSTEM-NOT-FOUND : System "sb-sprof" not found
(LOAD hu.dwim.quasi-quote FAIL) QUICKLISP-CLIENT:SYSTEM-NOT-FOUND : System "sb-sprof" not found
sbcl-1.1.16-linux-x86
(LOAD hu.dwim.quasi-quote.xml+hu.dwim.quasi-quote.js FAIL) needs newer ASDF, ASDF/FIND-SYSTEM:LOAD-SYSTEM-DEFINITION-ERROR : Error while trying to load definition for system hu.dwim.quasi-quote.xml+hu.dwim.quasi-quote.js from pathname /home/testgrid/cl-test-grid/work-dir/agent/quicklisp/dists/quicklisp/software/hu.dwim.quasi-quote-20150608-darcs/hu.dwim.quasi-quote.xml+hu.dwim.quasi-quote.js.asd: no symbol named "NON-PROPAGATING-OPERATION" in "ASDF/INTERFACE"
(LOAD hu.dwim.quasi-quote.xml+cxml FAIL) needs newer ASDF, ASDF/FIND-SYSTEM:LOAD-SYSTEM-DEFINITION-ERROR : Error while trying to load definition for system hu.dwim.quasi-quote.xml+cxml from pathname /home/testgrid/cl-test-grid/work-dir/agent/quicklisp/dists/quicklisp/software/hu.dwim.quasi-quote-20150608-darcs/hu.dwim.quasi-quote.xml+cxml.asd: no symbol named "NON-PROPAGATING-OPERATION" in "ASDF/INTERFACE"
(LOAD hu.dwim.quasi-quote.xml FAIL) needs newer ASDF, ASDF/FIND-SYSTEM:LOAD-SYSTEM-DEFINITION-ERROR : Error while trying to load definition for system hu.dwim.quasi-quote.xml from pathname /home/testgrid/cl-test-grid/work-dir/agent/quicklisp/dists/quicklisp/software/hu.dwim.quasi-quote-20150608-darcs/hu.dwim.quasi-quote.xml.asd: no symbol named "NON-PROPAGATING-OPERATION" in "ASDF/INTERFACE"
(LOAD hu.dwim.quasi-quote.test FAIL) needs newer ASDF, ASDF/FIND-SYSTEM:LOAD-SYSTEM-DEFINITION-ERROR : Error while trying to load definition for system hu.dwim.quasi-quote.test from pathname /home/testgrid/cl-test-grid/work-dir/agent/quicklisp/dists/quicklisp/software/hu.dwim.quasi-quote-20150608-darcs/hu.dwim.quasi-quote.test.asd: no symbol named "NON-PROPAGATING-OPERATION" in "ASDF/INTERFACE"
(LOAD hu.dwim.quasi-quote.js FAIL) needs newer ASDF, ASDF/FIND-SYSTEM:LOAD-SYSTEM-DEFINITION-ERROR : Error while trying to load definition for system hu.dwim.quasi-quote.js from pathname /home/testgrid/cl-test-grid/work-dir/agent/quicklisp/dists/quicklisp/software/hu.dwim.quasi-quote-20150608-darcs/hu.dwim.quasi-quote.js.asd: no symbol named "NON-PROPAGATING-OPERATION" in "ASDF/INTERFACE"
(LOAD hu.dwim.quasi-quote.css FAIL) needs newer ASDF, ASDF/FIND-SYSTEM:LOAD-SYSTEM-DEFINITION-ERROR : Error while trying to load definition for system hu.dwim.quasi-quote.css from pathname /home/testgrid/cl-test-grid/work-dir/agent/quicklisp/dists/quicklisp/software/hu.dwim.quasi-quote-20150608-darcs/hu.dwim.quasi-quote.css.asd: no symbol named "NON-PROPAGATING-OPERATION" in "ASDF/INTERFACE"
(LOAD hu.dwim.quasi-quote FAIL) needs newer ASDF, ASDF/FIND-SYSTEM:LOAD-SYSTEM-DEFINITION-ERROR : Error while trying to load definition for system hu.dwim.quasi-quote from pathname /home/testgrid/cl-test-grid/work-dir/agent/quicklisp/dists/quicklisp/software/hu.dwim.quasi-quote-20150608-darcs/hu.dwim.quasi-quote.asd: no symbol named "NON-PROPAGATING-OPERATION" in "ASDF/INTERFACE"
(LOAD hu.dwim.quasi-quote.xml+hu.dwim.quasi-quote.js FAIL) ASDF/FIND-SYSTEM:MISSING-COMPONENT : Component "iolib/os" not found
(LOAD hu.dwim.quasi-quote.test FAIL) ASDF/FIND-SYSTEM:MISSING-COMPONENT : Component "iolib/os" not found
(LOAD hu.dwim.quasi-quote.js FAIL) ASDF/FIND-SYSTEM:MISSING-COMPONENT : Component "iolib/os" not found
sbcl-1.2.3-linux-x64
(LOAD hu.dwim.quasi-quote.xml+hu.dwim.quasi-quote.js FAIL) COMMON-LISP:SIMPLE-ERROR : External process exited with code 1. Command was: "g++" "-m64" "-Wno-write-strings" "-I/home/hijarian/systems/cl-test-grid/work-dir/agent/quicklisp/dists/quicklisp/software/iolib-20150302-git/src/grovel/" "-o" "/home/hijarian/systems/cl-test-grid/work-dir/agent/test-runs/20150609131809-sbcl-1.2.3-linux-x64/fasl/ql/dists/quicklisp/software/iolib-20150302-git/src/syscalls/ffi-types-unix" "/home/hijarian/systems/cl-test-grid/work-dir/agent/test-runs/20150609131809-sbcl-1.2.3-linux-x64/fasl/ql/dists/quicklisp/software/iolib-20150302-git/src/syscalls/ffi-types-unix.c" Output was: /home/hijarian/systems/cl-test-grid/work-dir/agent/test-runs/20150609131809-sbcl-1.2.3-linux-x64/fasl/ql/dists/quicklisp/software/iolib-20150302-git/src/syscalls/ffi-types-unix.c:14:17: fatal error: lfp.h: Нет такого файла или каталога #include <lfp.h> ^ compilation terminated.
(LOAD hu.dwim.quasi-quote.test FAIL) COMMON-LISP:SIMPLE-ERROR : External process exited with code 1. Command was: "g++" "-m64" "-Wno-write-strings" "-I/home/hijarian/systems/cl-test-grid/work-dir/agent/quicklisp/dists/quicklisp/software/iolib-20150302-git/src/grovel/" "-o" "/home/hijarian/systems/cl-test-grid/work-dir/agent/test-runs/20150609131809-sbcl-1.2.3-linux-x64/fasl/ql/dists/quicklisp/software/iolib-20150302-git/src/syscalls/ffi-types-unix" "/home/hijarian/systems/cl-test-grid/work-dir/agent/test-runs/20150609131809-sbcl-1.2.3-linux-x64/fasl/ql/dists/quicklisp/software/iolib-20150302-git/src/syscalls/ffi-types-unix.c" Output was: /home/hijarian/systems/cl-test-grid/work-dir/agent/test-runs/20150609131809-sbcl-1.2.3-linux-x64/fasl/ql/dists/quicklisp/software/iolib-20150302-git/src/syscalls/ffi-types-unix.c:14:17: fatal error: lfp.h: Нет такого файла или каталога #include <lfp.h> ^ compilation terminated.
(LOAD hu.dwim.quasi-quote.js FAIL) COMMON-LISP:SIMPLE-ERROR : External process exited with code 1. Command was: "g++" "-m64" "-Wno-write-strings" "-I/home/hijarian/systems/cl-test-grid/work-dir/agent/quicklisp/dists/quicklisp/software/iolib-20150302-git/src/grovel/" "-o" "/home/hijarian/systems/cl-test-grid/work-dir/agent/test-runs/20150609131809-sbcl-1.2.3-linux-x64/fasl/ql/dists/quicklisp/software/iolib-20150302-git/src/syscalls/ffi-types-unix" "/home/hijarian/systems/cl-test-grid/work-dir/agent/test-runs/20150609131809-sbcl-1.2.3-linux-x64/fasl/ql/dists/quicklisp/software/iolib-20150302-git/src/syscalls/ffi-types-unix.c" Output was: /home/hijarian/systems/cl-test-grid/work-dir/agent/test-runs/20150609131809-sbcl-1.2.3-linux-x64/fasl/ql/dists/quicklisp/software/iolib-20150302-git/src/syscalls/ffi-types-unix.c:14:17: fatal error: lfp.h: Нет такого файла или каталога #include <lfp.h> ^ compilation terminated.
(LOAD hu.dwim.quasi-quote.xml+hu.dwim.quasi-quote.js FAIL) COMMON-LISP:SIMPLE-ERROR : External process exited with code 1. Command was: "g++" "-m64" "-Wno-write-strings" "-I/home/hijarian/systems/cl-test-grid/work-dir/agent/quicklisp/dists/quicklisp/software/iolib-20150302-git/src/grovel/" "-o" "/home/hijarian/systems/cl-test-grid/work-dir/agent/test-runs/20150518190329-sbcl-1.2.3-linux-x64/fasl/ql/dists/quicklisp/software/iolib-20150302-git/src/syscalls/ffi-types-unix" "/home/hijarian/systems/cl-test-grid/work-dir/agent/test-runs/20150518190329-sbcl-1.2.3-linux-x64/fasl/ql/dists/quicklisp/software/iolib-20150302-git/src/syscalls/ffi-types-unix.c" Output was: /home/hijarian/systems/cl-test-grid/work-dir/agent/test-runs/20150518190329-sbcl-1.2.3-linux-x64/fasl/ql/dists/quicklisp/software/iolib-20150302-git/src/syscalls/ffi-types-unix.c:14:17: fatal error: lfp.h: Нет такого файла или каталога #include <lfp.h> ^ compilation terminated.
(LOAD hu.dwim.quasi-quote.test FAIL) COMMON-LISP:SIMPLE-ERROR : External process exited with code 1. Command was: "g++" "-m64" "-Wno-write-strings" "-I/home/hijarian/systems/cl-test-grid/work-dir/agent/quicklisp/dists/quicklisp/software/iolib-20150302-git/src/grovel/" "-o" "/home/hijarian/systems/cl-test-grid/work-dir/agent/test-runs/20150518190329-sbcl-1.2.3-linux-x64/fasl/ql/dists/quicklisp/software/iolib-20150302-git/src/syscalls/ffi-types-unix" "/home/hijarian/systems/cl-test-grid/work-dir/agent/test-runs/20150518190329-sbcl-1.2.3-linux-x64/fasl/ql/dists/quicklisp/software/iolib-20150302-git/src/syscalls/ffi-types-unix.c" Output was: /home/hijarian/systems/cl-test-grid/work-dir/agent/test-runs/20150518190329-sbcl-1.2.3-linux-x64/fasl/ql/dists/quicklisp/software/iolib-20150302-git/src/syscalls/ffi-types-unix.c:14:17: fatal error: lfp.h: Нет такого файла или каталога #include <lfp.h> ^ compilation terminated.
(LOAD hu.dwim.quasi-quote.js FAIL) COMMON-LISP:SIMPLE-ERROR : External process exited with code 1. Command was: "g++" "-m64" "-Wno-write-strings" "-I/home/hijarian/systems/cl-test-grid/work-dir/agent/quicklisp/dists/quicklisp/software/iolib-20150302-git/src/grovel/" "-o" "/home/hijarian/systems/cl-test-grid/work-dir/agent/test-runs/20150518190329-sbcl-1.2.3-linux-x64/fasl/ql/dists/quicklisp/software/iolib-20150302-git/src/syscalls/ffi-types-unix" "/home/hijarian/systems/cl-test-grid/work-dir/agent/test-runs/20150518190329-sbcl-1.2.3-linux-x64/fasl/ql/dists/quicklisp/software/iolib-20150302-git/src/syscalls/ffi-types-unix.c" Output was: /home/hijarian/systems/cl-test-grid/work-dir/agent/test-runs/20150518190329-sbcl-1.2.3-linux-x64/fasl/ql/dists/quicklisp/software/iolib-20150302-git/src/syscalls/ffi-types-unix.c:14:17: fatal error: lfp.h: Нет такого файла или каталога #include <lfp.h> ^ compilation terminated.
sbcl-1.2.6-linux-x86

Breakdown by testcases: for every failed testcase the lisp implmentations it fails on

The library does not have a testsuite adapter for CL Test Grid.

To reports overview

Generated at: 2015-06-20 14:24:33 GMT.