hu.dwim.perec results collected by cl-test-grid

Results on the last two Quicklisp distributions

 quicklisp 2015-06-08quicklisp 2015-05-05
abcl-1.2.1-fasl42-linux-x86
(LOAD hu.dwim.perec.test FAIL) needs newer ASDF, ASDF/FIND-SYSTEM:LOAD-SYSTEM-DEFINITION-ERROR : Error while trying to load definition for system hu.dwim.perec.test from pathname /home/testgrid/cl-test-grid/work-dir/agent/quicklisp/dists/quicklisp/software/hu.dwim.perec-20150608-darcs/hu.dwim.perec.test.asd: The symbol NON-PROPAGATING-OPERATION is not present in package ASDF/INTERFACE.
(LOAD hu.dwim.perec.sqlite.test FAIL) needs newer ASDF, ASDF/FIND-SYSTEM:LOAD-SYSTEM-DEFINITION-ERROR : Error while trying to load definition for system hu.dwim.perec.sqlite.test from pathname /home/testgrid/cl-test-grid/work-dir/agent/quicklisp/dists/quicklisp/software/hu.dwim.perec-20150608-darcs/hu.dwim.perec.sqlite.test.asd: The symbol NON-PROPAGATING-OPERATION is not present in package ASDF/INTERFACE.
(LOAD hu.dwim.perec.sqlite FAIL) needs newer ASDF, ASDF/FIND-SYSTEM:LOAD-SYSTEM-DEFINITION-ERROR : Error while trying to load definition for system hu.dwim.perec.sqlite from pathname /home/testgrid/cl-test-grid/work-dir/agent/quicklisp/dists/quicklisp/software/hu.dwim.perec-20150608-darcs/hu.dwim.perec.sqlite.asd: The symbol NON-PROPAGATING-OPERATION is not present in package ASDF/INTERFACE.
(LOAD hu.dwim.perec.postgresql.test FAIL) needs newer ASDF, ASDF/FIND-SYSTEM:LOAD-SYSTEM-DEFINITION-ERROR : Error while trying to load definition for system hu.dwim.perec.postgresql.test from pathname /home/testgrid/cl-test-grid/work-dir/agent/quicklisp/dists/quicklisp/software/hu.dwim.perec-20150608-darcs/hu.dwim.perec.postgresql.test.asd: The symbol NON-PROPAGATING-OPERATION is not present in package ASDF/INTERFACE.
(LOAD hu.dwim.perec.postgresql FAIL) needs newer ASDF, ASDF/FIND-SYSTEM:LOAD-SYSTEM-DEFINITION-ERROR : Error while trying to load definition for system hu.dwim.perec.postgresql from pathname /home/testgrid/cl-test-grid/work-dir/agent/quicklisp/dists/quicklisp/software/hu.dwim.perec-20150608-darcs/hu.dwim.perec.postgresql.asd: The symbol NON-PROPAGATING-OPERATION is not present in package ASDF/INTERFACE.
(LOAD hu.dwim.perec.oracle.test FAIL) needs newer ASDF, ASDF/FIND-SYSTEM:LOAD-SYSTEM-DEFINITION-ERROR : Error while trying to load definition for system hu.dwim.perec.oracle.test from pathname /home/testgrid/cl-test-grid/work-dir/agent/quicklisp/dists/quicklisp/software/hu.dwim.perec-20150608-darcs/hu.dwim.perec.oracle.test.asd: The symbol NON-PROPAGATING-OPERATION is not present in package ASDF/INTERFACE.
(LOAD hu.dwim.perec.oracle FAIL) needs newer ASDF, ASDF/FIND-SYSTEM:LOAD-SYSTEM-DEFINITION-ERROR : Error while trying to load definition for system hu.dwim.perec.oracle from pathname /home/testgrid/cl-test-grid/work-dir/agent/quicklisp/dists/quicklisp/software/hu.dwim.perec-20150608-darcs/hu.dwim.perec.oracle.asd: The symbol NON-PROPAGATING-OPERATION is not present in package ASDF/INTERFACE.
(LOAD hu.dwim.perec.all.test FAIL) needs newer ASDF, ASDF/FIND-SYSTEM:LOAD-SYSTEM-DEFINITION-ERROR : Error while trying to load definition for system hu.dwim.perec.all.test from pathname /home/testgrid/cl-test-grid/work-dir/agent/quicklisp/dists/quicklisp/software/hu.dwim.perec-20150608-darcs/hu.dwim.perec.all.test.asd: The symbol NON-PROPAGATING-OPERATION is not present in package ASDF/INTERFACE.
(LOAD hu.dwim.perec.all FAIL) needs newer ASDF, ASDF/FIND-SYSTEM:LOAD-SYSTEM-DEFINITION-ERROR : Error while trying to load definition for system hu.dwim.perec.all from pathname /home/testgrid/cl-test-grid/work-dir/agent/quicklisp/dists/quicklisp/software/hu.dwim.perec-20150608-darcs/hu.dwim.perec.all.asd: The symbol NON-PROPAGATING-OPERATION is not present in package ASDF/INTERFACE.
(LOAD hu.dwim.perec+swank FAIL) needs newer ASDF, ASDF/FIND-SYSTEM:LOAD-SYSTEM-DEFINITION-ERROR : Error while trying to load definition for system hu.dwim.perec+swank from pathname /home/testgrid/cl-test-grid/work-dir/agent/quicklisp/dists/quicklisp/software/hu.dwim.perec-20150608-darcs/hu.dwim.perec+swank.asd: The symbol NON-PROPAGATING-OPERATION is not present in package ASDF/INTERFACE.
(LOAD hu.dwim.perec+iolib FAIL) needs newer ASDF, ASDF/FIND-SYSTEM:LOAD-SYSTEM-DEFINITION-ERROR : Error while trying to load definition for system hu.dwim.perec+iolib from pathname /home/testgrid/cl-test-grid/work-dir/agent/quicklisp/dists/quicklisp/software/hu.dwim.perec-20150608-darcs/hu.dwim.perec+iolib.asd: The symbol NON-PROPAGATING-OPERATION is not present in package ASDF/INTERFACE.
(LOAD hu.dwim.perec+hu.dwim.quasi-quote.xml FAIL) needs newer ASDF, ASDF/FIND-SYSTEM:LOAD-SYSTEM-DEFINITION-ERROR : Error while trying to load definition for system hu.dwim.perec+hu.dwim.quasi-quote.xml from pathname /home/testgrid/cl-test-grid/work-dir/agent/quicklisp/dists/quicklisp/software/hu.dwim.perec-20150608-darcs/hu.dwim.perec+hu.dwim.quasi-quote.xml.asd: The symbol NON-PROPAGATING-OPERATION is not present in package ASDF/INTERFACE.
(LOAD hu.dwim.perec FAIL) needs newer ASDF, ASDF/FIND-SYSTEM:LOAD-SYSTEM-DEFINITION-ERROR : Error while trying to load definition for system hu.dwim.perec from pathname /home/testgrid/cl-test-grid/work-dir/agent/quicklisp/dists/quicklisp/software/hu.dwim.perec-20150608-darcs/hu.dwim.perec.asd: The symbol NON-PROPAGATING-OPERATION is not present in package ASDF/INTERFACE.
(LOAD hu.dwim.perec.test FAIL) ASDF/FIND-SYSTEM:MISSING-COMPONENT : Component "iolib/sockets" not found
(LOAD hu.dwim.perec.sqlite.test FAIL) ASDF/FIND-SYSTEM:MISSING-COMPONENT : Component "iolib/sockets" not found
(LOAD hu.dwim.perec.sqlite FAIL) COMMON-LISP:SIMPLE-ERROR : This is not implemented for your lisp, sorry. You may try to continue, but...
(LOAD hu.dwim.perec.postgresql.test FAIL) ASDF/FIND-SYSTEM:MISSING-COMPONENT : Component "iolib/sockets" not found
(LOAD hu.dwim.perec.postgresql FAIL) COMMON-LISP:SIMPLE-ERROR : This is not implemented for your lisp, sorry. You may try to continue, but...
(LOAD hu.dwim.perec.oracle.test FAIL) ASDF/FIND-SYSTEM:MISSING-COMPONENT : Component "iolib/sockets" not found
(LOAD hu.dwim.perec.oracle FAIL) COMMON-LISP:SIMPLE-ERROR : This is not implemented for your lisp, sorry. You may try to continue, but...
(LOAD hu.dwim.perec.all.test FAIL) ASDF/FIND-SYSTEM:MISSING-COMPONENT : Component "iolib/sockets" not found
(LOAD hu.dwim.perec.all FAIL) COMMON-LISP:SIMPLE-ERROR : This is not implemented for your lisp, sorry. You may try to continue, but...
(LOAD hu.dwim.perec+swank FAIL) COMMON-LISP:SIMPLE-ERROR : This is not implemented for your lisp, sorry. You may try to continue, but...
(LOAD hu.dwim.perec+iolib FAIL) ASDF/FIND-SYSTEM:MISSING-COMPONENT : Component "iolib/sockets" not found
(LOAD hu.dwim.perec+hu.dwim.quasi-quote.xml FAIL) COMMON-LISP:SIMPLE-ERROR : This is not implemented for your lisp, sorry. You may try to continue, but...
(LOAD hu.dwim.perec FAIL) COMMON-LISP:SIMPLE-ERROR : This is not implemented for your lisp, sorry. You may try to continue, but...
abcl-1.3.0-fasl42-linux-x86
(LOAD hu.dwim.perec.test FAIL) COMMON-LISP:SIMPLE-ERROR : This is not implemented for your lisp, sorry. You may try to continue, but...
(LOAD hu.dwim.perec.sqlite.test FAIL) COMMON-LISP:SIMPLE-ERROR : This is not implemented for your lisp, sorry. You may try to continue, but...
(LOAD hu.dwim.perec.sqlite FAIL) COMMON-LISP:SIMPLE-ERROR : This is not implemented for your lisp, sorry. You may try to continue, but...
(LOAD hu.dwim.perec.postgresql.test FAIL) COMMON-LISP:SIMPLE-ERROR : This is not implemented for your lisp, sorry. You may try to continue, but...
(LOAD hu.dwim.perec.postgresql FAIL) COMMON-LISP:SIMPLE-ERROR : This is not implemented for your lisp, sorry. You may try to continue, but...
(LOAD hu.dwim.perec.oracle.test FAIL) COMMON-LISP:SIMPLE-ERROR : This is not implemented for your lisp, sorry. You may try to continue, but...
(LOAD hu.dwim.perec.oracle FAIL) COMMON-LISP:SIMPLE-ERROR : This is not implemented for your lisp, sorry. You may try to continue, but...
(LOAD hu.dwim.perec.all.test FAIL) COMMON-LISP:SIMPLE-ERROR : This is not implemented for your lisp, sorry. You may try to continue, but...
(LOAD hu.dwim.perec.all FAIL) COMMON-LISP:SIMPLE-ERROR : This is not implemented for your lisp, sorry. You may try to continue, but...
(LOAD hu.dwim.perec+swank FAIL) COMMON-LISP:SIMPLE-ERROR : This is not implemented for your lisp, sorry. You may try to continue, but...
(LOAD hu.dwim.perec+iolib FAIL) COMMON-LISP:SIMPLE-ERROR : This is not implemented for your lisp, sorry. You may try to continue, but...
(LOAD hu.dwim.perec+hu.dwim.quasi-quote.xml FAIL) COMMON-LISP:SIMPLE-ERROR : This is not implemented for your lisp, sorry. You may try to continue, but...
(LOAD hu.dwim.perec FAIL) COMMON-LISP:SIMPLE-ERROR : This is not implemented for your lisp, sorry. You may try to continue, but...
(LOAD hu.dwim.perec.test FAIL) ASDF/FIND-SYSTEM:LOAD-SYSTEM-DEFINITION-ERROR : Error while trying to load definition for system ironclad from pathname /home/testgrid/cl-test-grid/work-dir/agent/quicklisp/dists/quicklisp/software/ironclad_0.33.0/ironclad.asd: don't recognize component type :TXT-FILE
(LOAD hu.dwim.perec.sqlite.test FAIL) ASDF/FIND-SYSTEM:LOAD-SYSTEM-DEFINITION-ERROR : Error while trying to load definition for system ironclad from pathname /home/testgrid/cl-test-grid/work-dir/agent/quicklisp/dists/quicklisp/software/ironclad_0.33.0/ironclad.asd: don't recognize component type :TXT-FILE
(LOAD hu.dwim.perec.sqlite FAIL) ASDF/FIND-SYSTEM:LOAD-SYSTEM-DEFINITION-ERROR : Error while trying to load definition for system ironclad from pathname /home/testgrid/cl-test-grid/work-dir/agent/quicklisp/dists/quicklisp/software/ironclad_0.33.0/ironclad.asd: don't recognize component type :TXT-FILE
(LOAD hu.dwim.perec.postgresql.test FAIL) ASDF/FIND-SYSTEM:LOAD-SYSTEM-DEFINITION-ERROR : Error while trying to load definition for system ironclad from pathname /home/testgrid/cl-test-grid/work-dir/agent/quicklisp/dists/quicklisp/software/ironclad_0.33.0/ironclad.asd: don't recognize component type :TXT-FILE
(LOAD hu.dwim.perec.postgresql FAIL) ASDF/FIND-SYSTEM:LOAD-SYSTEM-DEFINITION-ERROR : Error while trying to load definition for system ironclad from pathname /home/testgrid/cl-test-grid/work-dir/agent/quicklisp/dists/quicklisp/software/ironclad_0.33.0/ironclad.asd: don't recognize component type :TXT-FILE
(LOAD hu.dwim.perec.oracle.test FAIL) ASDF/FIND-SYSTEM:LOAD-SYSTEM-DEFINITION-ERROR : Error while trying to load definition for system ironclad from pathname /home/testgrid/cl-test-grid/work-dir/agent/quicklisp/dists/quicklisp/software/ironclad_0.33.0/ironclad.asd: don't recognize component type :TXT-FILE
(LOAD hu.dwim.perec.oracle FAIL) ASDF/FIND-SYSTEM:LOAD-SYSTEM-DEFINITION-ERROR : Error while trying to load definition for system ironclad from pathname /home/testgrid/cl-test-grid/work-dir/agent/quicklisp/dists/quicklisp/software/ironclad_0.33.0/ironclad.asd: don't recognize component type :TXT-FILE
(LOAD hu.dwim.perec.all.test FAIL) ASDF/FIND-SYSTEM:LOAD-SYSTEM-DEFINITION-ERROR : Error while trying to load definition for system ironclad from pathname /home/testgrid/cl-test-grid/work-dir/agent/quicklisp/dists/quicklisp/software/ironclad_0.33.0/ironclad.asd: don't recognize component type :TXT-FILE
(LOAD hu.dwim.perec.all FAIL) ASDF/FIND-SYSTEM:LOAD-SYSTEM-DEFINITION-ERROR : Error while trying to load definition for system ironclad from pathname /home/testgrid/cl-test-grid/work-dir/agent/quicklisp/dists/quicklisp/software/ironclad_0.33.0/ironclad.asd: don't recognize component type :TXT-FILE
(LOAD hu.dwim.perec+swank FAIL) ASDF/FIND-SYSTEM:LOAD-SYSTEM-DEFINITION-ERROR : Error while trying to load definition for system ironclad from pathname /home/testgrid/cl-test-grid/work-dir/agent/quicklisp/dists/quicklisp/software/ironclad_0.33.0/ironclad.asd: don't recognize component type :TXT-FILE
(LOAD hu.dwim.perec+iolib FAIL) ASDF/FIND-SYSTEM:LOAD-SYSTEM-DEFINITION-ERROR : Error while trying to load definition for system ironclad from pathname /home/testgrid/cl-test-grid/work-dir/agent/quicklisp/dists/quicklisp/software/ironclad_0.33.0/ironclad.asd: don't recognize component type :TXT-FILE
(LOAD hu.dwim.perec+hu.dwim.quasi-quote.xml FAIL) ASDF/FIND-SYSTEM:LOAD-SYSTEM-DEFINITION-ERROR : Error while trying to load definition for system ironclad from pathname /home/testgrid/cl-test-grid/work-dir/agent/quicklisp/dists/quicklisp/software/ironclad_0.33.0/ironclad.asd: don't recognize component type :TXT-FILE
(LOAD hu.dwim.perec FAIL) ASDF/FIND-SYSTEM:LOAD-SYSTEM-DEFINITION-ERROR : Error while trying to load definition for system ironclad from pathname /home/testgrid/cl-test-grid/work-dir/agent/quicklisp/dists/quicklisp/software/ironclad_0.33.0/ironclad.asd: don't recognize component type :TXT-FILE
abcl-1.3.1-fasl42-linux-x86
(LOAD hu.dwim.perec.test FAIL) COMMON-LISP:SIMPLE-ERROR : This is not implemented for your lisp, sorry. You may try to continue, but...
(LOAD hu.dwim.perec.sqlite.test FAIL) COMMON-LISP:SIMPLE-ERROR : This is not implemented for your lisp, sorry. You may try to continue, but...
(LOAD hu.dwim.perec.sqlite FAIL) COMMON-LISP:SIMPLE-ERROR : This is not implemented for your lisp, sorry. You may try to continue, but...
(LOAD hu.dwim.perec.postgresql.test FAIL) COMMON-LISP:SIMPLE-ERROR : This is not implemented for your lisp, sorry. You may try to continue, but...
(LOAD hu.dwim.perec.postgresql FAIL) COMMON-LISP:SIMPLE-ERROR : This is not implemented for your lisp, sorry. You may try to continue, but...
(LOAD hu.dwim.perec.oracle.test FAIL) COMMON-LISP:SIMPLE-ERROR : This is not implemented for your lisp, sorry. You may try to continue, but...
(LOAD hu.dwim.perec.oracle FAIL) COMMON-LISP:SIMPLE-ERROR : This is not implemented for your lisp, sorry. You may try to continue, but...
(LOAD hu.dwim.perec.all.test FAIL) COMMON-LISP:SIMPLE-ERROR : This is not implemented for your lisp, sorry. You may try to continue, but...
(LOAD hu.dwim.perec.all FAIL) COMMON-LISP:SIMPLE-ERROR : This is not implemented for your lisp, sorry. You may try to continue, but...
(LOAD hu.dwim.perec+swank FAIL) COMMON-LISP:SIMPLE-ERROR : This is not implemented for your lisp, sorry. You may try to continue, but...
(LOAD hu.dwim.perec+iolib FAIL) COMMON-LISP:SIMPLE-ERROR : This is not implemented for your lisp, sorry. You may try to continue, but...
(LOAD hu.dwim.perec+hu.dwim.quasi-quote.xml FAIL) COMMON-LISP:SIMPLE-ERROR : This is not implemented for your lisp, sorry. You may try to continue, but...
(LOAD hu.dwim.perec FAIL) COMMON-LISP:SIMPLE-ERROR : This is not implemented for your lisp, sorry. You may try to continue, but...
(LOAD hu.dwim.perec.test FAIL) COMMON-LISP:SIMPLE-ERROR : This is not implemented for your lisp, sorry. You may try to continue, but...
(LOAD hu.dwim.perec.sqlite.test FAIL) COMMON-LISP:SIMPLE-ERROR : This is not implemented for your lisp, sorry. You may try to continue, but...
(LOAD hu.dwim.perec.sqlite FAIL) COMMON-LISP:SIMPLE-ERROR : This is not implemented for your lisp, sorry. You may try to continue, but...
(LOAD hu.dwim.perec.postgresql.test FAIL) COMMON-LISP:SIMPLE-ERROR : This is not implemented for your lisp, sorry. You may try to continue, but...
(LOAD hu.dwim.perec.postgresql FAIL) COMMON-LISP:SIMPLE-ERROR : This is not implemented for your lisp, sorry. You may try to continue, but...
(LOAD hu.dwim.perec.oracle.test FAIL) COMMON-LISP:SIMPLE-ERROR : This is not implemented for your lisp, sorry. You may try to continue, but...
(LOAD hu.dwim.perec.oracle FAIL) COMMON-LISP:SIMPLE-ERROR : This is not implemented for your lisp, sorry. You may try to continue, but...
(LOAD hu.dwim.perec.all.test FAIL) COMMON-LISP:SIMPLE-ERROR : This is not implemented for your lisp, sorry. You may try to continue, but...
(LOAD hu.dwim.perec.all FAIL) COMMON-LISP:SIMPLE-ERROR : This is not implemented for your lisp, sorry. You may try to continue, but...
(LOAD hu.dwim.perec+swank FAIL) COMMON-LISP:SIMPLE-ERROR : This is not implemented for your lisp, sorry. You may try to continue, but...
(LOAD hu.dwim.perec+iolib FAIL) COMMON-LISP:SIMPLE-ERROR : This is not implemented for your lisp, sorry. You may try to continue, but...
(LOAD hu.dwim.perec+hu.dwim.quasi-quote.xml FAIL) COMMON-LISP:SIMPLE-ERROR : This is not implemented for your lisp, sorry. You may try to continue, but...
(LOAD hu.dwim.perec FAIL) COMMON-LISP:SIMPLE-ERROR : This is not implemented for your lisp, sorry. You may try to continue, but...
abcl-1.3.2-fasl42-linux-x86
(LOAD hu.dwim.perec.test FAIL) COMMON-LISP:SIMPLE-ERROR : This is not implemented for your lisp, sorry. You may try to continue, but...
(LOAD hu.dwim.perec.sqlite.test FAIL) COMMON-LISP:SIMPLE-ERROR : This is not implemented for your lisp, sorry. You may try to continue, but...
(LOAD hu.dwim.perec.sqlite FAIL) COMMON-LISP:SIMPLE-ERROR : This is not implemented for your lisp, sorry. You may try to continue, but...
(LOAD hu.dwim.perec.postgresql.test FAIL) COMMON-LISP:SIMPLE-ERROR : This is not implemented for your lisp, sorry. You may try to continue, but...
(LOAD hu.dwim.perec.postgresql FAIL) COMMON-LISP:SIMPLE-ERROR : This is not implemented for your lisp, sorry. You may try to continue, but...
(LOAD hu.dwim.perec.oracle.test FAIL) COMMON-LISP:SIMPLE-ERROR : This is not implemented for your lisp, sorry. You may try to continue, but...
(LOAD hu.dwim.perec.oracle FAIL) COMMON-LISP:SIMPLE-ERROR : This is not implemented for your lisp, sorry. You may try to continue, but...
(LOAD hu.dwim.perec.all.test FAIL) COMMON-LISP:SIMPLE-ERROR : This is not implemented for your lisp, sorry. You may try to continue, but...
(LOAD hu.dwim.perec.all FAIL) COMMON-LISP:SIMPLE-ERROR : This is not implemented for your lisp, sorry. You may try to continue, but...
(LOAD hu.dwim.perec+swank FAIL) COMMON-LISP:SIMPLE-ERROR : This is not implemented for your lisp, sorry. You may try to continue, but...
(LOAD hu.dwim.perec+iolib FAIL) COMMON-LISP:SIMPLE-ERROR : This is not implemented for your lisp, sorry. You may try to continue, but...
(LOAD hu.dwim.perec+hu.dwim.quasi-quote.xml FAIL) COMMON-LISP:SIMPLE-ERROR : This is not implemented for your lisp, sorry. You may try to continue, but...
(LOAD hu.dwim.perec FAIL) COMMON-LISP:SIMPLE-ERROR : This is not implemented for your lisp, sorry. You may try to continue, but...
(LOAD hu.dwim.perec.test FAIL) COMMON-LISP:SIMPLE-ERROR : This is not implemented for your lisp, sorry. You may try to continue, but...
(LOAD hu.dwim.perec.sqlite.test FAIL) COMMON-LISP:SIMPLE-ERROR : This is not implemented for your lisp, sorry. You may try to continue, but...
(LOAD hu.dwim.perec.sqlite FAIL) COMMON-LISP:SIMPLE-ERROR : This is not implemented for your lisp, sorry. You may try to continue, but...
(LOAD hu.dwim.perec.postgresql.test FAIL) COMMON-LISP:SIMPLE-ERROR : This is not implemented for your lisp, sorry. You may try to continue, but...
(LOAD hu.dwim.perec.postgresql FAIL) COMMON-LISP:SIMPLE-ERROR : This is not implemented for your lisp, sorry. You may try to continue, but...
(LOAD hu.dwim.perec.oracle.test FAIL) COMMON-LISP:SIMPLE-ERROR : This is not implemented for your lisp, sorry. You may try to continue, but...
(LOAD hu.dwim.perec.oracle FAIL) COMMON-LISP:SIMPLE-ERROR : This is not implemented for your lisp, sorry. You may try to continue, but...
(LOAD hu.dwim.perec.all.test FAIL) COMMON-LISP:SIMPLE-ERROR : This is not implemented for your lisp, sorry. You may try to continue, but...
(LOAD hu.dwim.perec.all FAIL) COMMON-LISP:SIMPLE-ERROR : This is not implemented for your lisp, sorry. You may try to continue, but...
(LOAD hu.dwim.perec+swank FAIL) COMMON-LISP:SIMPLE-ERROR : This is not implemented for your lisp, sorry. You may try to continue, but...
(LOAD hu.dwim.perec+iolib FAIL) COMMON-LISP:SIMPLE-ERROR : This is not implemented for your lisp, sorry. You may try to continue, but...
(LOAD hu.dwim.perec+hu.dwim.quasi-quote.xml FAIL) COMMON-LISP:SIMPLE-ERROR : This is not implemented for your lisp, sorry. You may try to continue, but...
(LOAD hu.dwim.perec FAIL) COMMON-LISP:SIMPLE-ERROR : This is not implemented for your lisp, sorry. You may try to continue, but...
ccl-1.10-r16196-f96-linux-x64
(LOAD hu.dwim.perec.test FAIL) COMMON-LISP:TYPE-ERROR : The value NIL is not of the expected type PACKAGE.
(LOAD hu.dwim.perec.sqlite.test FAIL) COMMON-LISP:TYPE-ERROR : The value NIL is not of the expected type PACKAGE.
(LOAD hu.dwim.perec.sqlite FAIL) COMMON-LISP:TYPE-ERROR : The value NIL is not of the expected type PACKAGE.
(LOAD hu.dwim.perec.postgresql.test FAIL) COMMON-LISP:TYPE-ERROR : The value NIL is not of the expected type PACKAGE.
(LOAD hu.dwim.perec.postgresql FAIL) COMMON-LISP:TYPE-ERROR : The value NIL is not of the expected type PACKAGE.
(LOAD hu.dwim.perec.oracle.test FAIL) COMMON-LISP:TYPE-ERROR : The value NIL is not of the expected type PACKAGE.
(LOAD hu.dwim.perec.oracle FAIL) COMMON-LISP:TYPE-ERROR : The value NIL is not of the expected type PACKAGE.
(LOAD hu.dwim.perec.all.test FAIL) COMMON-LISP:TYPE-ERROR : The value NIL is not of the expected type PACKAGE.
(LOAD hu.dwim.perec.all FAIL) COMMON-LISP:TYPE-ERROR : The value NIL is not of the expected type PACKAGE.
(LOAD hu.dwim.perec+swank FAIL) COMMON-LISP:TYPE-ERROR : The value NIL is not of the expected type PACKAGE.
(LOAD hu.dwim.perec+iolib FAIL) COMMON-LISP:TYPE-ERROR : The value NIL is not of the expected type PACKAGE.
(LOAD hu.dwim.perec+hu.dwim.quasi-quote.xml FAIL) COMMON-LISP:TYPE-ERROR : The value NIL is not of the expected type PACKAGE.
(LOAD hu.dwim.perec FAIL) COMMON-LISP:TYPE-ERROR : The value NIL is not of the expected type PACKAGE.
(LOAD hu.dwim.perec.test FAIL) COMMON-LISP:TYPE-ERROR : The value NIL is not of the expected type PACKAGE.
(LOAD hu.dwim.perec.sqlite.test FAIL) COMMON-LISP:TYPE-ERROR : The value NIL is not of the expected type PACKAGE.
(LOAD hu.dwim.perec.sqlite FAIL) COMMON-LISP:TYPE-ERROR : The value NIL is not of the expected type PACKAGE.
(LOAD hu.dwim.perec.postgresql.test FAIL) COMMON-LISP:TYPE-ERROR : The value NIL is not of the expected type PACKAGE.
(LOAD hu.dwim.perec.postgresql FAIL) COMMON-LISP:TYPE-ERROR : The value NIL is not of the expected type PACKAGE.
(LOAD hu.dwim.perec.oracle.test FAIL) COMMON-LISP:TYPE-ERROR : The value NIL is not of the expected type PACKAGE.
(LOAD hu.dwim.perec.oracle FAIL) COMMON-LISP:TYPE-ERROR : The value NIL is not of the expected type PACKAGE.
(LOAD hu.dwim.perec.all.test FAIL) CCL:NO-APPLICABLE-METHOD-EXISTS : There is no applicable method for the generic function: #<STANDARD-GENERIC-FUNCTION CCL:SLOT-VALUE-USING-CLASS #x30200002B3EF> when called with arguments: (#<STANDARD-CLASS CL-L10N.LDML:LANGUAGE> #<LANGUAGE language #x3020020C5FFD> 0)
(LOAD hu.dwim.perec.all FAIL) COMMON-LISP:TYPE-ERROR : The value NIL is not of the expected type PACKAGE.
(LOAD hu.dwim.perec+swank FAIL) COMMON-LISP:TYPE-ERROR : The value NIL is not of the expected type PACKAGE.
(LOAD hu.dwim.perec+iolib FAIL) COMMON-LISP:TYPE-ERROR : The value NIL is not of the expected type PACKAGE.
(LOAD hu.dwim.perec+hu.dwim.quasi-quote.xml FAIL) COMMON-LISP:TYPE-ERROR : The value NIL is not of the expected type PACKAGE.
(LOAD hu.dwim.perec FAIL) COMMON-LISP:TYPE-ERROR : The value NIL is not of the expected type PACKAGE.
ccl-1.10-r16196-f96-linux-x86
(LOAD hu.dwim.perec.test FAIL) COMMON-LISP:TYPE-ERROR : The value NIL is not of the expected type PACKAGE.
(LOAD hu.dwim.perec.sqlite.test FAIL) COMMON-LISP:TYPE-ERROR : The value NIL is not of the expected type PACKAGE.
(LOAD hu.dwim.perec.sqlite FAIL) COMMON-LISP:TYPE-ERROR : The value NIL is not of the expected type PACKAGE.
(LOAD hu.dwim.perec.postgresql.test FAIL) COMMON-LISP:TYPE-ERROR : The value NIL is not of the expected type PACKAGE.
(LOAD hu.dwim.perec.postgresql FAIL) COMMON-LISP:TYPE-ERROR : The value NIL is not of the expected type PACKAGE.
(LOAD hu.dwim.perec.oracle.test FAIL) COMMON-LISP:TYPE-ERROR : The value NIL is not of the expected type PACKAGE.
(LOAD hu.dwim.perec.oracle FAIL) COMMON-LISP:TYPE-ERROR : The value NIL is not of the expected type PACKAGE.
(LOAD hu.dwim.perec.all.test FAIL) COMMON-LISP:TYPE-ERROR : The value NIL is not of the expected type PACKAGE.
(LOAD hu.dwim.perec.all FAIL) COMMON-LISP:TYPE-ERROR : The value NIL is not of the expected type PACKAGE.
(LOAD hu.dwim.perec+swank FAIL) COMMON-LISP:TYPE-ERROR : The value NIL is not of the expected type PACKAGE.
(LOAD hu.dwim.perec+iolib FAIL) COMMON-LISP:TYPE-ERROR : The value NIL is not of the expected type PACKAGE.
(LOAD hu.dwim.perec+hu.dwim.quasi-quote.xml FAIL) COMMON-LISP:TYPE-ERROR : The value NIL is not of the expected type PACKAGE.
(LOAD hu.dwim.perec FAIL) COMMON-LISP:TYPE-ERROR : The value NIL is not of the expected type PACKAGE.
(LOAD hu.dwim.perec.test FAIL) COMMON-LISP:TYPE-ERROR : The value NIL is not of the expected type PACKAGE.
(LOAD hu.dwim.perec.sqlite.test FAIL) COMMON-LISP:TYPE-ERROR : The value NIL is not of the expected type PACKAGE.
(LOAD hu.dwim.perec.sqlite FAIL) COMMON-LISP:TYPE-ERROR : The value NIL is not of the expected type PACKAGE.
(LOAD hu.dwim.perec.postgresql.test FAIL) COMMON-LISP:TYPE-ERROR : The value NIL is not of the expected type PACKAGE.
(LOAD hu.dwim.perec.postgresql FAIL) COMMON-LISP:TYPE-ERROR : The value NIL is not of the expected type PACKAGE.
(LOAD hu.dwim.perec.oracle.test FAIL) COMMON-LISP:TYPE-ERROR : The value NIL is not of the expected type PACKAGE.
(LOAD hu.dwim.perec.oracle FAIL) COMMON-LISP:TYPE-ERROR : The value NIL is not of the expected type PACKAGE.
(LOAD hu.dwim.perec.all.test FAIL) COMMON-LISP:TYPE-ERROR : The value NIL is not of the expected type PACKAGE.
(LOAD hu.dwim.perec.all FAIL) COMMON-LISP:TYPE-ERROR : The value NIL is not of the expected type PACKAGE.
(LOAD hu.dwim.perec+swank FAIL) COMMON-LISP:TYPE-ERROR : The value NIL is not of the expected type PACKAGE.
(LOAD hu.dwim.perec+iolib FAIL) COMMON-LISP:TYPE-ERROR : The value NIL is not of the expected type PACKAGE.
(LOAD hu.dwim.perec+hu.dwim.quasi-quote.xml FAIL) COMMON-LISP:TYPE-ERROR : The value NIL is not of the expected type PACKAGE.
(LOAD hu.dwim.perec FAIL) COMMON-LISP:TYPE-ERROR : The value NIL is not of the expected type PACKAGE.
ccl-1.8-r15286m-f95-linux-x86
(LOAD hu.dwim.perec.test FAIL) ASDF:LOAD-SYSTEM-DEFINITION-ERROR : Error while trying to load definition for system hu.dwim.perec.test from pathname /home/testgrid/cl-test-grid/work-dir/agent/quicklisp/dists/quicklisp/software/hu.dwim.perec-20150608-darcs/hu\.dwim\.perec\.test.asd: Cannot IMPORT "NON-PROPAGATING-OPERATION" from package "ASDF"
(LOAD hu.dwim.perec.sqlite.test FAIL) ASDF:LOAD-SYSTEM-DEFINITION-ERROR : Error while trying to load definition for system hu.dwim.perec.sqlite.test from pathname /home/testgrid/cl-test-grid/work-dir/agent/quicklisp/dists/quicklisp/software/hu.dwim.perec-20150608-darcs/hu\.dwim\.perec\.sqlite\.test.asd: Cannot IMPORT "NON-PROPAGATING-OPERATION" from package "ASDF"
(LOAD hu.dwim.perec.sqlite FAIL) ASDF:LOAD-SYSTEM-DEFINITION-ERROR : Error while trying to load definition for system hu.dwim.perec.sqlite from pathname /home/testgrid/cl-test-grid/work-dir/agent/quicklisp/dists/quicklisp/software/hu.dwim.perec-20150608-darcs/hu\.dwim\.perec\.sqlite.asd: Cannot IMPORT "NON-PROPAGATING-OPERATION" from package "ASDF"
(LOAD hu.dwim.perec.postgresql.test FAIL) ASDF:LOAD-SYSTEM-DEFINITION-ERROR : Error while trying to load definition for system hu.dwim.perec.postgresql.test from pathname /home/testgrid/cl-test-grid/work-dir/agent/quicklisp/dists/quicklisp/software/hu.dwim.perec-20150608-darcs/hu\.dwim\.perec\.postgresql\.test.asd: Cannot IMPORT "NON-PROPAGATING-OPERATION" from package "ASDF"
(LOAD hu.dwim.perec.postgresql FAIL) ASDF:LOAD-SYSTEM-DEFINITION-ERROR : Error while trying to load definition for system hu.dwim.perec.postgresql from pathname /home/testgrid/cl-test-grid/work-dir/agent/quicklisp/dists/quicklisp/software/hu.dwim.perec-20150608-darcs/hu\.dwim\.perec\.postgresql.asd: Cannot IMPORT "NON-PROPAGATING-OPERATION" from package "ASDF"
(LOAD hu.dwim.perec.oracle.test FAIL) ASDF:LOAD-SYSTEM-DEFINITION-ERROR : Error while trying to load definition for system hu.dwim.perec.oracle.test from pathname /home/testgrid/cl-test-grid/work-dir/agent/quicklisp/dists/quicklisp/software/hu.dwim.perec-20150608-darcs/hu\.dwim\.perec\.oracle\.test.asd: Cannot IMPORT "NON-PROPAGATING-OPERATION" from package "ASDF"
(LOAD hu.dwim.perec.oracle FAIL) ASDF:LOAD-SYSTEM-DEFINITION-ERROR : Error while trying to load definition for system hu.dwim.perec.oracle from pathname /home/testgrid/cl-test-grid/work-dir/agent/quicklisp/dists/quicklisp/software/hu.dwim.perec-20150608-darcs/hu\.dwim\.perec\.oracle.asd: Cannot IMPORT "NON-PROPAGATING-OPERATION" from package "ASDF"
(LOAD hu.dwim.perec.all.test FAIL) ASDF:LOAD-SYSTEM-DEFINITION-ERROR : Error while trying to load definition for system hu.dwim.perec.all.test from pathname /home/testgrid/cl-test-grid/work-dir/agent/quicklisp/dists/quicklisp/software/hu.dwim.perec-20150608-darcs/hu\.dwim\.perec\.all\.test.asd: Cannot IMPORT "NON-PROPAGATING-OPERATION" from package "ASDF"
(LOAD hu.dwim.perec.all FAIL) ASDF:LOAD-SYSTEM-DEFINITION-ERROR : Error while trying to load definition for system hu.dwim.perec.all from pathname /home/testgrid/cl-test-grid/work-dir/agent/quicklisp/dists/quicklisp/software/hu.dwim.perec-20150608-darcs/hu\.dwim\.perec\.all.asd: Cannot IMPORT "NON-PROPAGATING-OPERATION" from package "ASDF"
(LOAD hu.dwim.perec+swank FAIL) ASDF:LOAD-SYSTEM-DEFINITION-ERROR : Error while trying to load definition for system hu.dwim.perec+swank from pathname /home/testgrid/cl-test-grid/work-dir/agent/quicklisp/dists/quicklisp/software/hu.dwim.perec-20150608-darcs/hu\.dwim\.perec+swank.asd: Cannot IMPORT "NON-PROPAGATING-OPERATION" from package "ASDF"
(LOAD hu.dwim.perec+iolib FAIL) ASDF:LOAD-SYSTEM-DEFINITION-ERROR : Error while trying to load definition for system hu.dwim.perec+iolib from pathname /home/testgrid/cl-test-grid/work-dir/agent/quicklisp/dists/quicklisp/software/hu.dwim.perec-20150608-darcs/hu\.dwim\.perec+iolib.asd: Cannot IMPORT "NON-PROPAGATING-OPERATION" from package "ASDF"
(LOAD hu.dwim.perec+hu.dwim.quasi-quote.xml FAIL) ASDF:LOAD-SYSTEM-DEFINITION-ERROR : Error while trying to load definition for system hu.dwim.perec+hu.dwim.quasi-quote.xml from pathname /home/testgrid/cl-test-grid/work-dir/agent/quicklisp/dists/quicklisp/software/hu.dwim.perec-20150608-darcs/hu\.dwim\.perec+hu\.dwim\.quasi-quote\.xml.asd: Cannot IMPORT "NON-PROPAGATING-OPERATION" from package "ASDF"
(LOAD hu.dwim.perec FAIL) ASDF:LOAD-SYSTEM-DEFINITION-ERROR : Error while trying to load definition for system hu.dwim.perec from pathname /home/testgrid/cl-test-grid/work-dir/agent/quicklisp/dists/quicklisp/software/hu.dwim.perec-20150608-darcs/hu\.dwim\.perec.asd: Cannot IMPORT "NON-PROPAGATING-OPERATION" from package "ASDF"
(LOAD hu.dwim.perec.test FAIL) ASDF:MISSING-COMPONENT : Component "iolib/syscalls" not found
(LOAD hu.dwim.perec.sqlite.test FAIL) ASDF:MISSING-COMPONENT : Component "iolib/syscalls" not found
(LOAD hu.dwim.perec.sqlite FAIL) COMMON-LISP:SIMPLE-ERROR : Unknown character name - "❲" .
(LOAD hu.dwim.perec.postgresql.test FAIL) ASDF:MISSING-COMPONENT : Component "iolib/syscalls" not found
(LOAD hu.dwim.perec.postgresql FAIL) COMMON-LISP:SIMPLE-ERROR : Unknown character name - "❲" .
(LOAD hu.dwim.perec.oracle.test FAIL) ASDF:MISSING-COMPONENT : Component "iolib/syscalls" not found
(LOAD hu.dwim.perec.oracle FAIL) COMMON-LISP:SIMPLE-ERROR : Unknown character name - "❲" .
(LOAD hu.dwim.perec.all.test FAIL) ASDF:MISSING-COMPONENT : Component "iolib/syscalls" not found
(LOAD hu.dwim.perec.all FAIL) COMMON-LISP:SIMPLE-ERROR : Unknown character name - "❲" .
(LOAD hu.dwim.perec+swank FAIL) COMMON-LISP:SIMPLE-ERROR : Unknown character name - "❲" .
(LOAD hu.dwim.perec+iolib FAIL) ASDF:LOAD-SYSTEM-DEFINITION-ERROR : Error while trying to load definition for system swap-bytes from pathname /home/testgrid/cl-test-grid/work-dir/agent/quicklisp/dists/quicklisp/software/swap-bytes-20140713-git/swap-bytes.asd: You need ASDF >= 2.32 to load this system correctly.
(LOAD hu.dwim.perec+hu.dwim.quasi-quote.xml FAIL) COMMON-LISP:SIMPLE-ERROR : Unknown character name - "❲" .
(LOAD hu.dwim.perec FAIL) COMMON-LISP:SIMPLE-ERROR : Unknown character name - "❲" .
ccl-1.9-r15756-f96-linux-x86
(LOAD hu.dwim.perec.test FAIL) needs newer ASDF, ASDF/FIND-SYSTEM:LOAD-SYSTEM-DEFINITION-ERROR : Error while trying to load definition for system hu.dwim.perec.test from pathname /home/testgrid/cl-test-grid/work-dir/agent/quicklisp/dists/quicklisp/software/hu.dwim.perec-20150608-darcs/hu\.dwim\.perec\.test.asd: Cannot IMPORT "NON-PROPAGATING-OPERATION" from package "ASDF"
(LOAD hu.dwim.perec.sqlite.test FAIL) needs newer ASDF, ASDF/FIND-SYSTEM:LOAD-SYSTEM-DEFINITION-ERROR : Error while trying to load definition for system hu.dwim.perec.sqlite.test from pathname /home/testgrid/cl-test-grid/work-dir/agent/quicklisp/dists/quicklisp/software/hu.dwim.perec-20150608-darcs/hu\.dwim\.perec\.sqlite\.test.asd: Cannot IMPORT "NON-PROPAGATING-OPERATION" from package "ASDF"
(LOAD hu.dwim.perec.sqlite FAIL) needs newer ASDF, ASDF/FIND-SYSTEM:LOAD-SYSTEM-DEFINITION-ERROR : Error while trying to load definition for system hu.dwim.perec.sqlite from pathname /home/testgrid/cl-test-grid/work-dir/agent/quicklisp/dists/quicklisp/software/hu.dwim.perec-20150608-darcs/hu\.dwim\.perec\.sqlite.asd: Cannot IMPORT "NON-PROPAGATING-OPERATION" from package "ASDF"
(LOAD hu.dwim.perec.postgresql.test FAIL) needs newer ASDF, ASDF/FIND-SYSTEM:LOAD-SYSTEM-DEFINITION-ERROR : Error while trying to load definition for system hu.dwim.perec.postgresql.test from pathname /home/testgrid/cl-test-grid/work-dir/agent/quicklisp/dists/quicklisp/software/hu.dwim.perec-20150608-darcs/hu\.dwim\.perec\.postgresql\.test.asd: Cannot IMPORT "NON-PROPAGATING-OPERATION" from package "ASDF"
(LOAD hu.dwim.perec.postgresql FAIL) needs newer ASDF, ASDF/FIND-SYSTEM:LOAD-SYSTEM-DEFINITION-ERROR : Error while trying to load definition for system hu.dwim.perec.postgresql from pathname /home/testgrid/cl-test-grid/work-dir/agent/quicklisp/dists/quicklisp/software/hu.dwim.perec-20150608-darcs/hu\.dwim\.perec\.postgresql.asd: Cannot IMPORT "NON-PROPAGATING-OPERATION" from package "ASDF"
(LOAD hu.dwim.perec.oracle.test FAIL) needs newer ASDF, ASDF/FIND-SYSTEM:LOAD-SYSTEM-DEFINITION-ERROR : Error while trying to load definition for system hu.dwim.perec.oracle.test from pathname /home/testgrid/cl-test-grid/work-dir/agent/quicklisp/dists/quicklisp/software/hu.dwim.perec-20150608-darcs/hu\.dwim\.perec\.oracle\.test.asd: Cannot IMPORT "NON-PROPAGATING-OPERATION" from package "ASDF"
(LOAD hu.dwim.perec.oracle FAIL) needs newer ASDF, ASDF/FIND-SYSTEM:LOAD-SYSTEM-DEFINITION-ERROR : Error while trying to load definition for system hu.dwim.perec.oracle from pathname /home/testgrid/cl-test-grid/work-dir/agent/quicklisp/dists/quicklisp/software/hu.dwim.perec-20150608-darcs/hu\.dwim\.perec\.oracle.asd: Cannot IMPORT "NON-PROPAGATING-OPERATION" from package "ASDF"
(LOAD hu.dwim.perec.all.test FAIL) needs newer ASDF, ASDF/FIND-SYSTEM:LOAD-SYSTEM-DEFINITION-ERROR : Error while trying to load definition for system hu.dwim.perec.all.test from pathname /home/testgrid/cl-test-grid/work-dir/agent/quicklisp/dists/quicklisp/software/hu.dwim.perec-20150608-darcs/hu\.dwim\.perec\.all\.test.asd: Cannot IMPORT "NON-PROPAGATING-OPERATION" from package "ASDF"
(LOAD hu.dwim.perec.all FAIL) needs newer ASDF, ASDF/FIND-SYSTEM:LOAD-SYSTEM-DEFINITION-ERROR : Error while trying to load definition for system hu.dwim.perec.all from pathname /home/testgrid/cl-test-grid/work-dir/agent/quicklisp/dists/quicklisp/software/hu.dwim.perec-20150608-darcs/hu\.dwim\.perec\.all.asd: Cannot IMPORT "NON-PROPAGATING-OPERATION" from package "ASDF"
(LOAD hu.dwim.perec+swank FAIL) needs newer ASDF, ASDF/FIND-SYSTEM:LOAD-SYSTEM-DEFINITION-ERROR : Error while trying to load definition for system hu.dwim.perec+swank from pathname /home/testgrid/cl-test-grid/work-dir/agent/quicklisp/dists/quicklisp/software/hu.dwim.perec-20150608-darcs/hu\.dwim\.perec+swank.asd: Cannot IMPORT "NON-PROPAGATING-OPERATION" from package "ASDF"
(LOAD hu.dwim.perec+iolib FAIL) needs newer ASDF, ASDF/FIND-SYSTEM:LOAD-SYSTEM-DEFINITION-ERROR : Error while trying to load definition for system hu.dwim.perec+iolib from pathname /home/testgrid/cl-test-grid/work-dir/agent/quicklisp/dists/quicklisp/software/hu.dwim.perec-20150608-darcs/hu\.dwim\.perec+iolib.asd: Cannot IMPORT "NON-PROPAGATING-OPERATION" from package "ASDF"
(LOAD hu.dwim.perec+hu.dwim.quasi-quote.xml FAIL) needs newer ASDF, ASDF/FIND-SYSTEM:LOAD-SYSTEM-DEFINITION-ERROR : Error while trying to load definition for system hu.dwim.perec+hu.dwim.quasi-quote.xml from pathname /home/testgrid/cl-test-grid/work-dir/agent/quicklisp/dists/quicklisp/software/hu.dwim.perec-20150608-darcs/hu\.dwim\.perec+hu\.dwim\.quasi-quote\.xml.asd: Cannot IMPORT "NON-PROPAGATING-OPERATION" from package "ASDF"
(LOAD hu.dwim.perec FAIL) needs newer ASDF, ASDF/FIND-SYSTEM:LOAD-SYSTEM-DEFINITION-ERROR : Error while trying to load definition for system hu.dwim.perec from pathname /home/testgrid/cl-test-grid/work-dir/agent/quicklisp/dists/quicklisp/software/hu.dwim.perec-20150608-darcs/hu\.dwim\.perec.asd: Cannot IMPORT "NON-PROPAGATING-OPERATION" from package "ASDF"
(LOAD hu.dwim.perec.test FAIL) ASDF/FIND-SYSTEM:MISSING-COMPONENT : Component "iolib/sockets" not found
(LOAD hu.dwim.perec.sqlite.test FAIL) ASDF/FIND-SYSTEM:MISSING-COMPONENT : Component "iolib/sockets" not found
(LOAD hu.dwim.perec.sqlite FAIL) COMMON-LISP:TYPE-ERROR : The value NIL is not of the expected type PACKAGE.
(LOAD hu.dwim.perec.postgresql.test FAIL) ASDF/FIND-SYSTEM:MISSING-COMPONENT : Component "iolib/sockets" not found
(LOAD hu.dwim.perec.postgresql FAIL) COMMON-LISP:TYPE-ERROR : The value NIL is not of the expected type PACKAGE.
(LOAD hu.dwim.perec.oracle.test FAIL) ASDF/FIND-SYSTEM:MISSING-COMPONENT : Component "iolib/sockets" not found
(LOAD hu.dwim.perec.oracle FAIL) COMMON-LISP:TYPE-ERROR : The value NIL is not of the expected type PACKAGE.
(LOAD hu.dwim.perec.all.test FAIL) ASDF/FIND-SYSTEM:MISSING-COMPONENT : Component "iolib/sockets" not found
(LOAD hu.dwim.perec.all FAIL) COMMON-LISP:TYPE-ERROR : The value NIL is not of the expected type PACKAGE.
(LOAD hu.dwim.perec+swank FAIL) COMMON-LISP:TYPE-ERROR : The value NIL is not of the expected type PACKAGE.
(LOAD hu.dwim.perec+iolib FAIL) ASDF/FIND-SYSTEM:MISSING-COMPONENT : Component "iolib/sockets" not found
(LOAD hu.dwim.perec+hu.dwim.quasi-quote.xml FAIL) COMMON-LISP:TYPE-ERROR : The value NIL is not of the expected type PACKAGE.
(LOAD hu.dwim.perec FAIL) COMMON-LISP:TYPE-ERROR : The value NIL is not of the expected type PACKAGE.
clisp-2.49-unix-x64
(LOAD hu.dwim.perec.test FAIL) ASDF:LOAD-SYSTEM-DEFINITION-ERROR : Error while trying to load definition for system hu.dwim.perec.test from pathname /home/hijarian/systems/cl-test-grid/work-dir/agent/quicklisp/dists/quicklisp/software/hu.dwim.perec-20150608-darcs/hu.dwim.perec.test.asd: DEFPACKAGE HU.DWIM.ASDF: Не существует символа ASDF::NON-PROPAGATING-OPERATION .
(LOAD hu.dwim.perec.sqlite.test FAIL) ASDF:LOAD-SYSTEM-DEFINITION-ERROR : Error while trying to load definition for system hu.dwim.perec.sqlite.test from pathname /home/hijarian/systems/cl-test-grid/work-dir/agent/quicklisp/dists/quicklisp/software/hu.dwim.perec-20150608-darcs/hu.dwim.perec.sqlite.test.asd: DEFPACKAGE HU.DWIM.ASDF: Не существует символа ASDF::NON-PROPAGATING-OPERATION .
(LOAD hu.dwim.perec.sqlite FAIL) ASDF:LOAD-SYSTEM-DEFINITION-ERROR : Error while trying to load definition for system hu.dwim.perec.sqlite from pathname /home/hijarian/systems/cl-test-grid/work-dir/agent/quicklisp/dists/quicklisp/software/hu.dwim.perec-20150608-darcs/hu.dwim.perec.sqlite.asd: DEFPACKAGE HU.DWIM.ASDF: Не существует символа ASDF::NON-PROPAGATING-OPERATION .
(LOAD hu.dwim.perec.postgresql.test FAIL) ASDF:LOAD-SYSTEM-DEFINITION-ERROR : Error while trying to load definition for system hu.dwim.perec.postgresql.test from pathname /home/hijarian/systems/cl-test-grid/work-dir/agent/quicklisp/dists/quicklisp/software/hu.dwim.perec-20150608-darcs/hu.dwim.perec.postgresql.test.asd: DEFPACKAGE HU.DWIM.ASDF: Не существует символа ASDF::NON-PROPAGATING-OPERATION .
(LOAD hu.dwim.perec.postgresql FAIL) ASDF:LOAD-SYSTEM-DEFINITION-ERROR : Error while trying to load definition for system hu.dwim.perec.postgresql from pathname /home/hijarian/systems/cl-test-grid/work-dir/agent/quicklisp/dists/quicklisp/software/hu.dwim.perec-20150608-darcs/hu.dwim.perec.postgresql.asd: DEFPACKAGE HU.DWIM.ASDF: Не существует символа ASDF::NON-PROPAGATING-OPERATION .
(LOAD hu.dwim.perec.oracle.test FAIL) ASDF:LOAD-SYSTEM-DEFINITION-ERROR : Error while trying to load definition for system hu.dwim.perec.oracle.test from pathname /home/hijarian/systems/cl-test-grid/work-dir/agent/quicklisp/dists/quicklisp/software/hu.dwim.perec-20150608-darcs/hu.dwim.perec.oracle.test.asd: DEFPACKAGE HU.DWIM.ASDF: Не существует символа ASDF::NON-PROPAGATING-OPERATION .
(LOAD hu.dwim.perec.oracle FAIL) ASDF:LOAD-SYSTEM-DEFINITION-ERROR : Error while trying to load definition for system hu.dwim.perec.oracle from pathname /home/hijarian/systems/cl-test-grid/work-dir/agent/quicklisp/dists/quicklisp/software/hu.dwim.perec-20150608-darcs/hu.dwim.perec.oracle.asd: DEFPACKAGE HU.DWIM.ASDF: Не существует символа ASDF::NON-PROPAGATING-OPERATION .
(LOAD hu.dwim.perec.all.test FAIL) ASDF:LOAD-SYSTEM-DEFINITION-ERROR : Error while trying to load definition for system hu.dwim.perec.all.test from pathname /home/hijarian/systems/cl-test-grid/work-dir/agent/quicklisp/dists/quicklisp/software/hu.dwim.perec-20150608-darcs/hu.dwim.perec.all.test.asd: DEFPACKAGE HU.DWIM.ASDF: Не существует символа ASDF::NON-PROPAGATING-OPERATION .
(LOAD hu.dwim.perec.all FAIL) ASDF:LOAD-SYSTEM-DEFINITION-ERROR : Error while trying to load definition for system hu.dwim.perec.all from pathname /home/hijarian/systems/cl-test-grid/work-dir/agent/quicklisp/dists/quicklisp/software/hu.dwim.perec-20150608-darcs/hu.dwim.perec.all.asd: DEFPACKAGE HU.DWIM.ASDF: Не существует символа ASDF::NON-PROPAGATING-OPERATION .
(LOAD hu.dwim.perec+swank FAIL) ASDF:LOAD-SYSTEM-DEFINITION-ERROR : Error while trying to load definition for system hu.dwim.perec+swank from pathname /home/hijarian/systems/cl-test-grid/work-dir/agent/quicklisp/dists/quicklisp/software/hu.dwim.perec-20150608-darcs/hu.dwim.perec+swank.asd: DEFPACKAGE HU.DWIM.ASDF: Не существует символа ASDF::NON-PROPAGATING-OPERATION .
(LOAD hu.dwim.perec+iolib FAIL) ASDF:LOAD-SYSTEM-DEFINITION-ERROR : Error while trying to load definition for system hu.dwim.perec+iolib from pathname /home/hijarian/systems/cl-test-grid/work-dir/agent/quicklisp/dists/quicklisp/software/hu.dwim.perec-20150608-darcs/hu.dwim.perec+iolib.asd: DEFPACKAGE HU.DWIM.ASDF: Не существует символа ASDF::NON-PROPAGATING-OPERATION .
(LOAD hu.dwim.perec+hu.dwim.quasi-quote.xml FAIL) ASDF:LOAD-SYSTEM-DEFINITION-ERROR : Error while trying to load definition for system hu.dwim.perec+hu.dwim.quasi-quote.xml from pathname /home/hijarian/systems/cl-test-grid/work-dir/agent/quicklisp/dists/quicklisp/software/hu.dwim.perec-20150608-darcs/hu.dwim.perec+hu.dwim.quasi-quote.xml.asd: DEFPACKAGE HU.DWIM.ASDF: Не существует символа ASDF::NON-PROPAGATING-OPERATION .
(LOAD hu.dwim.perec FAIL) ASDF:LOAD-SYSTEM-DEFINITION-ERROR : Error while trying to load definition for system hu.dwim.perec from pathname /home/hijarian/systems/cl-test-grid/work-dir/agent/quicklisp/dists/quicklisp/software/hu.dwim.perec-20150608-darcs/hu.dwim.perec.asd: DEFPACKAGE HU.DWIM.ASDF: Не существует символа ASDF::NON-PROPAGATING-OPERATION .
(LOAD hu.dwim.perec.test FAIL) ASDF:MISSING-COMPONENT : Component "iolib/syscalls" not found
(LOAD hu.dwim.perec.sqlite.test FAIL) ASDF:MISSING-COMPONENT : Component "iolib/syscalls" not found
(LOAD hu.dwim.perec.sqlite FAIL) COMMON-LISP:SIMPLE-TYPE-ERROR : Значение PACKAGE должно быть типа PACKAGE. Значение: NIL
(LOAD hu.dwim.perec.postgresql.test FAIL) ASDF:MISSING-COMPONENT : Component "iolib/syscalls" not found
(LOAD hu.dwim.perec.postgresql FAIL) COMMON-LISP:SIMPLE-TYPE-ERROR : Значение PACKAGE должно быть типа PACKAGE. Значение: NIL
(LOAD hu.dwim.perec.oracle.test FAIL) ASDF:MISSING-COMPONENT : Component "iolib/syscalls" not found
(LOAD hu.dwim.perec.oracle FAIL) COMMON-LISP:SIMPLE-TYPE-ERROR : Значение PACKAGE должно быть типа PACKAGE. Значение: NIL
(LOAD hu.dwim.perec.all.test FAIL) ASDF:MISSING-COMPONENT : Component "iolib/syscalls" not found
(LOAD hu.dwim.perec.all FAIL) COMMON-LISP:SIMPLE-TYPE-ERROR : Значение PACKAGE должно быть типа PACKAGE. Значение: NIL
(LOAD hu.dwim.perec+swank FAIL) SYSTEM::SIMPLE-PACKAGE-ERROR : SYSTEM::%FIND-PACKAGE: Нет пакетов с именем "NIL".
(LOAD hu.dwim.perec+iolib FAIL) ASDF:LOAD-SYSTEM-DEFINITION-ERROR : Error while trying to load definition for system swap-bytes from pathname /home/hijarian/systems/cl-test-grid/work-dir/agent/quicklisp/dists/quicklisp/software/swap-bytes-20140713-git/swap-bytes.asd: You need ASDF >= 2.32 to load this system correctly.
(LOAD hu.dwim.perec+hu.dwim.quasi-quote.xml FAIL) COMMON-LISP:SIMPLE-ERROR : This is not implemented for your lisp, sorry. You may try to continue, but...
(LOAD hu.dwim.perec FAIL) SYSTEM::SIMPLE-PACKAGE-ERROR : SYSTEM::%FIND-PACKAGE: Нет пакетов с именем "NIL".
clisp-2.49-unix-x86
(LOAD hu.dwim.perec.test FAIL) ASDF:LOAD-SYSTEM-DEFINITION-ERROR : Error while trying to load definition for system hu.dwim.perec.test from pathname /home/testgrid/cl-test-grid/work-dir/agent/quicklisp/dists/quicklisp/software/hu.dwim.perec-20150608-darcs/hu.dwim.perec.test.asd: DEFPACKAGE HU.DWIM.ASDF: There is no symbol ASDF::NON-PROPAGATING-OPERATION .
(LOAD hu.dwim.perec.sqlite.test FAIL) ASDF:LOAD-SYSTEM-DEFINITION-ERROR : Error while trying to load definition for system hu.dwim.perec.sqlite.test from pathname /home/testgrid/cl-test-grid/work-dir/agent/quicklisp/dists/quicklisp/software/hu.dwim.perec-20150608-darcs/hu.dwim.perec.sqlite.test.asd: DEFPACKAGE HU.DWIM.ASDF: There is no symbol ASDF::NON-PROPAGATING-OPERATION .
(LOAD hu.dwim.perec.sqlite FAIL) ASDF:LOAD-SYSTEM-DEFINITION-ERROR : Error while trying to load definition for system hu.dwim.perec.sqlite from pathname /home/testgrid/cl-test-grid/work-dir/agent/quicklisp/dists/quicklisp/software/hu.dwim.perec-20150608-darcs/hu.dwim.perec.sqlite.asd: DEFPACKAGE HU.DWIM.ASDF: There is no symbol ASDF::NON-PROPAGATING-OPERATION .
(LOAD hu.dwim.perec.postgresql.test FAIL) ASDF:LOAD-SYSTEM-DEFINITION-ERROR : Error while trying to load definition for system hu.dwim.perec.postgresql.test from pathname /home/testgrid/cl-test-grid/work-dir/agent/quicklisp/dists/quicklisp/software/hu.dwim.perec-20150608-darcs/hu.dwim.perec.postgresql.test.asd: DEFPACKAGE HU.DWIM.ASDF: There is no symbol ASDF::NON-PROPAGATING-OPERATION .
(LOAD hu.dwim.perec.postgresql FAIL) ASDF:LOAD-SYSTEM-DEFINITION-ERROR : Error while trying to load definition for system hu.dwim.perec.postgresql from pathname /home/testgrid/cl-test-grid/work-dir/agent/quicklisp/dists/quicklisp/software/hu.dwim.perec-20150608-darcs/hu.dwim.perec.postgresql.asd: DEFPACKAGE HU.DWIM.ASDF: There is no symbol ASDF::NON-PROPAGATING-OPERATION .
(LOAD hu.dwim.perec.oracle.test FAIL) ASDF:LOAD-SYSTEM-DEFINITION-ERROR : Error while trying to load definition for system hu.dwim.perec.oracle.test from pathname /home/testgrid/cl-test-grid/work-dir/agent/quicklisp/dists/quicklisp/software/hu.dwim.perec-20150608-darcs/hu.dwim.perec.oracle.test.asd: DEFPACKAGE HU.DWIM.ASDF: There is no symbol ASDF::NON-PROPAGATING-OPERATION .
(LOAD hu.dwim.perec.oracle FAIL) ASDF:LOAD-SYSTEM-DEFINITION-ERROR : Error while trying to load definition for system hu.dwim.perec.oracle from pathname /home/testgrid/cl-test-grid/work-dir/agent/quicklisp/dists/quicklisp/software/hu.dwim.perec-20150608-darcs/hu.dwim.perec.oracle.asd: DEFPACKAGE HU.DWIM.ASDF: There is no symbol ASDF::NON-PROPAGATING-OPERATION .
(LOAD hu.dwim.perec.all.test FAIL) ASDF:LOAD-SYSTEM-DEFINITION-ERROR : Error while trying to load definition for system hu.dwim.perec.all.test from pathname /home/testgrid/cl-test-grid/work-dir/agent/quicklisp/dists/quicklisp/software/hu.dwim.perec-20150608-darcs/hu.dwim.perec.all.test.asd: DEFPACKAGE HU.DWIM.ASDF: There is no symbol ASDF::NON-PROPAGATING-OPERATION .
(LOAD hu.dwim.perec.all FAIL) ASDF:LOAD-SYSTEM-DEFINITION-ERROR : Error while trying to load definition for system hu.dwim.perec.all from pathname /home/testgrid/cl-test-grid/work-dir/agent/quicklisp/dists/quicklisp/software/hu.dwim.perec-20150608-darcs/hu.dwim.perec.all.asd: DEFPACKAGE HU.DWIM.ASDF: There is no symbol ASDF::NON-PROPAGATING-OPERATION .
(LOAD hu.dwim.perec+swank FAIL) ASDF:LOAD-SYSTEM-DEFINITION-ERROR : Error while trying to load definition for system hu.dwim.perec+swank from pathname /home/testgrid/cl-test-grid/work-dir/agent/quicklisp/dists/quicklisp/software/hu.dwim.perec-20150608-darcs/hu.dwim.perec+swank.asd: DEFPACKAGE HU.DWIM.ASDF: There is no symbol ASDF::NON-PROPAGATING-OPERATION .
(LOAD hu.dwim.perec+iolib FAIL) ASDF:LOAD-SYSTEM-DEFINITION-ERROR : Error while trying to load definition for system hu.dwim.perec+iolib from pathname /home/testgrid/cl-test-grid/work-dir/agent/quicklisp/dists/quicklisp/software/hu.dwim.perec-20150608-darcs/hu.dwim.perec+iolib.asd: DEFPACKAGE HU.DWIM.ASDF: There is no symbol ASDF::NON-PROPAGATING-OPERATION .
(LOAD hu.dwim.perec+hu.dwim.quasi-quote.xml FAIL) ASDF:LOAD-SYSTEM-DEFINITION-ERROR : Error while trying to load definition for system hu.dwim.perec+hu.dwim.quasi-quote.xml from pathname /home/testgrid/cl-test-grid/work-dir/agent/quicklisp/dists/quicklisp/software/hu.dwim.perec-20150608-darcs/hu.dwim.perec+hu.dwim.quasi-quote.xml.asd: DEFPACKAGE HU.DWIM.ASDF: There is no symbol ASDF::NON-PROPAGATING-OPERATION .
(LOAD hu.dwim.perec FAIL) ASDF:LOAD-SYSTEM-DEFINITION-ERROR : Error while trying to load definition for system hu.dwim.perec from pathname /home/testgrid/cl-test-grid/work-dir/agent/quicklisp/dists/quicklisp/software/hu.dwim.perec-20150608-darcs/hu.dwim.perec.asd: DEFPACKAGE HU.DWIM.ASDF: There is no symbol ASDF::NON-PROPAGATING-OPERATION .
(LOAD hu.dwim.perec.test FAIL) ASDF:MISSING-COMPONENT : Component "iolib/syscalls" not found
(LOAD hu.dwim.perec.sqlite.test FAIL) ASDF:MISSING-COMPONENT : Component "iolib/syscalls" not found
(LOAD hu.dwim.perec.sqlite FAIL) COMMON-LISP:SIMPLE-TYPE-ERROR : The value of PACKAGE should be of type PACKAGE. The value is: NIL
(LOAD hu.dwim.perec.postgresql.test FAIL) ASDF:MISSING-COMPONENT : Component "iolib/syscalls" not found
(LOAD hu.dwim.perec.postgresql FAIL) COMMON-LISP:SIMPLE-TYPE-ERROR : The value of PACKAGE should be of type PACKAGE. The value is: NIL
(LOAD hu.dwim.perec.oracle.test FAIL) ASDF:MISSING-COMPONENT : Component "iolib/syscalls" not found
(LOAD hu.dwim.perec.oracle FAIL) COMMON-LISP:SIMPLE-TYPE-ERROR : The value of PACKAGE should be of type PACKAGE. The value is: NIL
(LOAD hu.dwim.perec.all.test FAIL) ASDF:MISSING-COMPONENT : Component "iolib/syscalls" not found
(LOAD hu.dwim.perec.all FAIL) COMMON-LISP:SIMPLE-TYPE-ERROR : The value of PACKAGE should be of type PACKAGE. The value is: NIL
(LOAD hu.dwim.perec+swank FAIL) SYSTEM::SIMPLE-PACKAGE-ERROR : SYSTEM::%FIND-PACKAGE: There is no package with name "NIL"
(LOAD hu.dwim.perec+iolib FAIL) ASDF:LOAD-SYSTEM-DEFINITION-ERROR : Error while trying to load definition for system swap-bytes from pathname /home/testgrid/cl-test-grid/work-dir/agent/quicklisp/dists/quicklisp/software/swap-bytes-20140713-git/swap-bytes.asd: You need ASDF >= 2.32 to load this system correctly.
(LOAD hu.dwim.perec+hu.dwim.quasi-quote.xml FAIL) COMMON-LISP:SIMPLE-ERROR : This is not implemented for your lisp, sorry. You may try to continue, but...
(LOAD hu.dwim.perec FAIL) SYSTEM::SIMPLE-PACKAGE-ERROR : SYSTEM::%FIND-PACKAGE: There is no package with name "NIL"
cmu-snapshot-2013-04__20d_unicode_-linux-x86
(LOAD hu.dwim.perec.test FAIL) needs newer ASDF, ASDF/FIND-SYSTEM:LOAD-SYSTEM-DEFINITION-ERROR : Error while trying to load definition for system hu.dwim.perec.test from pathname /home/testgrid/cl-test-grid/work-dir/agent/quicklisp/dists/quicklisp/software/hu.dwim.perec-20150608-darcs/hu.dwim.perec.test.asd: ASDF/INTERFACE does not contain a symbol NON-PROPAGATING-OPERATION
(LOAD hu.dwim.perec.sqlite.test FAIL) needs newer ASDF, ASDF/FIND-SYSTEM:LOAD-SYSTEM-DEFINITION-ERROR : Error while trying to load definition for system hu.dwim.perec.sqlite.test from pathname /home/testgrid/cl-test-grid/work-dir/agent/quicklisp/dists/quicklisp/software/hu.dwim.perec-20150608-darcs/hu.dwim.perec.sqlite.test.asd: ASDF/INTERFACE does not contain a symbol NON-PROPAGATING-OPERATION
(LOAD hu.dwim.perec.sqlite FAIL) needs newer ASDF, ASDF/FIND-SYSTEM:LOAD-SYSTEM-DEFINITION-ERROR : Error while trying to load definition for system hu.dwim.perec.sqlite from pathname /home/testgrid/cl-test-grid/work-dir/agent/quicklisp/dists/quicklisp/software/hu.dwim.perec-20150608-darcs/hu.dwim.perec.sqlite.asd: ASDF/INTERFACE does not contain a symbol NON-PROPAGATING-OPERATION
(LOAD hu.dwim.perec.postgresql.test FAIL) needs newer ASDF, ASDF/FIND-SYSTEM:LOAD-SYSTEM-DEFINITION-ERROR : Error while trying to load definition for system hu.dwim.perec.postgresql.test from pathname /home/testgrid/cl-test-grid/work-dir/agent/quicklisp/dists/quicklisp/software/hu.dwim.perec-20150608-darcs/hu.dwim.perec.postgresql.test.asd: ASDF/INTERFACE does not contain a symbol NON-PROPAGATING-OPERATION
(LOAD hu.dwim.perec.postgresql FAIL) needs newer ASDF, ASDF/FIND-SYSTEM:LOAD-SYSTEM-DEFINITION-ERROR : Error while trying to load definition for system hu.dwim.perec.postgresql from pathname /home/testgrid/cl-test-grid/work-dir/agent/quicklisp/dists/quicklisp/software/hu.dwim.perec-20150608-darcs/hu.dwim.perec.postgresql.asd: ASDF/INTERFACE does not contain a symbol NON-PROPAGATING-OPERATION
(LOAD hu.dwim.perec.oracle.test FAIL) needs newer ASDF, ASDF/FIND-SYSTEM:LOAD-SYSTEM-DEFINITION-ERROR : Error while trying to load definition for system hu.dwim.perec.oracle.test from pathname /home/testgrid/cl-test-grid/work-dir/agent/quicklisp/dists/quicklisp/software/hu.dwim.perec-20150608-darcs/hu.dwim.perec.oracle.test.asd: ASDF/INTERFACE does not contain a symbol NON-PROPAGATING-OPERATION
(LOAD hu.dwim.perec.oracle FAIL) needs newer ASDF, ASDF/FIND-SYSTEM:LOAD-SYSTEM-DEFINITION-ERROR : Error while trying to load definition for system hu.dwim.perec.oracle from pathname /home/testgrid/cl-test-grid/work-dir/agent/quicklisp/dists/quicklisp/software/hu.dwim.perec-20150608-darcs/hu.dwim.perec.oracle.asd: ASDF/INTERFACE does not contain a symbol NON-PROPAGATING-OPERATION
(LOAD hu.dwim.perec.all.test FAIL) needs newer ASDF, ASDF/FIND-SYSTEM:LOAD-SYSTEM-DEFINITION-ERROR : Error while trying to load definition for system hu.dwim.perec.all.test from pathname /home/testgrid/cl-test-grid/work-dir/agent/quicklisp/dists/quicklisp/software/hu.dwim.perec-20150608-darcs/hu.dwim.perec.all.test.asd: ASDF/INTERFACE does not contain a symbol NON-PROPAGATING-OPERATION
(LOAD hu.dwim.perec.all FAIL) needs newer ASDF, ASDF/FIND-SYSTEM:LOAD-SYSTEM-DEFINITION-ERROR : Error while trying to load definition for system hu.dwim.perec.all from pathname /home/testgrid/cl-test-grid/work-dir/agent/quicklisp/dists/quicklisp/software/hu.dwim.perec-20150608-darcs/hu.dwim.perec.all.asd: ASDF/INTERFACE does not contain a symbol NON-PROPAGATING-OPERATION
(LOAD hu.dwim.perec+swank FAIL) needs newer ASDF, ASDF/FIND-SYSTEM:LOAD-SYSTEM-DEFINITION-ERROR : Error while trying to load definition for system hu.dwim.perec+swank from pathname /home/testgrid/cl-test-grid/work-dir/agent/quicklisp/dists/quicklisp/software/hu.dwim.perec-20150608-darcs/hu.dwim.perec+swank.asd: ASDF/INTERFACE does not contain a symbol NON-PROPAGATING-OPERATION
(LOAD hu.dwim.perec+iolib FAIL) needs newer ASDF, ASDF/FIND-SYSTEM:LOAD-SYSTEM-DEFINITION-ERROR : Error while trying to load definition for system hu.dwim.perec+iolib from pathname /home/testgrid/cl-test-grid/work-dir/agent/quicklisp/dists/quicklisp/software/hu.dwim.perec-20150608-darcs/hu.dwim.perec+iolib.asd: ASDF/INTERFACE does not contain a symbol NON-PROPAGATING-OPERATION
(LOAD hu.dwim.perec+hu.dwim.quasi-quote.xml FAIL) needs newer ASDF, ASDF/FIND-SYSTEM:LOAD-SYSTEM-DEFINITION-ERROR : Error while trying to load definition for system hu.dwim.perec+hu.dwim.quasi-quote.xml from pathname /home/testgrid/cl-test-grid/work-dir/agent/quicklisp/dists/quicklisp/software/hu.dwim.perec-20150608-darcs/hu.dwim.perec+hu.dwim.quasi-quote.xml.asd: ASDF/INTERFACE does not contain a symbol NON-PROPAGATING-OPERATION
(LOAD hu.dwim.perec FAIL) needs newer ASDF, ASDF/FIND-SYSTEM:LOAD-SYSTEM-DEFINITION-ERROR : Error while trying to load definition for system hu.dwim.perec from pathname /home/testgrid/cl-test-grid/work-dir/agent/quicklisp/dists/quicklisp/software/hu.dwim.perec-20150608-darcs/hu.dwim.perec.asd: ASDF/INTERFACE does not contain a symbol NON-PROPAGATING-OPERATION
(LOAD hu.dwim.perec.test FAIL) ASDF/FIND-SYSTEM:MISSING-COMPONENT : Component "iolib/sockets" not found
(LOAD hu.dwim.perec.sqlite.test FAIL) ASDF/FIND-SYSTEM:MISSING-COMPONENT : Component "iolib/sockets" not found
(LOAD hu.dwim.perec.sqlite FAIL) COMMON-LISP:SIMPLE-ERROR : Error in function USE-PACKAGE: Use'ing package CLOSER-MOP results in name conflicts for these symbols: (TYPEP SUBTYPEP)
(LOAD hu.dwim.perec.postgresql.test FAIL) ASDF/FIND-SYSTEM:MISSING-COMPONENT : Component "iolib/sockets" not found
(LOAD hu.dwim.perec.postgresql FAIL) COMMON-LISP:SIMPLE-ERROR : Error in function USE-PACKAGE: Use'ing package CLOSER-MOP results in name conflicts for these symbols: (TYPEP SUBTYPEP)
(LOAD hu.dwim.perec.oracle.test FAIL) ASDF/FIND-SYSTEM:MISSING-COMPONENT : Component "iolib/sockets" not found
(LOAD hu.dwim.perec.oracle FAIL) COMMON-LISP:SIMPLE-ERROR : Error in function USE-PACKAGE: Use'ing package CLOSER-MOP results in name conflicts for these symbols: (TYPEP SUBTYPEP)
(LOAD hu.dwim.perec.all.test FAIL) ASDF/FIND-SYSTEM:MISSING-COMPONENT : Component "iolib/sockets" not found
(LOAD hu.dwim.perec.all FAIL) COMMON-LISP:SIMPLE-ERROR : Error in function USE-PACKAGE: Use'ing package CLOSER-MOP results in name conflicts for these symbols: (TYPEP SUBTYPEP)
(LOAD hu.dwim.perec+swank FAIL) COMMON-LISP:SIMPLE-ERROR : Error in function USE-PACKAGE: Use'ing package CLOSER-MOP results in name conflicts for these symbols: (TYPEP SUBTYPEP)
(LOAD hu.dwim.perec+iolib FAIL) ASDF/FIND-SYSTEM:MISSING-COMPONENT : Component "iolib/sockets" not found
(LOAD hu.dwim.perec+hu.dwim.quasi-quote.xml FAIL) COMMON-LISP:SIMPLE-ERROR : Error in function USE-PACKAGE: Use'ing package CLOSER-MOP results in name conflicts for these symbols: (TYPEP SUBTYPEP)
(LOAD hu.dwim.perec FAIL) COMMON-LISP:SIMPLE-ERROR : Error in function USE-PACKAGE: Use'ing package CLOSER-MOP results in name conflicts for these symbols: (TYPEP SUBTYPEP)
cmu-snapshot-2014-01__20e_unicode_-linux-x86
(LOAD hu.dwim.perec.test FAIL) needs newer ASDF, ASDF/FIND-SYSTEM:LOAD-SYSTEM-DEFINITION-ERROR : Error while trying to load definition for system hu.dwim.perec.test from pathname /home/testgrid/cl-test-grid/work-dir/agent/quicklisp/dists/quicklisp/software/hu.dwim.perec-20150608-darcs/hu.dwim.perec.test.asd: ASDF/INTERFACE does not contain a symbol NON-PROPAGATING-OPERATION
(LOAD hu.dwim.perec.sqlite.test FAIL) needs newer ASDF, ASDF/FIND-SYSTEM:LOAD-SYSTEM-DEFINITION-ERROR : Error while trying to load definition for system hu.dwim.perec.sqlite.test from pathname /home/testgrid/cl-test-grid/work-dir/agent/quicklisp/dists/quicklisp/software/hu.dwim.perec-20150608-darcs/hu.dwim.perec.sqlite.test.asd: ASDF/INTERFACE does not contain a symbol NON-PROPAGATING-OPERATION
(LOAD hu.dwim.perec.sqlite FAIL) needs newer ASDF, ASDF/FIND-SYSTEM:LOAD-SYSTEM-DEFINITION-ERROR : Error while trying to load definition for system hu.dwim.perec.sqlite from pathname /home/testgrid/cl-test-grid/work-dir/agent/quicklisp/dists/quicklisp/software/hu.dwim.perec-20150608-darcs/hu.dwim.perec.sqlite.asd: ASDF/INTERFACE does not contain a symbol NON-PROPAGATING-OPERATION
(LOAD hu.dwim.perec.postgresql.test FAIL) needs newer ASDF, ASDF/FIND-SYSTEM:LOAD-SYSTEM-DEFINITION-ERROR : Error while trying to load definition for system hu.dwim.perec.postgresql.test from pathname /home/testgrid/cl-test-grid/work-dir/agent/quicklisp/dists/quicklisp/software/hu.dwim.perec-20150608-darcs/hu.dwim.perec.postgresql.test.asd: ASDF/INTERFACE does not contain a symbol NON-PROPAGATING-OPERATION
(LOAD hu.dwim.perec.postgresql FAIL) needs newer ASDF, ASDF/FIND-SYSTEM:LOAD-SYSTEM-DEFINITION-ERROR : Error while trying to load definition for system hu.dwim.perec.postgresql from pathname /home/testgrid/cl-test-grid/work-dir/agent/quicklisp/dists/quicklisp/software/hu.dwim.perec-20150608-darcs/hu.dwim.perec.postgresql.asd: ASDF/INTERFACE does not contain a symbol NON-PROPAGATING-OPERATION
(LOAD hu.dwim.perec.oracle.test FAIL) needs newer ASDF, ASDF/FIND-SYSTEM:LOAD-SYSTEM-DEFINITION-ERROR : Error while trying to load definition for system hu.dwim.perec.oracle.test from pathname /home/testgrid/cl-test-grid/work-dir/agent/quicklisp/dists/quicklisp/software/hu.dwim.perec-20150608-darcs/hu.dwim.perec.oracle.test.asd: ASDF/INTERFACE does not contain a symbol NON-PROPAGATING-OPERATION
(LOAD hu.dwim.perec.oracle FAIL) needs newer ASDF, ASDF/FIND-SYSTEM:LOAD-SYSTEM-DEFINITION-ERROR : Error while trying to load definition for system hu.dwim.perec.oracle from pathname /home/testgrid/cl-test-grid/work-dir/agent/quicklisp/dists/quicklisp/software/hu.dwim.perec-20150608-darcs/hu.dwim.perec.oracle.asd: ASDF/INTERFACE does not contain a symbol NON-PROPAGATING-OPERATION
(LOAD hu.dwim.perec.all.test FAIL) needs newer ASDF, ASDF/FIND-SYSTEM:LOAD-SYSTEM-DEFINITION-ERROR : Error while trying to load definition for system hu.dwim.perec.all.test from pathname /home/testgrid/cl-test-grid/work-dir/agent/quicklisp/dists/quicklisp/software/hu.dwim.perec-20150608-darcs/hu.dwim.perec.all.test.asd: ASDF/INTERFACE does not contain a symbol NON-PROPAGATING-OPERATION
(LOAD hu.dwim.perec.all FAIL) needs newer ASDF, ASDF/FIND-SYSTEM:LOAD-SYSTEM-DEFINITION-ERROR : Error while trying to load definition for system hu.dwim.perec.all from pathname /home/testgrid/cl-test-grid/work-dir/agent/quicklisp/dists/quicklisp/software/hu.dwim.perec-20150608-darcs/hu.dwim.perec.all.asd: ASDF/INTERFACE does not contain a symbol NON-PROPAGATING-OPERATION
(LOAD hu.dwim.perec+swank FAIL) needs newer ASDF, ASDF/FIND-SYSTEM:LOAD-SYSTEM-DEFINITION-ERROR : Error while trying to load definition for system hu.dwim.perec+swank from pathname /home/testgrid/cl-test-grid/work-dir/agent/quicklisp/dists/quicklisp/software/hu.dwim.perec-20150608-darcs/hu.dwim.perec+swank.asd: ASDF/INTERFACE does not contain a symbol NON-PROPAGATING-OPERATION
(LOAD hu.dwim.perec+iolib FAIL) needs newer ASDF, ASDF/FIND-SYSTEM:LOAD-SYSTEM-DEFINITION-ERROR : Error while trying to load definition for system hu.dwim.perec+iolib from pathname /home/testgrid/cl-test-grid/work-dir/agent/quicklisp/dists/quicklisp/software/hu.dwim.perec-20150608-darcs/hu.dwim.perec+iolib.asd: ASDF/INTERFACE does not contain a symbol NON-PROPAGATING-OPERATION
(LOAD hu.dwim.perec+hu.dwim.quasi-quote.xml FAIL) needs newer ASDF, ASDF/FIND-SYSTEM:LOAD-SYSTEM-DEFINITION-ERROR : Error while trying to load definition for system hu.dwim.perec+hu.dwim.quasi-quote.xml from pathname /home/testgrid/cl-test-grid/work-dir/agent/quicklisp/dists/quicklisp/software/hu.dwim.perec-20150608-darcs/hu.dwim.perec+hu.dwim.quasi-quote.xml.asd: ASDF/INTERFACE does not contain a symbol NON-PROPAGATING-OPERATION
(LOAD hu.dwim.perec FAIL) needs newer ASDF, ASDF/FIND-SYSTEM:LOAD-SYSTEM-DEFINITION-ERROR : Error while trying to load definition for system hu.dwim.perec from pathname /home/testgrid/cl-test-grid/work-dir/agent/quicklisp/dists/quicklisp/software/hu.dwim.perec-20150608-darcs/hu.dwim.perec.asd: ASDF/INTERFACE does not contain a symbol NON-PROPAGATING-OPERATION
(LOAD hu.dwim.perec.test FAIL) COMMON-LISP:SIMPLE-ERROR : Error in function USE-PACKAGE: Use'ing package CLOSER-MOP results in name conflicts for these symbols: (TYPEP SUBTYPEP)
(LOAD hu.dwim.perec.sqlite.test FAIL) COMMON-LISP:SIMPLE-ERROR : Error in function USE-PACKAGE: Use'ing package CLOSER-MOP results in name conflicts for these symbols: (TYPEP SUBTYPEP)
(LOAD hu.dwim.perec.sqlite FAIL) COMMON-LISP:SIMPLE-ERROR : Error in function USE-PACKAGE: Use'ing package CLOSER-MOP results in name conflicts for these symbols: (TYPEP SUBTYPEP)
(LOAD hu.dwim.perec.postgresql.test FAIL) COMMON-LISP:SIMPLE-ERROR : Error in function USE-PACKAGE: Use'ing package CLOSER-MOP results in name conflicts for these symbols: (TYPEP SUBTYPEP)
(LOAD hu.dwim.perec.postgresql FAIL) COMMON-LISP:SIMPLE-ERROR : Error in function USE-PACKAGE: Use'ing package CLOSER-MOP results in name conflicts for these symbols: (TYPEP SUBTYPEP)
(LOAD hu.dwim.perec.oracle.test FAIL) COMMON-LISP:SIMPLE-ERROR : Error in function USE-PACKAGE: Use'ing package CLOSER-MOP results in name conflicts for these symbols: (TYPEP SUBTYPEP)
(LOAD hu.dwim.perec.oracle FAIL) COMMON-LISP:SIMPLE-ERROR : Error in function USE-PACKAGE: Use'ing package CLOSER-MOP results in name conflicts for these symbols: (TYPEP SUBTYPEP)
(LOAD hu.dwim.perec.all.test FAIL) COMMON-LISP:SIMPLE-ERROR : Error in function USE-PACKAGE: Use'ing package CLOSER-MOP results in name conflicts for these symbols: (TYPEP SUBTYPEP)
(LOAD hu.dwim.perec.all FAIL) COMMON-LISP:SIMPLE-ERROR : Error in function USE-PACKAGE: Use'ing package CLOSER-MOP results in name conflicts for these symbols: (TYPEP SUBTYPEP)
(LOAD hu.dwim.perec+swank FAIL) COMMON-LISP:SIMPLE-ERROR : Error in function USE-PACKAGE: Use'ing package CLOSER-MOP results in name conflicts for these symbols: (TYPEP SUBTYPEP)
(LOAD hu.dwim.perec+iolib FAIL) COMMON-LISP:SIMPLE-ERROR : Error in function USE-PACKAGE: Use'ing package CLOSER-MOP results in name conflicts for these symbols: (TYPEP SUBTYPEP)
(LOAD hu.dwim.perec+hu.dwim.quasi-quote.xml FAIL) COMMON-LISP:SIMPLE-ERROR : Error in function USE-PACKAGE: Use'ing package CLOSER-MOP results in name conflicts for these symbols: (TYPEP SUBTYPEP)
(LOAD hu.dwim.perec FAIL) COMMON-LISP:SIMPLE-ERROR : Error in function USE-PACKAGE: Use'ing package CLOSER-MOP results in name conflicts for these symbols: (TYPEP SUBTYPEP)
cmu-snapshot-2014-05-dirty__20e_unicode_-linux-x86
(LOAD hu.dwim.perec.test FAIL) needs newer ASDF, ASDF/FIND-SYSTEM:LOAD-SYSTEM-DEFINITION-ERROR : Error while trying to load definition for system hu.dwim.perec.test from pathname /home/testgrid/cl-test-grid/work-dir/agent/quicklisp/dists/quicklisp/software/hu.dwim.perec-20150608-darcs/hu.dwim.perec.test.asd: ASDF/INTERFACE does not contain a symbol NON-PROPAGATING-OPERATION
(LOAD hu.dwim.perec.sqlite.test FAIL) needs newer ASDF, ASDF/FIND-SYSTEM:LOAD-SYSTEM-DEFINITION-ERROR : Error while trying to load definition for system hu.dwim.perec.sqlite.test from pathname /home/testgrid/cl-test-grid/work-dir/agent/quicklisp/dists/quicklisp/software/hu.dwim.perec-20150608-darcs/hu.dwim.perec.sqlite.test.asd: ASDF/INTERFACE does not contain a symbol NON-PROPAGATING-OPERATION
(LOAD hu.dwim.perec.sqlite FAIL) needs newer ASDF, ASDF/FIND-SYSTEM:LOAD-SYSTEM-DEFINITION-ERROR : Error while trying to load definition for system hu.dwim.perec.sqlite from pathname /home/testgrid/cl-test-grid/work-dir/agent/quicklisp/dists/quicklisp/software/hu.dwim.perec-20150608-darcs/hu.dwim.perec.sqlite.asd: ASDF/INTERFACE does not contain a symbol NON-PROPAGATING-OPERATION
(LOAD hu.dwim.perec.postgresql.test FAIL) needs newer ASDF, ASDF/FIND-SYSTEM:LOAD-SYSTEM-DEFINITION-ERROR : Error while trying to load definition for system hu.dwim.perec.postgresql.test from pathname /home/testgrid/cl-test-grid/work-dir/agent/quicklisp/dists/quicklisp/software/hu.dwim.perec-20150608-darcs/hu.dwim.perec.postgresql.test.asd: ASDF/INTERFACE does not contain a symbol NON-PROPAGATING-OPERATION
(LOAD hu.dwim.perec.postgresql FAIL) needs newer ASDF, ASDF/FIND-SYSTEM:LOAD-SYSTEM-DEFINITION-ERROR : Error while trying to load definition for system hu.dwim.perec.postgresql from pathname /home/testgrid/cl-test-grid/work-dir/agent/quicklisp/dists/quicklisp/software/hu.dwim.perec-20150608-darcs/hu.dwim.perec.postgresql.asd: ASDF/INTERFACE does not contain a symbol NON-PROPAGATING-OPERATION
(LOAD hu.dwim.perec.oracle.test FAIL) needs newer ASDF, ASDF/FIND-SYSTEM:LOAD-SYSTEM-DEFINITION-ERROR : Error while trying to load definition for system hu.dwim.perec.oracle.test from pathname /home/testgrid/cl-test-grid/work-dir/agent/quicklisp/dists/quicklisp/software/hu.dwim.perec-20150608-darcs/hu.dwim.perec.oracle.test.asd: ASDF/INTERFACE does not contain a symbol NON-PROPAGATING-OPERATION
(LOAD hu.dwim.perec.oracle FAIL) needs newer ASDF, ASDF/FIND-SYSTEM:LOAD-SYSTEM-DEFINITION-ERROR : Error while trying to load definition for system hu.dwim.perec.oracle from pathname /home/testgrid/cl-test-grid/work-dir/agent/quicklisp/dists/quicklisp/software/hu.dwim.perec-20150608-darcs/hu.dwim.perec.oracle.asd: ASDF/INTERFACE does not contain a symbol NON-PROPAGATING-OPERATION
(LOAD hu.dwim.perec.all.test FAIL) needs newer ASDF, ASDF/FIND-SYSTEM:LOAD-SYSTEM-DEFINITION-ERROR : Error while trying to load definition for system hu.dwim.perec.all.test from pathname /home/testgrid/cl-test-grid/work-dir/agent/quicklisp/dists/quicklisp/software/hu.dwim.perec-20150608-darcs/hu.dwim.perec.all.test.asd: ASDF/INTERFACE does not contain a symbol NON-PROPAGATING-OPERATION
(LOAD hu.dwim.perec.all FAIL) needs newer ASDF, ASDF/FIND-SYSTEM:LOAD-SYSTEM-DEFINITION-ERROR : Error while trying to load definition for system hu.dwim.perec.all from pathname /home/testgrid/cl-test-grid/work-dir/agent/quicklisp/dists/quicklisp/software/hu.dwim.perec-20150608-darcs/hu.dwim.perec.all.asd: ASDF/INTERFACE does not contain a symbol NON-PROPAGATING-OPERATION
(LOAD hu.dwim.perec+swank FAIL) needs newer ASDF, ASDF/FIND-SYSTEM:LOAD-SYSTEM-DEFINITION-ERROR : Error while trying to load definition for system hu.dwim.perec+swank from pathname /home/testgrid/cl-test-grid/work-dir/agent/quicklisp/dists/quicklisp/software/hu.dwim.perec-20150608-darcs/hu.dwim.perec+swank.asd: ASDF/INTERFACE does not contain a symbol NON-PROPAGATING-OPERATION
(LOAD hu.dwim.perec+iolib FAIL) needs newer ASDF, ASDF/FIND-SYSTEM:LOAD-SYSTEM-DEFINITION-ERROR : Error while trying to load definition for system hu.dwim.perec+iolib from pathname /home/testgrid/cl-test-grid/work-dir/agent/quicklisp/dists/quicklisp/software/hu.dwim.perec-20150608-darcs/hu.dwim.perec+iolib.asd: ASDF/INTERFACE does not contain a symbol NON-PROPAGATING-OPERATION
(LOAD hu.dwim.perec+hu.dwim.quasi-quote.xml FAIL) needs newer ASDF, ASDF/FIND-SYSTEM:LOAD-SYSTEM-DEFINITION-ERROR : Error while trying to load definition for system hu.dwim.perec+hu.dwim.quasi-quote.xml from pathname /home/testgrid/cl-test-grid/work-dir/agent/quicklisp/dists/quicklisp/software/hu.dwim.perec-20150608-darcs/hu.dwim.perec+hu.dwim.quasi-quote.xml.asd: ASDF/INTERFACE does not contain a symbol NON-PROPAGATING-OPERATION
(LOAD hu.dwim.perec FAIL) needs newer ASDF, ASDF/FIND-SYSTEM:LOAD-SYSTEM-DEFINITION-ERROR : Error while trying to load definition for system hu.dwim.perec from pathname /home/testgrid/cl-test-grid/work-dir/agent/quicklisp/dists/quicklisp/software/hu.dwim.perec-20150608-darcs/hu.dwim.perec.asd: ASDF/INTERFACE does not contain a symbol NON-PROPAGATING-OPERATION
(LOAD hu.dwim.perec.test FAIL) COMMON-LISP:SIMPLE-ERROR : Error in function USE-PACKAGE: Use'ing package CLOSER-MOP results in name conflicts for these symbols: (TYPEP SUBTYPEP)
(LOAD hu.dwim.perec.sqlite.test FAIL) COMMON-LISP:SIMPLE-ERROR : Error in function USE-PACKAGE: Use'ing package CLOSER-MOP results in name conflicts for these symbols: (TYPEP SUBTYPEP)
(LOAD hu.dwim.perec.sqlite FAIL) COMMON-LISP:SIMPLE-ERROR : Error in function USE-PACKAGE: Use'ing package CLOSER-MOP results in name conflicts for these symbols: (TYPEP SUBTYPEP)
(LOAD hu.dwim.perec.postgresql.test FAIL) COMMON-LISP:SIMPLE-ERROR : Error in function USE-PACKAGE: Use'ing package CLOSER-MOP results in name conflicts for these symbols: (TYPEP SUBTYPEP)
(LOAD hu.dwim.perec.postgresql FAIL) COMMON-LISP:SIMPLE-ERROR : Error in function USE-PACKAGE: Use'ing package CLOSER-MOP results in name conflicts for these symbols: (TYPEP SUBTYPEP)
(LOAD hu.dwim.perec.oracle.test FAIL) COMMON-LISP:SIMPLE-ERROR : Error in function USE-PACKAGE: Use'ing package CLOSER-MOP results in name conflicts for these symbols: (TYPEP SUBTYPEP)
(LOAD hu.dwim.perec.oracle FAIL) COMMON-LISP:SIMPLE-ERROR : Error in function USE-PACKAGE: Use'ing package CLOSER-MOP results in name conflicts for these symbols: (TYPEP SUBTYPEP)
(LOAD hu.dwim.perec.all.test FAIL) COMMON-LISP:SIMPLE-ERROR : Error in function USE-PACKAGE: Use'ing package CLOSER-MOP results in name conflicts for these symbols: (TYPEP SUBTYPEP)
(LOAD hu.dwim.perec.all FAIL) COMMON-LISP:SIMPLE-ERROR : Error in function USE-PACKAGE: Use'ing package CLOSER-MOP results in name conflicts for these symbols: (TYPEP SUBTYPEP)
(LOAD hu.dwim.perec+swank FAIL) COMMON-LISP:SIMPLE-ERROR : Error in function USE-PACKAGE: Use'ing package CLOSER-MOP results in name conflicts for these symbols: (TYPEP SUBTYPEP)
(LOAD hu.dwim.perec+iolib FAIL) COMMON-LISP:SIMPLE-ERROR : Error in function USE-PACKAGE: Use'ing package CLOSER-MOP results in name conflicts for these symbols: (TYPEP SUBTYPEP)
(LOAD hu.dwim.perec+hu.dwim.quasi-quote.xml FAIL) COMMON-LISP:SIMPLE-ERROR : Error in function USE-PACKAGE: Use'ing package CLOSER-MOP results in name conflicts for these symbols: (TYPEP SUBTYPEP)
(LOAD hu.dwim.perec FAIL) COMMON-LISP:SIMPLE-ERROR : Error in function USE-PACKAGE: Use'ing package CLOSER-MOP results in name conflicts for these symbols: (TYPEP SUBTYPEP)
cmu-snapshot-2014-12___20f_unicode_-linux-x86
(LOAD hu.dwim.perec.test FAIL) COMMON-LISP:SIMPLE-ERROR : Error in function USE-PACKAGE: Use'ing package CLOSER-MOP results in name conflicts for these symbols: (TYPEP SUBTYPEP)
(LOAD hu.dwim.perec.sqlite.test FAIL) COMMON-LISP:SIMPLE-ERROR : Error in function USE-PACKAGE: Use'ing package CLOSER-MOP results in name conflicts for these symbols: (TYPEP SUBTYPEP)
(LOAD hu.dwim.perec.sqlite FAIL) COMMON-LISP:SIMPLE-ERROR : Error in function USE-PACKAGE: Use'ing package CLOSER-MOP results in name conflicts for these symbols: (TYPEP SUBTYPEP)
(LOAD hu.dwim.perec.postgresql.test FAIL) COMMON-LISP:SIMPLE-ERROR : Error in function USE-PACKAGE: Use'ing package CLOSER-MOP results in name conflicts for these symbols: (TYPEP SUBTYPEP)
(LOAD hu.dwim.perec.postgresql FAIL) COMMON-LISP:SIMPLE-ERROR : Error in function USE-PACKAGE: Use'ing package CLOSER-MOP results in name conflicts for these symbols: (TYPEP SUBTYPEP)
(LOAD hu.dwim.perec.oracle.test FAIL) COMMON-LISP:SIMPLE-ERROR : Error in function USE-PACKAGE: Use'ing package CLOSER-MOP results in name conflicts for these symbols: (TYPEP SUBTYPEP)
(LOAD hu.dwim.perec.oracle FAIL) COMMON-LISP:SIMPLE-ERROR : Error in function USE-PACKAGE: Use'ing package CLOSER-MOP results in name conflicts for these symbols: (TYPEP SUBTYPEP)
(LOAD hu.dwim.perec.all.test FAIL) COMMON-LISP:SIMPLE-ERROR : Error in function USE-PACKAGE: Use'ing package CLOSER-MOP results in name conflicts for these symbols: (TYPEP SUBTYPEP)
(LOAD hu.dwim.perec.all FAIL) COMMON-LISP:SIMPLE-ERROR : Error in function USE-PACKAGE: Use'ing package CLOSER-MOP results in name conflicts for these symbols: (TYPEP SUBTYPEP)
(LOAD hu.dwim.perec+swank FAIL) COMMON-LISP:SIMPLE-ERROR : Error in function USE-PACKAGE: Use'ing package CLOSER-MOP results in name conflicts for these symbols: (TYPEP SUBTYPEP)
(LOAD hu.dwim.perec+iolib FAIL) COMMON-LISP:SIMPLE-ERROR : Error in function USE-PACKAGE: Use'ing package CLOSER-MOP results in name conflicts for these symbols: (TYPEP SUBTYPEP)
(LOAD hu.dwim.perec+hu.dwim.quasi-quote.xml FAIL) COMMON-LISP:SIMPLE-ERROR : Error in function USE-PACKAGE: Use'ing package CLOSER-MOP results in name conflicts for these symbols: (TYPEP SUBTYPEP)
(LOAD hu.dwim.perec FAIL) COMMON-LISP:SIMPLE-ERROR : Error in function USE-PACKAGE: Use'ing package CLOSER-MOP results in name conflicts for these symbols: (TYPEP SUBTYPEP)
(LOAD hu.dwim.perec.test FAIL) COMMON-LISP:SIMPLE-ERROR : Error in function USE-PACKAGE: Use'ing package CLOSER-MOP results in name conflicts for these symbols: (TYPEP SUBTYPEP)
(LOAD hu.dwim.perec.sqlite.test FAIL) COMMON-LISP:SIMPLE-ERROR : Error in function USE-PACKAGE: Use'ing package CLOSER-MOP results in name conflicts for these symbols: (TYPEP SUBTYPEP)
(LOAD hu.dwim.perec.sqlite FAIL) COMMON-LISP:SIMPLE-ERROR : Error in function USE-PACKAGE: Use'ing package CLOSER-MOP results in name conflicts for these symbols: (TYPEP SUBTYPEP)
(LOAD hu.dwim.perec.postgresql.test FAIL) COMMON-LISP:SIMPLE-ERROR : Error in function USE-PACKAGE: Use'ing package CLOSER-MOP results in name conflicts for these symbols: (TYPEP SUBTYPEP)
(LOAD hu.dwim.perec.postgresql FAIL) COMMON-LISP:SIMPLE-ERROR : Error in function USE-PACKAGE: Use'ing package CLOSER-MOP results in name conflicts for these symbols: (TYPEP SUBTYPEP)
(LOAD hu.dwim.perec.oracle.test FAIL) COMMON-LISP:SIMPLE-ERROR : Error in function USE-PACKAGE: Use'ing package CLOSER-MOP results in name conflicts for these symbols: (TYPEP SUBTYPEP)
(LOAD hu.dwim.perec.oracle FAIL) COMMON-LISP:SIMPLE-ERROR : Error in function USE-PACKAGE: Use'ing package CLOSER-MOP results in name conflicts for these symbols: (TYPEP SUBTYPEP)
(LOAD hu.dwim.perec.all.test FAIL) COMMON-LISP:SIMPLE-ERROR : Error in function USE-PACKAGE: Use'ing package CLOSER-MOP results in name conflicts for these symbols: (TYPEP SUBTYPEP)
(LOAD hu.dwim.perec.all FAIL) COMMON-LISP:SIMPLE-ERROR : Error in function USE-PACKAGE: Use'ing package CLOSER-MOP results in name conflicts for these symbols: (TYPEP SUBTYPEP)
(LOAD hu.dwim.perec+swank FAIL) COMMON-LISP:SIMPLE-ERROR : Error in function USE-PACKAGE: Use'ing package CLOSER-MOP results in name conflicts for these symbols: (TYPEP SUBTYPEP)
(LOAD hu.dwim.perec+iolib FAIL) COMMON-LISP:SIMPLE-ERROR : Error in function USE-PACKAGE: Use'ing package CLOSER-MOP results in name conflicts for these symbols: (TYPEP SUBTYPEP)
(LOAD hu.dwim.perec+hu.dwim.quasi-quote.xml FAIL) COMMON-LISP:SIMPLE-ERROR : Error in function USE-PACKAGE: Use'ing package CLOSER-MOP results in name conflicts for these symbols: (TYPEP SUBTYPEP)
(LOAD hu.dwim.perec FAIL) COMMON-LISP:SIMPLE-ERROR : Error in function USE-PACKAGE: Use'ing package CLOSER-MOP results in name conflicts for these symbols: (TYPEP SUBTYPEP)
ecl-13.5.1-unknown-linux-i686-bytecode
(LOAD hu.dwim.perec.test FAIL) needs newer ASDF, ASDF/FIND-SYSTEM:LOAD-SYSTEM-DEFINITION-ERROR : Error while trying to load definition for system hu.dwim.perec.test from pathname /home/testgrid/cl-test-grid/work-dir/agent/quicklisp/dists/quicklisp/software/hu.dwim.perec-20150608-darcs/hu.dwim.perec.test.asd: Cannot find symbol "NON-PROPAGATING-OPERATION" in package #<"ASDF/INTERFACE" package>
(LOAD hu.dwim.perec.sqlite.test FAIL) needs newer ASDF, ASDF/FIND-SYSTEM:LOAD-SYSTEM-DEFINITION-ERROR : Error while trying to load definition for system hu.dwim.perec.sqlite.test from pathname /home/testgrid/cl-test-grid/work-dir/agent/quicklisp/dists/quicklisp/software/hu.dwim.perec-20150608-darcs/hu.dwim.perec.sqlite.test.asd: Cannot find symbol "NON-PROPAGATING-OPERATION" in package #<"ASDF/INTERFACE" package>
(LOAD hu.dwim.perec.sqlite FAIL) needs newer ASDF, ASDF/FIND-SYSTEM:LOAD-SYSTEM-DEFINITION-ERROR : Error while trying to load definition for system hu.dwim.perec.sqlite from pathname /home/testgrid/cl-test-grid/work-dir/agent/quicklisp/dists/quicklisp/software/hu.dwim.perec-20150608-darcs/hu.dwim.perec.sqlite.asd: Cannot find symbol "NON-PROPAGATING-OPERATION" in package #<"ASDF/INTERFACE" package>
(LOAD hu.dwim.perec.postgresql.test FAIL) needs newer ASDF, ASDF/FIND-SYSTEM:LOAD-SYSTEM-DEFINITION-ERROR : Error while trying to load definition for system hu.dwim.perec.postgresql.test from pathname /home/testgrid/cl-test-grid/work-dir/agent/quicklisp/dists/quicklisp/software/hu.dwim.perec-20150608-darcs/hu.dwim.perec.postgresql.test.asd: Cannot find symbol "NON-PROPAGATING-OPERATION" in package #<"ASDF/INTERFACE" package>
(LOAD hu.dwim.perec.postgresql FAIL) needs newer ASDF, ASDF/FIND-SYSTEM:LOAD-SYSTEM-DEFINITION-ERROR : Error while trying to load definition for system hu.dwim.perec.postgresql from pathname /home/testgrid/cl-test-grid/work-dir/agent/quicklisp/dists/quicklisp/software/hu.dwim.perec-20150608-darcs/hu.dwim.perec.postgresql.asd: Cannot find symbol "NON-PROPAGATING-OPERATION" in package #<"ASDF/INTERFACE" package>
(LOAD hu.dwim.perec.oracle.test FAIL) needs newer ASDF, ASDF/FIND-SYSTEM:LOAD-SYSTEM-DEFINITION-ERROR : Error while trying to load definition for system hu.dwim.perec.oracle.test from pathname /home/testgrid/cl-test-grid/work-dir/agent/quicklisp/dists/quicklisp/software/hu.dwim.perec-20150608-darcs/hu.dwim.perec.oracle.test.asd: Cannot find symbol "NON-PROPAGATING-OPERATION" in package #<"ASDF/INTERFACE" package>
(LOAD hu.dwim.perec.oracle FAIL) needs newer ASDF, ASDF/FIND-SYSTEM:LOAD-SYSTEM-DEFINITION-ERROR : Error while trying to load definition for system hu.dwim.perec.oracle from pathname /home/testgrid/cl-test-grid/work-dir/agent/quicklisp/dists/quicklisp/software/hu.dwim.perec-20150608-darcs/hu.dwim.perec.oracle.asd: Cannot find symbol "NON-PROPAGATING-OPERATION" in package #<"ASDF/INTERFACE" package>
(LOAD hu.dwim.perec.all.test FAIL) needs newer ASDF, ASDF/FIND-SYSTEM:LOAD-SYSTEM-DEFINITION-ERROR : Error while trying to load definition for system hu.dwim.perec.all.test from pathname /home/testgrid/cl-test-grid/work-dir/agent/quicklisp/dists/quicklisp/software/hu.dwim.perec-20150608-darcs/hu.dwim.perec.all.test.asd: Cannot find symbol "NON-PROPAGATING-OPERATION" in package #<"ASDF/INTERFACE" package>
(LOAD hu.dwim.perec.all FAIL) needs newer ASDF, ASDF/FIND-SYSTEM:LOAD-SYSTEM-DEFINITION-ERROR : Error while trying to load definition for system hu.dwim.perec.all from pathname /home/testgrid/cl-test-grid/work-dir/agent/quicklisp/dists/quicklisp/software/hu.dwim.perec-20150608-darcs/hu.dwim.perec.all.asd: Cannot find symbol "NON-PROPAGATING-OPERATION" in package #<"ASDF/INTERFACE" package>
(LOAD hu.dwim.perec+swank FAIL) needs newer ASDF, ASDF/FIND-SYSTEM:LOAD-SYSTEM-DEFINITION-ERROR : Error while trying to load definition for system hu.dwim.perec+swank from pathname /home/testgrid/cl-test-grid/work-dir/agent/quicklisp/dists/quicklisp/software/hu.dwim.perec-20150608-darcs/hu.dwim.perec+swank.asd: Cannot find symbol "NON-PROPAGATING-OPERATION" in package #<"ASDF/INTERFACE" package>
(LOAD hu.dwim.perec+iolib FAIL) needs newer ASDF, ASDF/FIND-SYSTEM:LOAD-SYSTEM-DEFINITION-ERROR : Error while trying to load definition for system hu.dwim.perec+iolib from pathname /home/testgrid/cl-test-grid/work-dir/agent/quicklisp/dists/quicklisp/software/hu.dwim.perec-20150608-darcs/hu.dwim.perec+iolib.asd: Cannot find symbol "NON-PROPAGATING-OPERATION" in package #<"ASDF/INTERFACE" package>
(LOAD hu.dwim.perec+hu.dwim.quasi-quote.xml FAIL) needs newer ASDF, ASDF/FIND-SYSTEM:LOAD-SYSTEM-DEFINITION-ERROR : Error while trying to load definition for system hu.dwim.perec+hu.dwim.quasi-quote.xml from pathname /home/testgrid/cl-test-grid/work-dir/agent/quicklisp/dists/quicklisp/software/hu.dwim.perec-20150608-darcs/hu.dwim.perec+hu.dwim.quasi-quote.xml.asd: Cannot find symbol "NON-PROPAGATING-OPERATION" in package #<"ASDF/INTERFACE" package>
(LOAD hu.dwim.perec FAIL) needs newer ASDF, ASDF/FIND-SYSTEM:LOAD-SYSTEM-DEFINITION-ERROR : Error while trying to load definition for system hu.dwim.perec from pathname /home/testgrid/cl-test-grid/work-dir/agent/quicklisp/dists/quicklisp/software/hu.dwim.perec-20150608-darcs/hu.dwim.perec.asd: Cannot find symbol "NON-PROPAGATING-OPERATION" in package #<"ASDF/INTERFACE" package>
(LOAD hu.dwim.perec.test FAIL) ASDF/FIND-SYSTEM:MISSING-COMPONENT : Component "iolib/sockets" not found
(LOAD hu.dwim.perec.sqlite.test FAIL) ASDF/FIND-SYSTEM:MISSING-COMPONENT : Component "iolib/sockets" not found
(LOAD hu.dwim.perec.postgresql.test FAIL) ASDF/FIND-SYSTEM:MISSING-COMPONENT : Component "iolib/sockets" not found
(LOAD hu.dwim.perec.oracle.test FAIL) ASDF/FIND-SYSTEM:MISSING-COMPONENT : Component "iolib/sockets" not found
(LOAD hu.dwim.perec.all.test FAIL) ASDF/FIND-SYSTEM:MISSING-COMPONENT : Component "iolib/sockets" not found
(LOAD hu.dwim.perec+iolib FAIL) ASDF/FIND-SYSTEM:MISSING-COMPONENT : Component "iolib/sockets" not found
ecl-13.5.1-unknown-linux-i686-lisp-to-c
(LOAD hu.dwim.perec.test FAIL) ASDF/FIND-SYSTEM:LOAD-SYSTEM-DEFINITION-ERROR : Error while trying to load definition for system hu.dwim.perec.test from pathname /home/testgrid/cl-test-grid/work-dir/agent/quicklisp/dists/quicklisp/software/hu.dwim.perec-20150608-darcs/hu.dwim.perec.test.asd: COMPILE-FILE-ERROR while compiling #<cl-source-file "hu.dwim.asdf" "source" "package">
(LOAD hu.dwim.perec.sqlite.test FAIL) ASDF/FIND-SYSTEM:LOAD-SYSTEM-DEFINITION-ERROR : Error while trying to load definition for system hu.dwim.perec.sqlite.test from pathname /home/testgrid/cl-test-grid/work-dir/agent/quicklisp/dists/quicklisp/software/hu.dwim.perec-20150608-darcs/hu.dwim.perec.sqlite.test.asd: COMPILE-FILE-ERROR while compiling #<cl-source-file "hu.dwim.asdf" "source" "package">
(LOAD hu.dwim.perec.sqlite FAIL) ASDF/FIND-SYSTEM:LOAD-SYSTEM-DEFINITION-ERROR : Error while trying to load definition for system hu.dwim.perec.sqlite from pathname /home/testgrid/cl-test-grid/work-dir/agent/quicklisp/dists/quicklisp/software/hu.dwim.perec-20150608-darcs/hu.dwim.perec.sqlite.asd: COMPILE-FILE-ERROR while compiling #<cl-source-file "hu.dwim.asdf" "source" "package">
(LOAD hu.dwim.perec.postgresql.test FAIL) ASDF/FIND-SYSTEM:LOAD-SYSTEM-DEFINITION-ERROR : Error while trying to load definition for system hu.dwim.perec.postgresql.test from pathname /home/testgrid/cl-test-grid/work-dir/agent/quicklisp/dists/quicklisp/software/hu.dwim.perec-20150608-darcs/hu.dwim.perec.postgresql.test.asd: COMPILE-FILE-ERROR while compiling #<cl-source-file "hu.dwim.asdf" "source" "package">
(LOAD hu.dwim.perec.postgresql FAIL) ASDF/FIND-SYSTEM:LOAD-SYSTEM-DEFINITION-ERROR : Error while trying to load definition for system hu.dwim.perec.postgresql from pathname /home/testgrid/cl-test-grid/work-dir/agent/quicklisp/dists/quicklisp/software/hu.dwim.perec-20150608-darcs/hu.dwim.perec.postgresql.asd: COMPILE-FILE-ERROR while compiling #<cl-source-file "hu.dwim.asdf" "source" "package">
(LOAD hu.dwim.perec.oracle.test FAIL) ASDF/FIND-SYSTEM:LOAD-SYSTEM-DEFINITION-ERROR : Error while trying to load definition for system hu.dwim.perec.oracle.test from pathname /home/testgrid/cl-test-grid/work-dir/agent/quicklisp/dists/quicklisp/software/hu.dwim.perec-20150608-darcs/hu.dwim.perec.oracle.test.asd: COMPILE-FILE-ERROR while compiling #<cl-source-file "hu.dwim.asdf" "source" "package">
(LOAD hu.dwim.perec.oracle FAIL) ASDF/FIND-SYSTEM:LOAD-SYSTEM-DEFINITION-ERROR : Error while trying to load definition for system hu.dwim.perec.oracle from pathname /home/testgrid/cl-test-grid/work-dir/agent/quicklisp/dists/quicklisp/software/hu.dwim.perec-20150608-darcs/hu.dwim.perec.oracle.asd: COMPILE-FILE-ERROR while compiling #<cl-source-file "hu.dwim.asdf" "source" "package">
(LOAD hu.dwim.perec.all.test FAIL) ASDF/FIND-SYSTEM:LOAD-SYSTEM-DEFINITION-ERROR : Error while trying to load definition for system hu.dwim.perec.all.test from pathname /home/testgrid/cl-test-grid/work-dir/agent/quicklisp/dists/quicklisp/software/hu.dwim.perec-20150608-darcs/hu.dwim.perec.all.test.asd: COMPILE-FILE-ERROR while compiling #<cl-source-file "hu.dwim.asdf" "source" "package">
(LOAD hu.dwim.perec.all FAIL) ASDF/FIND-SYSTEM:LOAD-SYSTEM-DEFINITION-ERROR : Error while trying to load definition for system hu.dwim.perec.all from pathname /home/testgrid/cl-test-grid/work-dir/agent/quicklisp/dists/quicklisp/software/hu.dwim.perec-20150608-darcs/hu.dwim.perec.all.asd: COMPILE-FILE-ERROR while compiling #<cl-source-file "hu.dwim.asdf" "source" "package">
(LOAD hu.dwim.perec+swank FAIL) ASDF/FIND-SYSTEM:LOAD-SYSTEM-DEFINITION-ERROR : Error while trying to load definition for system hu.dwim.perec+swank from pathname /home/testgrid/cl-test-grid/work-dir/agent/quicklisp/dists/quicklisp/software/hu.dwim.perec-20150608-darcs/hu.dwim.perec+swank.asd: COMPILE-FILE-ERROR while compiling #<cl-source-file "hu.dwim.asdf" "source" "package">
(LOAD hu.dwim.perec+iolib FAIL) ASDF/FIND-SYSTEM:LOAD-SYSTEM-DEFINITION-ERROR : Error while trying to load definition for system hu.dwim.perec+iolib from pathname /home/testgrid/cl-test-grid/work-dir/agent/quicklisp/dists/quicklisp/software/hu.dwim.perec-20150608-darcs/hu.dwim.perec+iolib.asd: COMPILE-FILE-ERROR while compiling #<cl-source-file "hu.dwim.asdf" "source" "package">
(LOAD hu.dwim.perec+hu.dwim.quasi-quote.xml FAIL) ASDF/FIND-SYSTEM:LOAD-SYSTEM-DEFINITION-ERROR : Error while trying to load definition for system hu.dwim.perec+hu.dwim.quasi-quote.xml from pathname /home/testgrid/cl-test-grid/work-dir/agent/quicklisp/dists/quicklisp/software/hu.dwim.perec-20150608-darcs/hu.dwim.perec+hu.dwim.quasi-quote.xml.asd: COMPILE-FILE-ERROR while compiling #<cl-source-file "hu.dwim.asdf" "source" "package">
(LOAD hu.dwim.perec FAIL) ASDF/FIND-SYSTEM:LOAD-SYSTEM-DEFINITION-ERROR : Error while trying to load definition for system hu.dwim.perec from pathname /home/testgrid/cl-test-grid/work-dir/agent/quicklisp/dists/quicklisp/software/hu.dwim.perec-20150608-darcs/hu.dwim.perec.asd: COMPILE-FILE-ERROR while compiling #<cl-source-file "hu.dwim.asdf" "source" "package">
(LOAD hu.dwim.perec.test FAIL) ASDF/FIND-SYSTEM:MISSING-COMPONENT : Component "iolib/sockets" not found
(LOAD hu.dwim.perec.sqlite.test FAIL) ASDF/FIND-SYSTEM:MISSING-COMPONENT : Component "iolib/sockets" not found
(LOAD hu.dwim.perec.sqlite FAIL) UIOP/LISP-BUILD:COMPILE-FILE-ERROR : COMPILE-FILE-ERROR while compiling #<hu.dwim.cl-source-file "hu.dwim.walker" "source" "infrastructure">
(LOAD hu.dwim.perec.postgresql.test FAIL) ASDF/FIND-SYSTEM:MISSING-COMPONENT : Component "iolib/sockets" not found
(LOAD hu.dwim.perec.postgresql FAIL) UIOP/LISP-BUILD:COMPILE-FILE-ERROR : COMPILE-FILE-ERROR while compiling #<hu.dwim.cl-source-file "hu.dwim.walker" "source" "infrastructure">
(LOAD hu.dwim.perec.oracle.test FAIL) ASDF/FIND-SYSTEM:MISSING-COMPONENT : Component "iolib/sockets" not found
(LOAD hu.dwim.perec.oracle FAIL) UIOP/LISP-BUILD:COMPILE-FILE-ERROR : COMPILE-FILE-ERROR while compiling #<hu.dwim.cl-source-file "hu.dwim.walker" "source" "infrastructure">
(LOAD hu.dwim.perec.all.test FAIL) ASDF/FIND-SYSTEM:MISSING-COMPONENT : Component "iolib/sockets" not found
(LOAD hu.dwim.perec.all FAIL) UIOP/LISP-BUILD:COMPILE-FILE-ERROR : COMPILE-FILE-ERROR while compiling #<hu.dwim.cl-source-file "hu.dwim.walker" "source" "infrastructure">
(LOAD hu.dwim.perec+swank FAIL) UIOP/LISP-BUILD:COMPILE-FILE-ERROR : COMPILE-FILE-ERROR while compiling #<hu.dwim.cl-source-file "hu.dwim.walker" "source" "infrastructure">
(LOAD hu.dwim.perec+iolib FAIL) ASDF/FIND-SYSTEM:MISSING-COMPONENT : Component "iolib/sockets" not found
(LOAD hu.dwim.perec+hu.dwim.quasi-quote.xml FAIL) UIOP/LISP-BUILD:COMPILE-FILE-ERROR : COMPILE-FILE-ERROR while compiling #<hu.dwim.cl-source-file "hu.dwim.walker" "source" "infrastructure">
(LOAD hu.dwim.perec FAIL) UIOP/LISP-BUILD:COMPILE-FILE-ERROR : COMPILE-FILE-ERROR while compiling #<hu.dwim.cl-source-file "hu.dwim.walker" "source" "infrastructure">
ecl-15.2.21-ee989b97-linux-i686-bytecode
(LOAD hu.dwim.perec.test FAIL) ASDF/FIND-SYSTEM:LOAD-SYSTEM-DEFINITION-ERROR : Error while trying to load definition for system iolib from pathname /home/testgrid/cl-test-grid/work-dir/agent/quicklisp/dists/quicklisp/software/iolib-20150302-git/iolib.asd: The variable C::*CC-FLAGS* is unbound.
(LOAD hu.dwim.perec.sqlite.test FAIL) ASDF/FIND-SYSTEM:LOAD-SYSTEM-DEFINITION-ERROR : Error while trying to load definition for system iolib from pathname /home/testgrid/cl-test-grid/work-dir/agent/quicklisp/dists/quicklisp/software/iolib-20150302-git/iolib.asd: The variable C::*CC-FLAGS* is unbound.
(LOAD hu.dwim.perec.sqlite FAIL) COMMON-LISP:UNDEFINED-FUNCTION : The function C::CMP-ENV-ROOT is undefined.
(LOAD hu.dwim.perec.postgresql.test FAIL) ASDF/FIND-SYSTEM:LOAD-SYSTEM-DEFINITION-ERROR : Error while trying to load definition for system iolib from pathname /home/testgrid/cl-test-grid/work-dir/agent/quicklisp/dists/quicklisp/software/iolib-20150302-git/iolib.asd: The variable C::*CC-FLAGS* is unbound.
(LOAD hu.dwim.perec.postgresql FAIL) COMMON-LISP:UNDEFINED-FUNCTION : The function C::CMP-ENV-ROOT is undefined.
(LOAD hu.dwim.perec.oracle.test FAIL) ASDF/FIND-SYSTEM:LOAD-SYSTEM-DEFINITION-ERROR : Error while trying to load definition for system iolib from pathname /home/testgrid/cl-test-grid/work-dir/agent/quicklisp/dists/quicklisp/software/iolib-20150302-git/iolib.asd: The variable C::*CC-FLAGS* is unbound.
(LOAD hu.dwim.perec.oracle FAIL) COMMON-LISP:UNDEFINED-FUNCTION : The function C::CMP-ENV-ROOT is undefined.
(LOAD hu.dwim.perec.all.test FAIL) ASDF/FIND-SYSTEM:LOAD-SYSTEM-DEFINITION-ERROR : Error while trying to load definition for system iolib from pathname /home/testgrid/cl-test-grid/work-dir/agent/quicklisp/dists/quicklisp/software/iolib-20150302-git/iolib.asd: The variable C::*CC-FLAGS* is unbound.
(LOAD hu.dwim.perec.all FAIL) COMMON-LISP:UNDEFINED-FUNCTION : The function C::CMP-ENV-ROOT is undefined.
(LOAD hu.dwim.perec+swank FAIL) COMMON-LISP:UNDEFINED-FUNCTION : The function C::CMP-ENV-ROOT is undefined.
(LOAD hu.dwim.perec+iolib FAIL) ASDF/FIND-SYSTEM:LOAD-SYSTEM-DEFINITION-ERROR : Error while trying to load definition for system iolib from pathname /home/testgrid/cl-test-grid/work-dir/agent/quicklisp/dists/quicklisp/software/iolib-20150302-git/iolib.asd: The variable C::*CC-FLAGS* is unbound.
(LOAD hu.dwim.perec+hu.dwim.quasi-quote.xml FAIL) COMMON-LISP:UNDEFINED-FUNCTION : The function C::CMP-ENV-ROOT is undefined.
(LOAD hu.dwim.perec FAIL) COMMON-LISP:UNDEFINED-FUNCTION : The function C::CMP-ENV-ROOT is undefined.
(LOAD hu.dwim.perec.test FAIL) ASDF/FIND-SYSTEM:LOAD-SYSTEM-DEFINITION-ERROR : Error while trying to load definition for system iolib from pathname /home/testgrid/cl-test-grid/work-dir/agent/quicklisp/dists/quicklisp/software/iolib-20150302-git/iolib.asd: The variable C::*CC-FLAGS* is unbound.
(LOAD hu.dwim.perec.sqlite.test FAIL) ASDF/FIND-SYSTEM:LOAD-SYSTEM-DEFINITION-ERROR : Error while trying to load definition for system iolib from pathname /home/testgrid/cl-test-grid/work-dir/agent/quicklisp/dists/quicklisp/software/iolib-20150302-git/iolib.asd: The variable C::*CC-FLAGS* is unbound.
(LOAD hu.dwim.perec.postgresql.test FAIL) ASDF/FIND-SYSTEM:LOAD-SYSTEM-DEFINITION-ERROR : Error while trying to load definition for system iolib from pathname /home/testgrid/cl-test-grid/work-dir/agent/quicklisp/dists/quicklisp/software/iolib-20150302-git/iolib.asd: The variable C::*CC-FLAGS* is unbound.
(LOAD hu.dwim.perec.oracle.test FAIL) ASDF/FIND-SYSTEM:LOAD-SYSTEM-DEFINITION-ERROR : Error while trying to load definition for system iolib from pathname /home/testgrid/cl-test-grid/work-dir/agent/quicklisp/dists/quicklisp/software/iolib-20150302-git/iolib.asd: The variable C::*CC-FLAGS* is unbound.
(LOAD hu.dwim.perec.all.test FAIL) ASDF/FIND-SYSTEM:LOAD-SYSTEM-DEFINITION-ERROR : Error while trying to load definition for system iolib from pathname /home/testgrid/cl-test-grid/work-dir/agent/quicklisp/dists/quicklisp/software/iolib-20150302-git/iolib.asd: The variable C::*CC-FLAGS* is unbound.
(LOAD hu.dwim.perec+iolib FAIL) ASDF/FIND-SYSTEM:LOAD-SYSTEM-DEFINITION-ERROR : Error while trying to load definition for system iolib from pathname /home/testgrid/cl-test-grid/work-dir/agent/quicklisp/dists/quicklisp/software/iolib-20150302-git/iolib.asd: The variable C::*CC-FLAGS* is unbound.
ecl-15.2.21-ee989b97-linux-i686-lisp-to-c
(LOAD hu.dwim.perec.test FAIL) ASDF/FIND-SYSTEM:LOAD-SYSTEM-DEFINITION-ERROR : Error while trying to load definition for system iolib from pathname /home/testgrid/cl-test-grid/work-dir/agent/quicklisp/dists/quicklisp/software/iolib-20150302-git/iolib.asd: COMPILE-FILE-ERROR while compiling #<cl-source-file "alexandria" "macros">
(LOAD hu.dwim.perec.sqlite.test FAIL) ASDF/FIND-SYSTEM:LOAD-SYSTEM-DEFINITION-ERROR : Error while trying to load definition for system iolib from pathname /home/testgrid/cl-test-grid/work-dir/agent/quicklisp/dists/quicklisp/software/iolib-20150302-git/iolib.asd: COMPILE-FILE-ERROR while compiling #<cl-source-file "alexandria" "macros">
(LOAD hu.dwim.perec.sqlite FAIL) UIOP/LISP-BUILD:COMPILE-FILE-ERROR : COMPILE-FILE-ERROR while compiling #<cl-source-file "alexandria" "macros">
(LOAD hu.dwim.perec.postgresql.test FAIL) ASDF/FIND-SYSTEM:LOAD-SYSTEM-DEFINITION-ERROR : Error while trying to load definition for system iolib from pathname /home/testgrid/cl-test-grid/work-dir/agent/quicklisp/dists/quicklisp/software/iolib-20150302-git/iolib.asd: COMPILE-FILE-ERROR while compiling #<cl-source-file "alexandria" "macros">
(LOAD hu.dwim.perec.postgresql FAIL) UIOP/LISP-BUILD:COMPILE-FILE-ERROR : COMPILE-FILE-ERROR while compiling #<cl-source-file "alexandria" "macros">
(LOAD hu.dwim.perec.oracle.test FAIL) ASDF/FIND-SYSTEM:LOAD-SYSTEM-DEFINITION-ERROR : Error while trying to load definition for system iolib from pathname /home/testgrid/cl-test-grid/work-dir/agent/quicklisp/dists/quicklisp/software/iolib-20150302-git/iolib.asd: COMPILE-FILE-ERROR while compiling #<cl-source-file "alexandria" "macros">
(LOAD hu.dwim.perec.oracle FAIL) UIOP/LISP-BUILD:COMPILE-FILE-ERROR : COMPILE-FILE-ERROR while compiling #<cl-source-file "alexandria" "macros">
(LOAD hu.dwim.perec.all.test FAIL) ASDF/FIND-SYSTEM:LOAD-SYSTEM-DEFINITION-ERROR : Error while trying to load definition for system iolib from pathname /home/testgrid/cl-test-grid/work-dir/agent/quicklisp/dists/quicklisp/software/iolib-20150302-git/iolib.asd: COMPILE-FILE-ERROR while compiling #<cl-source-file "alexandria" "macros">
(LOAD hu.dwim.perec.all FAIL) UIOP/LISP-BUILD:COMPILE-FILE-ERROR : COMPILE-FILE-ERROR while compiling #<cl-source-file "alexandria" "macros">
(LOAD hu.dwim.perec+swank FAIL) UIOP/LISP-BUILD:COMPILE-FILE-ERROR : COMPILE-FILE-ERROR while compiling #<cl-source-file "alexandria" "macros">
(LOAD hu.dwim.perec+iolib FAIL) ASDF/FIND-SYSTEM:LOAD-SYSTEM-DEFINITION-ERROR : Error while trying to load definition for system iolib from pathname /home/testgrid/cl-test-grid/work-dir/agent/quicklisp/dists/quicklisp/software/iolib-20150302-git/iolib.asd: COMPILE-FILE-ERROR while compiling #<cl-source-file "alexandria" "macros">
(LOAD hu.dwim.perec+hu.dwim.quasi-quote.xml FAIL) UIOP/LISP-BUILD:COMPILE-FILE-ERROR : COMPILE-FILE-ERROR while compiling #<cl-source-file "alexandria" "macros">
(LOAD hu.dwim.perec FAIL) UIOP/LISP-BUILD:COMPILE-FILE-ERROR : COMPILE-FILE-ERROR while compiling #<cl-source-file "alexandria" "macros">
(LOAD hu.dwim.perec.test FAIL) UIOP/LISP-BUILD:COMPILE-FILE-ERROR : COMPILE-FILE-ERROR while compiling #<hu.dwim.cl-source-file "hu.dwim.walker" "source" "infrastructure">
(LOAD hu.dwim.perec.sqlite.test FAIL) UIOP/LISP-BUILD:COMPILE-FILE-ERROR : COMPILE-FILE-ERROR while compiling #<hu.dwim.cl-source-file "hu.dwim.walker" "source" "infrastructure">
(LOAD hu.dwim.perec.sqlite FAIL) UIOP/LISP-BUILD:COMPILE-FILE-ERROR : COMPILE-FILE-ERROR while compiling #<hu.dwim.cl-source-file "hu.dwim.walker" "source" "infrastructure">
(LOAD hu.dwim.perec.postgresql.test FAIL) UIOP/LISP-BUILD:COMPILE-FILE-ERROR : COMPILE-FILE-ERROR while compiling #<hu.dwim.cl-source-file "hu.dwim.walker" "source" "infrastructure">
(LOAD hu.dwim.perec.postgresql FAIL) UIOP/LISP-BUILD:COMPILE-FILE-ERROR : COMPILE-FILE-ERROR while compiling #<hu.dwim.cl-source-file "hu.dwim.walker" "source" "infrastructure">
(LOAD hu.dwim.perec.oracle.test FAIL) UIOP/LISP-BUILD:COMPILE-FILE-ERROR : COMPILE-FILE-ERROR while compiling #<hu.dwim.cl-source-file "hu.dwim.walker" "source" "infrastructure">
(LOAD hu.dwim.perec.oracle FAIL) UIOP/LISP-BUILD:COMPILE-FILE-ERROR : COMPILE-FILE-ERROR while compiling #<hu.dwim.cl-source-file "hu.dwim.walker" "source" "infrastructure">
(LOAD hu.dwim.perec.all.test FAIL) UIOP/LISP-BUILD:COMPILE-FILE-ERROR : COMPILE-FILE-ERROR while compiling #<hu.dwim.cl-source-file "hu.dwim.walker" "source" "infrastructure">
(LOAD hu.dwim.perec.all FAIL) UIOP/LISP-BUILD:COMPILE-FILE-ERROR : COMPILE-FILE-ERROR while compiling #<hu.dwim.cl-source-file "hu.dwim.walker" "source" "infrastructure">
(LOAD hu.dwim.perec+swank FAIL) UIOP/LISP-BUILD:COMPILE-FILE-ERROR : COMPILE-FILE-ERROR while compiling #<hu.dwim.cl-source-file "hu.dwim.walker" "source" "infrastructure">
(LOAD hu.dwim.perec+iolib FAIL) UIOP/LISP-BUILD:COMPILE-FILE-ERROR : COMPILE-FILE-ERROR while compiling #<hu.dwim.cl-source-file "hu.dwim.walker" "source" "infrastructure">
(LOAD hu.dwim.perec+hu.dwim.quasi-quote.xml FAIL) UIOP/LISP-BUILD:COMPILE-FILE-ERROR : COMPILE-FILE-ERROR while compiling #<hu.dwim.cl-source-file "hu.dwim.walker" "source" "infrastructure">
(LOAD hu.dwim.perec FAIL) UIOP/LISP-BUILD:COMPILE-FILE-ERROR : COMPILE-FILE-ERROR while compiling #<hu.dwim.cl-source-file "hu.dwim.walker" "source" "infrastructure">
ecl-15.2.21-ee989b97-linux-x64-bytecode
(LOAD hu.dwim.perec.test FAIL) ASDF/FIND-SYSTEM:LOAD-SYSTEM-DEFINITION-ERROR : Error while trying to load definition for system iolib from pathname /home/hijarian/systems/cl-test-grid/work-dir/agent/quicklisp/dists/quicklisp/software/iolib-20150302-git/iolib.asd: The variable C::*CC-FLAGS* is unbound.
(LOAD hu.dwim.perec.sqlite.test FAIL) ASDF/FIND-SYSTEM:LOAD-SYSTEM-DEFINITION-ERROR : Error while trying to load definition for system iolib from pathname /home/hijarian/systems/cl-test-grid/work-dir/agent/quicklisp/dists/quicklisp/software/iolib-20150302-git/iolib.asd: The variable C::*CC-FLAGS* is unbound.
(LOAD hu.dwim.perec.sqlite FAIL) COMMON-LISP:UNDEFINED-FUNCTION : The function C::CMP-ENV-ROOT is undefined.
(LOAD hu.dwim.perec.postgresql.test FAIL) ASDF/FIND-SYSTEM:LOAD-SYSTEM-DEFINITION-ERROR : Error while trying to load definition for system iolib from pathname /home/hijarian/systems/cl-test-grid/work-dir/agent/quicklisp/dists/quicklisp/software/iolib-20150302-git/iolib.asd: The variable C::*CC-FLAGS* is unbound.
(LOAD hu.dwim.perec.postgresql FAIL) COMMON-LISP:UNDEFINED-FUNCTION : The function C::CMP-ENV-ROOT is undefined.
(LOAD hu.dwim.perec.oracle.test FAIL) ASDF/FIND-SYSTEM:LOAD-SYSTEM-DEFINITION-ERROR : Error while trying to load definition for system iolib from pathname /home/hijarian/systems/cl-test-grid/work-dir/agent/quicklisp/dists/quicklisp/software/iolib-20150302-git/iolib.asd: The variable C::*CC-FLAGS* is unbound.
(LOAD hu.dwim.perec.oracle FAIL) COMMON-LISP:UNDEFINED-FUNCTION : The function C::CMP-ENV-ROOT is undefined.
(LOAD hu.dwim.perec.all.test FAIL) ASDF/FIND-SYSTEM:LOAD-SYSTEM-DEFINITION-ERROR : Error while trying to load definition for system iolib from pathname /home/hijarian/systems/cl-test-grid/work-dir/agent/quicklisp/dists/quicklisp/software/iolib-20150302-git/iolib.asd: The variable C::*CC-FLAGS* is unbound.
(LOAD hu.dwim.perec.all FAIL) COMMON-LISP:UNDEFINED-FUNCTION : The function C::CMP-ENV-ROOT is undefined.
(LOAD hu.dwim.perec+swank FAIL) COMMON-LISP:UNDEFINED-FUNCTION : The function C::CMP-ENV-ROOT is undefined.
(LOAD hu.dwim.perec+iolib FAIL) ASDF/FIND-SYSTEM:LOAD-SYSTEM-DEFINITION-ERROR : Error while trying to load definition for system iolib from pathname /home/hijarian/systems/cl-test-grid/work-dir/agent/quicklisp/dists/quicklisp/software/iolib-20150302-git/iolib.asd: The variable C::*CC-FLAGS* is unbound.
(LOAD hu.dwim.perec+hu.dwim.quasi-quote.xml FAIL) COMMON-LISP:UNDEFINED-FUNCTION : The function C::CMP-ENV-ROOT is undefined.
(LOAD hu.dwim.perec FAIL) COMMON-LISP:UNDEFINED-FUNCTION : The function C::CMP-ENV-ROOT is undefined.
(LOAD hu.dwim.perec.test FAIL) ASDF/FIND-SYSTEM:LOAD-SYSTEM-DEFINITION-ERROR : Error while trying to load definition for system iolib from pathname /home/hijarian/systems/cl-test-grid/work-dir/agent/quicklisp/dists/quicklisp/software/iolib-20150302-git/iolib.asd: The variable C::*CC-FLAGS* is unbound.
(LOAD hu.dwim.perec.sqlite.test FAIL) ASDF/FIND-SYSTEM:LOAD-SYSTEM-DEFINITION-ERROR : Error while trying to load definition for system iolib from pathname /home/hijarian/systems/cl-test-grid/work-dir/agent/quicklisp/dists/quicklisp/software/iolib-20150302-git/iolib.asd: The variable C::*CC-FLAGS* is unbound.
(LOAD hu.dwim.perec.postgresql.test FAIL) ASDF/FIND-SYSTEM:LOAD-SYSTEM-DEFINITION-ERROR : Error while trying to load definition for system iolib from pathname /home/hijarian/systems/cl-test-grid/work-dir/agent/quicklisp/dists/quicklisp/software/iolib-20150302-git/iolib.asd: The variable C::*CC-FLAGS* is unbound.
(LOAD hu.dwim.perec.oracle.test FAIL) ASDF/FIND-SYSTEM:LOAD-SYSTEM-DEFINITION-ERROR : Error while trying to load definition for system iolib from pathname /home/hijarian/systems/cl-test-grid/work-dir/agent/quicklisp/dists/quicklisp/software/iolib-20150302-git/iolib.asd: The variable C::*CC-FLAGS* is unbound.
(LOAD hu.dwim.perec.all.test FAIL) ASDF/FIND-SYSTEM:LOAD-SYSTEM-DEFINITION-ERROR : Error while trying to load definition for system iolib from pathname /home/hijarian/systems/cl-test-grid/work-dir/agent/quicklisp/dists/quicklisp/software/iolib-20150302-git/iolib.asd: The variable C::*CC-FLAGS* is unbound.
(LOAD hu.dwim.perec+iolib FAIL) ASDF/FIND-SYSTEM:LOAD-SYSTEM-DEFINITION-ERROR : Error while trying to load definition for system iolib from pathname /home/hijarian/systems/cl-test-grid/work-dir/agent/quicklisp/dists/quicklisp/software/iolib-20150302-git/iolib.asd: The variable C::*CC-FLAGS* is unbound.
ecl-15.2.21-ee989b97-linux-x64-lisp-to-c
(LOAD hu.dwim.perec.test FAIL) ASDF/FIND-SYSTEM:LOAD-SYSTEM-DEFINITION-ERROR : Error while trying to load definition for system iolib from pathname /home/hijarian/systems/cl-test-grid/work-dir/agent/quicklisp/dists/quicklisp/software/iolib-20150302-git/iolib.asd: COMPILE-FILE-ERROR while compiling #<cl-source-file "alexandria" "macros">
(LOAD hu.dwim.perec.sqlite.test FAIL) ASDF/FIND-SYSTEM:LOAD-SYSTEM-DEFINITION-ERROR : Error while trying to load definition for system iolib from pathname /home/hijarian/systems/cl-test-grid/work-dir/agent/quicklisp/dists/quicklisp/software/iolib-20150302-git/iolib.asd: COMPILE-FILE-ERROR while compiling #<cl-source-file "alexandria" "macros">
(LOAD hu.dwim.perec.sqlite FAIL) UIOP/LISP-BUILD:COMPILE-FILE-ERROR : COMPILE-FILE-ERROR while compiling #<cl-source-file "alexandria" "macros">
(LOAD hu.dwim.perec.postgresql.test FAIL) ASDF/FIND-SYSTEM:LOAD-SYSTEM-DEFINITION-ERROR : Error while trying to load definition for system iolib from pathname /home/hijarian/systems/cl-test-grid/work-dir/agent/quicklisp/dists/quicklisp/software/iolib-20150302-git/iolib.asd: COMPILE-FILE-ERROR while compiling #<cl-source-file "alexandria" "macros">
(LOAD hu.dwim.perec.postgresql FAIL) UIOP/LISP-BUILD:COMPILE-FILE-ERROR : COMPILE-FILE-ERROR while compiling #<cl-source-file "alexandria" "macros">
(LOAD hu.dwim.perec.oracle.test FAIL) ASDF/FIND-SYSTEM:LOAD-SYSTEM-DEFINITION-ERROR : Error while trying to load definition for system iolib from pathname /home/hijarian/systems/cl-test-grid/work-dir/agent/quicklisp/dists/quicklisp/software/iolib-20150302-git/iolib.asd: COMPILE-FILE-ERROR while compiling #<cl-source-file "alexandria" "macros">
(LOAD hu.dwim.perec.oracle FAIL) UIOP/LISP-BUILD:COMPILE-FILE-ERROR : COMPILE-FILE-ERROR while compiling #<cl-source-file "alexandria" "macros">
(LOAD hu.dwim.perec.all.test FAIL) ASDF/FIND-SYSTEM:LOAD-SYSTEM-DEFINITION-ERROR : Error while trying to load definition for system iolib from pathname /home/hijarian/systems/cl-test-grid/work-dir/agent/quicklisp/dists/quicklisp/software/iolib-20150302-git/iolib.asd: COMPILE-FILE-ERROR while compiling #<cl-source-file "alexandria" "macros">
(LOAD hu.dwim.perec.all FAIL) UIOP/LISP-BUILD:COMPILE-FILE-ERROR : COMPILE-FILE-ERROR while compiling #<cl-source-file "alexandria" "macros">
(LOAD hu.dwim.perec+swank FAIL) UIOP/LISP-BUILD:COMPILE-FILE-ERROR : COMPILE-FILE-ERROR while compiling #<cl-source-file "alexandria" "macros">
(LOAD hu.dwim.perec+iolib FAIL) ASDF/FIND-SYSTEM:LOAD-SYSTEM-DEFINITION-ERROR : Error while trying to load definition for system iolib from pathname /home/hijarian/systems/cl-test-grid/work-dir/agent/quicklisp/dists/quicklisp/software/iolib-20150302-git/iolib.asd: COMPILE-FILE-ERROR while compiling #<cl-source-file "alexandria" "macros">
(LOAD hu.dwim.perec+hu.dwim.quasi-quote.xml FAIL) UIOP/LISP-BUILD:COMPILE-FILE-ERROR : COMPILE-FILE-ERROR while compiling #<cl-source-file "alexandria" "macros">
(LOAD hu.dwim.perec FAIL) UIOP/LISP-BUILD:COMPILE-FILE-ERROR : COMPILE-FILE-ERROR while compiling #<cl-source-file "alexandria" "macros">
(LOAD hu.dwim.perec.test FAIL) UIOP/LISP-BUILD:COMPILE-FILE-ERROR : COMPILE-FILE-ERROR while compiling #<hu.dwim.cl-source-file "hu.dwim.walker" "source" "infrastructure">
(LOAD hu.dwim.perec.sqlite.test FAIL) UIOP/LISP-BUILD:COMPILE-FILE-ERROR : COMPILE-FILE-ERROR while compiling #<hu.dwim.cl-source-file "hu.dwim.walker" "source" "infrastructure">
(LOAD hu.dwim.perec.sqlite FAIL) UIOP/LISP-BUILD:COMPILE-FILE-ERROR : COMPILE-FILE-ERROR while compiling #<hu.dwim.cl-source-file "hu.dwim.walker" "source" "infrastructure">
(LOAD hu.dwim.perec.postgresql.test FAIL) UIOP/LISP-BUILD:COMPILE-FILE-ERROR : COMPILE-FILE-ERROR while compiling #<hu.dwim.cl-source-file "hu.dwim.walker" "source" "infrastructure">
(LOAD hu.dwim.perec.postgresql FAIL) UIOP/LISP-BUILD:COMPILE-FILE-ERROR : COMPILE-FILE-ERROR while compiling #<hu.dwim.cl-source-file "hu.dwim.walker" "source" "infrastructure">
(LOAD hu.dwim.perec.oracle.test FAIL) UIOP/LISP-BUILD:COMPILE-FILE-ERROR : COMPILE-FILE-ERROR while compiling #<hu.dwim.cl-source-file "hu.dwim.walker" "source" "infrastructure">
(LOAD hu.dwim.perec.oracle FAIL) UIOP/LISP-BUILD:COMPILE-FILE-ERROR : COMPILE-FILE-ERROR while compiling #<hu.dwim.cl-source-file "hu.dwim.walker" "source" "infrastructure">
(LOAD hu.dwim.perec.all.test FAIL) UIOP/LISP-BUILD:COMPILE-FILE-ERROR : COMPILE-FILE-ERROR while compiling #<hu.dwim.cl-source-file "hu.dwim.walker" "source" "infrastructure">
(LOAD hu.dwim.perec.all FAIL) UIOP/LISP-BUILD:COMPILE-FILE-ERROR : COMPILE-FILE-ERROR while compiling #<hu.dwim.cl-source-file "hu.dwim.walker" "source" "infrastructure">
(LOAD hu.dwim.perec+swank FAIL) UIOP/LISP-BUILD:COMPILE-FILE-ERROR : COMPILE-FILE-ERROR while compiling #<hu.dwim.cl-source-file "hu.dwim.walker" "source" "infrastructure">
(LOAD hu.dwim.perec+iolib FAIL) UIOP/LISP-BUILD:COMPILE-FILE-ERROR : COMPILE-FILE-ERROR while compiling #<hu.dwim.cl-source-file "hu.dwim.walker" "source" "infrastructure">
(LOAD hu.dwim.perec+hu.dwim.quasi-quote.xml FAIL) UIOP/LISP-BUILD:COMPILE-FILE-ERROR : COMPILE-FILE-ERROR while compiling #<hu.dwim.cl-source-file "hu.dwim.walker" "source" "infrastructure">
(LOAD hu.dwim.perec FAIL) UIOP/LISP-BUILD:COMPILE-FILE-ERROR : COMPILE-FILE-ERROR while compiling #<hu.dwim.cl-source-file "hu.dwim.walker" "source" "infrastructure">
ecl-15.3.7-827d3035-linux-x64-lisp-to-c
(LOAD hu.dwim.perec.test FAIL) UIOP/LISP-BUILD:COMPILE-FILE-ERROR : COMPILE-FILE-ERROR while compiling #<hu.dwim.cl-source-file "hu.dwim.walker" "source" "infrastructure">
(LOAD hu.dwim.perec.sqlite.test FAIL) UIOP/LISP-BUILD:COMPILE-FILE-ERROR : COMPILE-FILE-ERROR while compiling #<hu.dwim.cl-source-file "hu.dwim.walker" "source" "infrastructure">
(LOAD hu.dwim.perec.sqlite FAIL) UIOP/LISP-BUILD:COMPILE-FILE-ERROR : COMPILE-FILE-ERROR while compiling #<hu.dwim.cl-source-file "hu.dwim.walker" "source" "infrastructure">
(LOAD hu.dwim.perec.postgresql.test FAIL) UIOP/LISP-BUILD:COMPILE-FILE-ERROR : COMPILE-FILE-ERROR while compiling #<hu.dwim.cl-source-file "hu.dwim.walker" "source" "infrastructure">
(LOAD hu.dwim.perec.postgresql FAIL) UIOP/LISP-BUILD:COMPILE-FILE-ERROR : COMPILE-FILE-ERROR while compiling #<hu.dwim.cl-source-file "hu.dwim.walker" "source" "infrastructure">
(LOAD hu.dwim.perec.oracle.test FAIL) UIOP/LISP-BUILD:COMPILE-FILE-ERROR : COMPILE-FILE-ERROR while compiling #<hu.dwim.cl-source-file "hu.dwim.walker" "source" "infrastructure">
(LOAD hu.dwim.perec.oracle FAIL) UIOP/LISP-BUILD:COMPILE-FILE-ERROR : COMPILE-FILE-ERROR while compiling #<hu.dwim.cl-source-file "hu.dwim.walker" "source" "infrastructure">
(LOAD hu.dwim.perec.all.test FAIL) UIOP/LISP-BUILD:COMPILE-FILE-ERROR : COMPILE-FILE-ERROR while compiling #<hu.dwim.cl-source-file "hu.dwim.walker" "source" "infrastructure">
(LOAD hu.dwim.perec.all FAIL) UIOP/LISP-BUILD:COMPILE-FILE-ERROR : COMPILE-FILE-ERROR while compiling #<hu.dwim.cl-source-file "hu.dwim.walker" "source" "infrastructure">
(LOAD hu.dwim.perec+swank FAIL) UIOP/LISP-BUILD:COMPILE-FILE-ERROR : COMPILE-FILE-ERROR while compiling #<hu.dwim.cl-source-file "hu.dwim.walker" "source" "infrastructure">
(LOAD hu.dwim.perec+iolib FAIL) UIOP/LISP-BUILD:COMPILE-FILE-ERROR : COMPILE-FILE-ERROR while compiling #<hu.dwim.cl-source-file "hu.dwim.walker" "source" "infrastructure">
(LOAD hu.dwim.perec+hu.dwim.quasi-quote.xml FAIL) UIOP/LISP-BUILD:COMPILE-FILE-ERROR : COMPILE-FILE-ERROR while compiling #<hu.dwim.cl-source-file "hu.dwim.walker" "source" "infrastructure">
(LOAD hu.dwim.perec FAIL) UIOP/LISP-BUILD:COMPILE-FILE-ERROR : COMPILE-FILE-ERROR while compiling #<hu.dwim.cl-source-file "hu.dwim.walker" "source" "infrastructure">
(LOAD hu.dwim.perec.test FAIL) UIOP/LISP-BUILD:COMPILE-FILE-ERROR : COMPILE-FILE-ERROR while compiling #<hu.dwim.cl-source-file "hu.dwim.walker" "source" "infrastructure">
(LOAD hu.dwim.perec.sqlite.test FAIL) UIOP/LISP-BUILD:COMPILE-FILE-ERROR : COMPILE-FILE-ERROR while compiling #<hu.dwim.cl-source-file "hu.dwim.walker" "source" "infrastructure">
(LOAD hu.dwim.perec.sqlite FAIL) UIOP/LISP-BUILD:COMPILE-FILE-ERROR : COMPILE-FILE-ERROR while compiling #<hu.dwim.cl-source-file "hu.dwim.walker" "source" "infrastructure">
(LOAD hu.dwim.perec.postgresql.test FAIL) UIOP/LISP-BUILD:COMPILE-FILE-ERROR : COMPILE-FILE-ERROR while compiling #<hu.dwim.cl-source-file "hu.dwim.walker" "source" "infrastructure">
(LOAD hu.dwim.perec.postgresql FAIL) UIOP/LISP-BUILD:COMPILE-FILE-ERROR : COMPILE-FILE-ERROR while compiling #<hu.dwim.cl-source-file "hu.dwim.walker" "source" "infrastructure">
(LOAD hu.dwim.perec.oracle.test FAIL) UIOP/LISP-BUILD:COMPILE-FILE-ERROR : COMPILE-FILE-ERROR while compiling #<hu.dwim.cl-source-file "hu.dwim.walker" "source" "infrastructure">
(LOAD hu.dwim.perec.oracle FAIL) UIOP/LISP-BUILD:COMPILE-FILE-ERROR : COMPILE-FILE-ERROR while compiling #<hu.dwim.cl-source-file "hu.dwim.walker" "source" "infrastructure">
(LOAD hu.dwim.perec.all.test FAIL) COMMON-LISP:SIMPLE-ERROR : Could not define `getenv'.
(LOAD hu.dwim.perec.all FAIL) UIOP/LISP-BUILD:COMPILE-FILE-ERROR : COMPILE-FILE-ERROR while compiling #<hu.dwim.cl-source-file "hu.dwim.walker" "source" "infrastructure">
(LOAD hu.dwim.perec+swank FAIL) UIOP/LISP-BUILD:COMPILE-FILE-ERROR : COMPILE-FILE-ERROR while compiling #<hu.dwim.cl-source-file "hu.dwim.walker" "source" "infrastructure">
(LOAD hu.dwim.perec+iolib FAIL) UIOP/LISP-BUILD:COMPILE-FILE-ERROR : COMPILE-FILE-ERROR while compiling #<hu.dwim.cl-source-file "hu.dwim.walker" "source" "infrastructure">
(LOAD hu.dwim.perec+hu.dwim.quasi-quote.xml FAIL) UIOP/LISP-BUILD:COMPILE-FILE-ERROR : COMPILE-FILE-ERROR while compiling #<hu.dwim.cl-source-file "hu.dwim.walker" "source" "infrastructure">
(LOAD hu.dwim.perec FAIL) UIOP/LISP-BUILD:COMPILE-FILE-ERROR : COMPILE-FILE-ERROR while compiling #<hu.dwim.cl-source-file "hu.dwim.walker" "source" "infrastructure">
ecl-15.3.7-a014bd2c-linux-x64-lisp-to-c
(LOAD hu.dwim.perec.test FAIL) UIOP/LISP-BUILD:COMPILE-FILE-ERROR : COMPILE-FILE-ERROR while compiling #<hu.dwim.cl-source-file "hu.dwim.walker" "source" "infrastructure">
(LOAD hu.dwim.perec.sqlite.test FAIL) UIOP/LISP-BUILD:COMPILE-FILE-ERROR : COMPILE-FILE-ERROR while compiling #<hu.dwim.cl-source-file "hu.dwim.walker" "source" "infrastructure">
(LOAD hu.dwim.perec.sqlite FAIL) UIOP/LISP-BUILD:COMPILE-FILE-ERROR : COMPILE-FILE-ERROR while compiling #<hu.dwim.cl-source-file "hu.dwim.walker" "source" "infrastructure">
(LOAD hu.dwim.perec.postgresql.test FAIL) UIOP/LISP-BUILD:COMPILE-FILE-ERROR : COMPILE-FILE-ERROR while compiling #<hu.dwim.cl-source-file "hu.dwim.walker" "source" "infrastructure">
(LOAD hu.dwim.perec.postgresql FAIL) UIOP/LISP-BUILD:COMPILE-FILE-ERROR : COMPILE-FILE-ERROR while compiling #<hu.dwim.cl-source-file "hu.dwim.walker" "source" "infrastructure">
(LOAD hu.dwim.perec.oracle.test FAIL) UIOP/LISP-BUILD:COMPILE-FILE-ERROR : COMPILE-FILE-ERROR while compiling #<hu.dwim.cl-source-file "hu.dwim.walker" "source" "infrastructure">
(LOAD hu.dwim.perec.oracle FAIL) UIOP/LISP-BUILD:COMPILE-FILE-ERROR : COMPILE-FILE-ERROR while compiling #<hu.dwim.cl-source-file "hu.dwim.walker" "source" "infrastructure">
(LOAD hu.dwim.perec.all.test FAIL) UIOP/LISP-BUILD:COMPILE-FILE-ERROR : COMPILE-FILE-ERROR while compiling #<hu.dwim.cl-source-file "hu.dwim.walker" "source" "infrastructure">
(LOAD hu.dwim.perec.all FAIL) UIOP/LISP-BUILD:COMPILE-FILE-ERROR : COMPILE-FILE-ERROR while compiling #<hu.dwim.cl-source-file "hu.dwim.walker" "source" "infrastructure">
(LOAD hu.dwim.perec+swank FAIL) UIOP/LISP-BUILD:COMPILE-FILE-ERROR : COMPILE-FILE-ERROR while compiling #<hu.dwim.cl-source-file "hu.dwim.walker" "source" "infrastructure">
(LOAD hu.dwim.perec+iolib FAIL) UIOP/LISP-BUILD:COMPILE-FILE-ERROR : COMPILE-FILE-ERROR while compiling #<hu.dwim.cl-source-file "hu.dwim.walker" "source" "infrastructure">
(LOAD hu.dwim.perec+hu.dwim.quasi-quote.xml FAIL) UIOP/LISP-BUILD:COMPILE-FILE-ERROR : COMPILE-FILE-ERROR while compiling #<hu.dwim.cl-source-file "hu.dwim.walker" "source" "infrastructure">
(LOAD hu.dwim.perec FAIL) UIOP/LISP-BUILD:COMPILE-FILE-ERROR : COMPILE-FILE-ERROR while compiling #<hu.dwim.cl-source-file "hu.dwim.walker" "source" "infrastructure">
sbcl-1.0.58-linux-x86
(LOAD hu.dwim.perec.test FAIL) ASDF:LOAD-SYSTEM-DEFINITION-ERROR : Error while trying to load definition for system hu.dwim.perec.test from pathname /home/testgrid/cl-test-grid/work-dir/agent/quicklisp/dists/quicklisp/software/hu.dwim.perec-20150608-darcs/hu.dwim.perec.test.asd: Error while trying to load definition for system hu.dwim.asdf from pathname /home/testgrid/cl-test-grid/work-dir/agent/quicklisp/dists/quicklisp/software/hu.dwim.asdf-20150608-darcs/hu.dwim.asdf.asd: READ error during COMPILE-FILE: :ASCII stream decoding error on #<SB-SYS:FD-STREAM for "file /home/testgrid/cl-test-grid/work-dir/agent/quicklisp/dists/quicklisp/software/hu.dwim.asdf-20150608-darcs/hu.dwim.asdf.asd" {B0BBA21}>: the octet sequence #(195) cannot be decoded. (in form starting at line: 1, column: 0, file-position: 0)
(LOAD hu.dwim.perec.sqlite.test FAIL) ASDF:LOAD-SYSTEM-DEFINITION-ERROR : Error while trying to load definition for system hu.dwim.perec.sqlite.test from pathname /home/testgrid/cl-test-grid/work-dir/agent/quicklisp/dists/quicklisp/software/hu.dwim.perec-20150608-darcs/hu.dwim.perec.sqlite.test.asd: Error while trying to load definition for system hu.dwim.asdf from pathname /home/testgrid/cl-test-grid/work-dir/agent/quicklisp/dists/quicklisp/software/hu.dwim.asdf-20150608-darcs/hu.dwim.asdf.asd: READ error during COMPILE-FILE: :ASCII stream decoding error on #<SB-SYS:FD-STREAM for "file /home/testgrid/cl-test-grid/work-dir/agent/quicklisp/dists/quicklisp/software/hu.dwim.asdf-20150608-darcs/hu.dwim.asdf.asd" {B0B6A21}>: the octet sequence #(195) cannot be decoded. (in form starting at line: 1, column: 0, file-position: 0)
(LOAD hu.dwim.perec.sqlite FAIL) ASDF:LOAD-SYSTEM-DEFINITION-ERROR : Error while trying to load definition for system hu.dwim.perec.sqlite from pathname /home/testgrid/cl-test-grid/work-dir/agent/quicklisp/dists/quicklisp/software/hu.dwim.perec-20150608-darcs/hu.dwim.perec.sqlite.asd: Error while trying to load definition for system hu.dwim.asdf from pathname /home/testgrid/cl-test-grid/work-dir/agent/quicklisp/dists/quicklisp/software/hu.dwim.asdf-20150608-darcs/hu.dwim.asdf.asd: READ error during COMPILE-FILE: :ASCII stream decoding error on #<SB-SYS:FD-STREAM for "file /home/testgrid/cl-test-grid/work-dir/agent/quicklisp/dists/quicklisp/software/hu.dwim.asdf-20150608-darcs/hu.dwim.asdf.asd" {B0B5A21}>: the octet sequence #(195) cannot be decoded. (in form starting at line: 1, column: 0, file-position: 0)
(LOAD hu.dwim.perec.postgresql.test FAIL) ASDF:LOAD-SYSTEM-DEFINITION-ERROR : Error while trying to load definition for system hu.dwim.perec.postgresql.test from pathname /home/testgrid/cl-test-grid/work-dir/agent/quicklisp/dists/quicklisp/software/hu.dwim.perec-20150608-darcs/hu.dwim.perec.postgresql.test.asd: Error while trying to load definition for system hu.dwim.asdf from pathname /home/testgrid/cl-test-grid/work-dir/agent/quicklisp/dists/quicklisp/software/hu.dwim.asdf-20150608-darcs/hu.dwim.asdf.asd: READ error during COMPILE-FILE: :ASCII stream decoding error on #<SB-SYS:FD-STREAM for "file /home/testgrid/cl-test-grid/work-dir/agent/quicklisp/dists/quicklisp/software/hu.dwim.asdf-20150608-darcs/hu.dwim.asdf.asd" {B0B9A21}>: the octet sequence #(195) cannot be decoded. (in form starting at line: 1, column: 0, file-position: 0)
(LOAD hu.dwim.perec.postgresql FAIL) ASDF:LOAD-SYSTEM-DEFINITION-ERROR : Error while trying to load definition for system hu.dwim.perec.postgresql from pathname /home/testgrid/cl-test-grid/work-dir/agent/quicklisp/dists/quicklisp/software/hu.dwim.perec-20150608-darcs/hu.dwim.perec.postgresql.asd: Error while trying to load definition for system hu.dwim.asdf from pathname /home/testgrid/cl-test-grid/work-dir/agent/quicklisp/dists/quicklisp/software/hu.dwim.asdf-20150608-darcs/hu.dwim.asdf.asd: READ error during COMPILE-FILE: :ASCII stream decoding error on #<SB-SYS:FD-STREAM for "file /home/testgrid/cl-test-grid/work-dir/agent/quicklisp/dists/quicklisp/software/hu.dwim.asdf-20150608-darcs/hu.dwim.asdf.asd" {B0B6A21}>: the octet sequence #(195) cannot be decoded. (in form starting at line: 1, column: 0, file-position: 0)
(LOAD hu.dwim.perec.oracle.test FAIL) ASDF:LOAD-SYSTEM-DEFINITION-ERROR : Error while trying to load definition for system hu.dwim.perec.oracle.test from pathname /home/testgrid/cl-test-grid/work-dir/agent/quicklisp/dists/quicklisp/software/hu.dwim.perec-20150608-darcs/hu.dwim.perec.oracle.test.asd: Error while trying to load definition for system hu.dwim.asdf from pathname /home/testgrid/cl-test-grid/work-dir/agent/quicklisp/dists/quicklisp/software/hu.dwim.asdf-20150608-darcs/hu.dwim.asdf.asd: READ error during COMPILE-FILE: :ASCII stream decoding error on #<SB-SYS:FD-STREAM for "file /home/testgrid/cl-test-grid/work-dir/agent/quicklisp/dists/quicklisp/software/hu.dwim.asdf-20150608-darcs/hu.dwim.asdf.asd" {B0B6A21}>: the octet sequence #(195) cannot be decoded. (in form starting at line: 1, column: 0, file-position: 0)
(LOAD hu.dwim.perec.oracle FAIL) ASDF:LOAD-SYSTEM-DEFINITION-ERROR : Error while trying to load definition for system hu.dwim.perec.oracle from pathname /home/testgrid/cl-test-grid/work-dir/agent/quicklisp/dists/quicklisp/software/hu.dwim.perec-20150608-darcs/hu.dwim.perec.oracle.asd: Error while trying to load definition for system hu.dwim.asdf from pathname /home/testgrid/cl-test-grid/work-dir/agent/quicklisp/dists/quicklisp/software/hu.dwim.asdf-20150608-darcs/hu.dwim.asdf.asd: READ error during COMPILE-FILE: :ASCII stream decoding error on #<SB-SYS:FD-STREAM for "file /home/testgrid/cl-test-grid/work-dir/agent/quicklisp/dists/quicklisp/software/hu.dwim.asdf-20150608-darcs/hu.dwim.asdf.asd" {B0B5A21}>: the octet sequence #(195) cannot be decoded. (in form starting at line: 1, column: 0, file-position: 0)
(LOAD hu.dwim.perec.all.test FAIL) ASDF:LOAD-SYSTEM-DEFINITION-ERROR : Error while trying to load definition for system hu.dwim.perec.all.test from pathname /home/testgrid/cl-test-grid/work-dir/agent/quicklisp/dists/quicklisp/software/hu.dwim.perec-20150608-darcs/hu.dwim.perec.all.test.asd: Error while trying to load definition for system hu.dwim.asdf from pathname /home/testgrid/cl-test-grid/work-dir/agent/quicklisp/dists/quicklisp/software/hu.dwim.asdf-20150608-darcs/hu.dwim.asdf.asd: READ error during COMPILE-FILE: :ASCII stream decoding error on #<SB-SYS:FD-STREAM for "file /home/testgrid/cl-test-grid/work-dir/agent/quicklisp/dists/quicklisp/software/hu.dwim.asdf-20150608-darcs/hu.dwim.asdf.asd" {B0B5A21}>: the octet sequence #(195) cannot be decoded. (in form starting at line: 1, column: 0, file-position: 0)
(LOAD hu.dwim.perec.all FAIL) ASDF:LOAD-SYSTEM-DEFINITION-ERROR : Error while trying to load definition for system hu.dwim.perec.all from pathname /home/testgrid/cl-test-grid/work-dir/agent/quicklisp/dists/quicklisp/software/hu.dwim.perec-20150608-darcs/hu.dwim.perec.all.asd: Error while trying to load definition for system hu.dwim.asdf from pathname /home/testgrid/cl-test-grid/work-dir/agent/quicklisp/dists/quicklisp/software/hu.dwim.asdf-20150608-darcs/hu.dwim.asdf.asd: READ error during COMPILE-FILE: :ASCII stream decoding error on #<SB-SYS:FD-STREAM for "file /home/testgrid/cl-test-grid/work-dir/agent/quicklisp/dists/quicklisp/software/hu.dwim.asdf-20150608-darcs/hu.dwim.asdf.asd" {B0B5A21}>: the octet sequence #(195) cannot be decoded. (in form starting at line: 1, column: 0, file-position: 0)
(LOAD hu.dwim.perec+swank FAIL) ASDF:LOAD-SYSTEM-DEFINITION-ERROR : Error while trying to load definition for system hu.dwim.perec+swank from pathname /home/testgrid/cl-test-grid/work-dir/agent/quicklisp/dists/quicklisp/software/hu.dwim.perec-20150608-darcs/hu.dwim.perec+swank.asd: Error while trying to load definition for system hu.dwim.asdf from pathname /home/testgrid/cl-test-grid/work-dir/agent/quicklisp/dists/quicklisp/software/hu.dwim.asdf-20150608-darcs/hu.dwim.asdf.asd: READ error during COMPILE-FILE: :ASCII stream decoding error on #<SB-SYS:FD-STREAM for "file /home/testgrid/cl-test-grid/work-dir/agent/quicklisp/dists/quicklisp/software/hu.dwim.asdf-20150608-darcs/hu.dwim.asdf.asd" {B0B5A21}>: the octet sequence #(195) cannot be decoded. (in form starting at line: 1, column: 0, file-position: 0)
(LOAD hu.dwim.perec+iolib FAIL) ASDF:LOAD-SYSTEM-DEFINITION-ERROR : Error while trying to load definition for system hu.dwim.perec+iolib from pathname /home/testgrid/cl-test-grid/work-dir/agent/quicklisp/dists/quicklisp/software/hu.dwim.perec-20150608-darcs/hu.dwim.perec+iolib.asd: Error while trying to load definition for system hu.dwim.asdf from pathname /home/testgrid/cl-test-grid/work-dir/agent/quicklisp/dists/quicklisp/software/hu.dwim.asdf-20150608-darcs/hu.dwim.asdf.asd: READ error during COMPILE-FILE: :ASCII stream decoding error on #<SB-SYS:FD-STREAM for "file /home/testgrid/cl-test-grid/work-dir/agent/quicklisp/dists/quicklisp/software/hu.dwim.asdf-20150608-darcs/hu.dwim.asdf.asd" {B0B5A21}>: the octet sequence #(195) cannot be decoded. (in form starting at line: 1, column: 0, file-position: 0)
(LOAD hu.dwim.perec+hu.dwim.quasi-quote.xml FAIL) ASDF:LOAD-SYSTEM-DEFINITION-ERROR : Error while trying to load definition for system hu.dwim.perec+hu.dwim.quasi-quote.xml from pathname /home/testgrid/cl-test-grid/work-dir/agent/quicklisp/dists/quicklisp/software/hu.dwim.perec-20150608-darcs/hu.dwim.perec+hu.dwim.quasi-quote.xml.asd: Error while trying to load definition for system hu.dwim.asdf from pathname /home/testgrid/cl-test-grid/work-dir/agent/quicklisp/dists/quicklisp/software/hu.dwim.asdf-20150608-darcs/hu.dwim.asdf.asd: READ error during COMPILE-FILE: :ASCII stream decoding error on #<SB-SYS:FD-STREAM for "file /home/testgrid/cl-test-grid/work-dir/agent/quicklisp/dists/quicklisp/software/hu.dwim.asdf-20150608-darcs/hu.dwim.asdf.asd" {B0BBA21}>: the octet sequence #(195) cannot be decoded. (in form starting at line: 1, column: 0, file-position: 0)
(LOAD hu.dwim.perec FAIL) ASDF:LOAD-SYSTEM-DEFINITION-ERROR : Error while trying to load definition for system hu.dwim.perec from pathname /home/testgrid/cl-test-grid/work-dir/agent/quicklisp/dists/quicklisp/software/hu.dwim.perec-20150608-darcs/hu.dwim.perec.asd: Error while trying to load definition for system hu.dwim.asdf from pathname /home/testgrid/cl-test-grid/work-dir/agent/quicklisp/dists/quicklisp/software/hu.dwim.asdf-20150608-darcs/hu.dwim.asdf.asd: READ error during COMPILE-FILE: :ASCII stream decoding error on #<SB-SYS:FD-STREAM for "file /home/testgrid/cl-test-grid/work-dir/agent/quicklisp/dists/quicklisp/software/hu.dwim.asdf-20150608-darcs/hu.dwim.asdf.asd" {B0C2A21}>: the octet sequence #(195) cannot be decoded. (in form starting at line: 1, column: 0, file-position: 0)
(LOAD hu.dwim.perec.test FAIL) ASDF:LOAD-SYSTEM-DEFINITION-ERROR : Error while trying to load definition for system hu.dwim.perec.test from pathname /home/testgrid/cl-test-grid/work-dir/agent/quicklisp/dists/quicklisp/software/hu.dwim.perec-20140826-darcs/hu.dwim.perec.test.asd: Error while invoking #<COMPILE-OP NIL {B0CD691}> on #<CL-SOURCE-FILE "hu.dwim.asdf" "source" "system">
(LOAD hu.dwim.perec.sqlite.test FAIL) ASDF:LOAD-SYSTEM-DEFINITION-ERROR : Error while trying to load definition for system hu.dwim.perec.sqlite.test from pathname /home/testgrid/cl-test-grid/work-dir/agent/quicklisp/dists/quicklisp/software/hu.dwim.perec-20140826-darcs/hu.dwim.perec.sqlite.test.asd: Error while invoking #<COMPILE-OP NIL {B0CE691}> on #<CL-SOURCE-FILE "hu.dwim.asdf" "source" "system">
(LOAD hu.dwim.perec.sqlite FAIL) ASDF:LOAD-SYSTEM-DEFINITION-ERROR : Error while trying to load definition for system hu.dwim.perec.sqlite from pathname /home/testgrid/cl-test-grid/work-dir/agent/quicklisp/dists/quicklisp/software/hu.dwim.perec-20140826-darcs/hu.dwim.perec.sqlite.asd: Error while invoking #<COMPILE-OP NIL {B0CE691}> on #<CL-SOURCE-FILE "hu.dwim.asdf" "source" "system">
(LOAD hu.dwim.perec.postgresql.test FAIL) ASDF:LOAD-SYSTEM-DEFINITION-ERROR : Error while trying to load definition for system hu.dwim.perec.postgresql.test from pathname /home/testgrid/cl-test-grid/work-dir/agent/quicklisp/dists/quicklisp/software/hu.dwim.perec-20140826-darcs/hu.dwim.perec.postgresql.test.asd: Error while invoking #<COMPILE-OP NIL {B0D1691}> on #<CL-SOURCE-FILE "hu.dwim.asdf" "source" "system">
(LOAD hu.dwim.perec.postgresql FAIL) ASDF:LOAD-SYSTEM-DEFINITION-ERROR : Error while trying to load definition for system hu.dwim.perec.postgresql from pathname /home/testgrid/cl-test-grid/work-dir/agent/quicklisp/dists/quicklisp/software/hu.dwim.perec-20140826-darcs/hu.dwim.perec.postgresql.asd: Error while invoking #<COMPILE-OP NIL {B0CE691}> on #<CL-SOURCE-FILE "hu.dwim.asdf" "source" "system">
(LOAD hu.dwim.perec.oracle.test FAIL) ASDF:LOAD-SYSTEM-DEFINITION-ERROR : Error while trying to load definition for system hu.dwim.perec.oracle.test from pathname /home/testgrid/cl-test-grid/work-dir/agent/quicklisp/dists/quicklisp/software/hu.dwim.perec-20140826-darcs/hu.dwim.perec.oracle.test.asd: Error while invoking #<COMPILE-OP NIL {B0CE691}> on #<CL-SOURCE-FILE "hu.dwim.asdf" "source" "system">
(LOAD hu.dwim.perec.oracle FAIL) ASDF:LOAD-SYSTEM-DEFINITION-ERROR : Error while trying to load definition for system hu.dwim.perec.oracle from pathname /home/testgrid/cl-test-grid/work-dir/agent/quicklisp/dists/quicklisp/software/hu.dwim.perec-20140826-darcs/hu.dwim.perec.oracle.asd: Error while invoking #<COMPILE-OP NIL {B0CE691}> on #<CL-SOURCE-FILE "hu.dwim.asdf" "source" "system">
(LOAD hu.dwim.perec.all.test FAIL) ASDF:LOAD-SYSTEM-DEFINITION-ERROR : Error while trying to load definition for system hu.dwim.perec.all.test from pathname /home/testgrid/cl-test-grid/work-dir/agent/quicklisp/dists/quicklisp/software/hu.dwim.perec-20140826-darcs/hu.dwim.perec.all.test.asd: Error while invoking #<COMPILE-OP NIL {B0CE691}> on #<CL-SOURCE-FILE "hu.dwim.asdf" "source" "system">
(LOAD hu.dwim.perec.all FAIL) ASDF:LOAD-SYSTEM-DEFINITION-ERROR : Error while trying to load definition for system hu.dwim.perec.all from pathname /home/testgrid/cl-test-grid/work-dir/agent/quicklisp/dists/quicklisp/software/hu.dwim.perec-20140826-darcs/hu.dwim.perec.all.asd: Error while invoking #<COMPILE-OP NIL {B0CD691}> on #<CL-SOURCE-FILE "hu.dwim.asdf" "source" "system">
(LOAD hu.dwim.perec+swank FAIL) ASDF:LOAD-SYSTEM-DEFINITION-ERROR : Error while trying to load definition for system hu.dwim.perec+swank from pathname /home/testgrid/cl-test-grid/work-dir/agent/quicklisp/dists/quicklisp/software/hu.dwim.perec-20140826-darcs/hu.dwim.perec+swank.asd: Error while invoking #<COMPILE-OP NIL {B0CE691}> on #<CL-SOURCE-FILE "hu.dwim.asdf" "source" "system">
(LOAD hu.dwim.perec+iolib FAIL) ASDF:LOAD-SYSTEM-DEFINITION-ERROR : Error while trying to load definition for system hu.dwim.perec+iolib from pathname /home/testgrid/cl-test-grid/work-dir/agent/quicklisp/dists/quicklisp/software/hu.dwim.perec-20140826-darcs/hu.dwim.perec+iolib.asd: Error while invoking #<COMPILE-OP NIL {B0CE691}> on #<CL-SOURCE-FILE "hu.dwim.asdf" "source" "system">
(LOAD hu.dwim.perec+hu.dwim.quasi-quote.xml FAIL) ASDF:LOAD-SYSTEM-DEFINITION-ERROR : Error while trying to load definition for system hu.dwim.perec+hu.dwim.quasi-quote.xml from pathname /home/testgrid/cl-test-grid/work-dir/agent/quicklisp/dists/quicklisp/software/hu.dwim.perec-20140826-darcs/hu.dwim.perec+hu.dwim.quasi-quote.xml.asd: Error while invoking #<COMPILE-OP NIL {B0D3691}> on #<CL-SOURCE-FILE "hu.dwim.asdf" "source" "system">
(LOAD hu.dwim.perec FAIL) ASDF:LOAD-SYSTEM-DEFINITION-ERROR : Error while trying to load definition for system hu.dwim.perec from pathname /home/testgrid/cl-test-grid/work-dir/agent/quicklisp/dists/quicklisp/software/hu.dwim.perec-20140826-darcs/hu.dwim.perec.asd: Error while invoking #<COMPILE-OP NIL {B0CE691}> on #<CL-SOURCE-FILE "hu.dwim.asdf" "source" "system">
sbcl-1.1.11-linux-x86
(LOAD hu.dwim.perec.test FAIL) needs newer ASDF, ASDF/FIND-SYSTEM:LOAD-SYSTEM-DEFINITION-ERROR : Error while trying to load definition for system hu.dwim.perec.test from pathname /home/testgrid/cl-test-grid/work-dir/agent/quicklisp/dists/quicklisp/software/hu.dwim.perec-20150608-darcs/hu.dwim.perec.test.asd: no symbol named "NON-PROPAGATING-OPERATION" in "ASDF/INTERFACE"
(LOAD hu.dwim.perec.sqlite.test FAIL) needs newer ASDF, ASDF/FIND-SYSTEM:LOAD-SYSTEM-DEFINITION-ERROR : Error while trying to load definition for system hu.dwim.perec.sqlite.test from pathname /home/testgrid/cl-test-grid/work-dir/agent/quicklisp/dists/quicklisp/software/hu.dwim.perec-20150608-darcs/hu.dwim.perec.sqlite.test.asd: no symbol named "NON-PROPAGATING-OPERATION" in "ASDF/INTERFACE"
(LOAD hu.dwim.perec.sqlite FAIL) needs newer ASDF, ASDF/FIND-SYSTEM:LOAD-SYSTEM-DEFINITION-ERROR : Error while trying to load definition for system hu.dwim.perec.sqlite from pathname /home/testgrid/cl-test-grid/work-dir/agent/quicklisp/dists/quicklisp/software/hu.dwim.perec-20150608-darcs/hu.dwim.perec.sqlite.asd: no symbol named "NON-PROPAGATING-OPERATION" in "ASDF/INTERFACE"
(LOAD hu.dwim.perec.postgresql.test FAIL) needs newer ASDF, ASDF/FIND-SYSTEM:LOAD-SYSTEM-DEFINITION-ERROR : Error while trying to load definition for system hu.dwim.perec.postgresql.test from pathname /home/testgrid/cl-test-grid/work-dir/agent/quicklisp/dists/quicklisp/software/hu.dwim.perec-20150608-darcs/hu.dwim.perec.postgresql.test.asd: no symbol named "NON-PROPAGATING-OPERATION" in "ASDF/INTERFACE"
(LOAD hu.dwim.perec.postgresql FAIL) needs newer ASDF, ASDF/FIND-SYSTEM:LOAD-SYSTEM-DEFINITION-ERROR : Error while trying to load definition for system hu.dwim.perec.postgresql from pathname /home/testgrid/cl-test-grid/work-dir/agent/quicklisp/dists/quicklisp/software/hu.dwim.perec-20150608-darcs/hu.dwim.perec.postgresql.asd: no symbol named "NON-PROPAGATING-OPERATION" in "ASDF/INTERFACE"
(LOAD hu.dwim.perec.oracle.test FAIL) needs newer ASDF, ASDF/FIND-SYSTEM:LOAD-SYSTEM-DEFINITION-ERROR : Error while trying to load definition for system hu.dwim.perec.oracle.test from pathname /home/testgrid/cl-test-grid/work-dir/agent/quicklisp/dists/quicklisp/software/hu.dwim.perec-20150608-darcs/hu.dwim.perec.oracle.test.asd: no symbol named "NON-PROPAGATING-OPERATION" in "ASDF/INTERFACE"
(LOAD hu.dwim.perec.oracle FAIL) needs newer ASDF, ASDF/FIND-SYSTEM:LOAD-SYSTEM-DEFINITION-ERROR : Error while trying to load definition for system hu.dwim.perec.oracle from pathname /home/testgrid/cl-test-grid/work-dir/agent/quicklisp/dists/quicklisp/software/hu.dwim.perec-20150608-darcs/hu.dwim.perec.oracle.asd: no symbol named "NON-PROPAGATING-OPERATION" in "ASDF/INTERFACE"
(LOAD hu.dwim.perec.all.test FAIL) needs newer ASDF, ASDF/FIND-SYSTEM:LOAD-SYSTEM-DEFINITION-ERROR : Error while trying to load definition for system hu.dwim.perec.all.test from pathname /home/testgrid/cl-test-grid/work-dir/agent/quicklisp/dists/quicklisp/software/hu.dwim.perec-20150608-darcs/hu.dwim.perec.all.test.asd: no symbol named "NON-PROPAGATING-OPERATION" in "ASDF/INTERFACE"
(LOAD hu.dwim.perec.all FAIL) needs newer ASDF, ASDF/FIND-SYSTEM:LOAD-SYSTEM-DEFINITION-ERROR : Error while trying to load definition for system hu.dwim.perec.all from pathname /home/testgrid/cl-test-grid/work-dir/agent/quicklisp/dists/quicklisp/software/hu.dwim.perec-20150608-darcs/hu.dwim.perec.all.asd: no symbol named "NON-PROPAGATING-OPERATION" in "ASDF/INTERFACE"
(LOAD hu.dwim.perec+swank FAIL) needs newer ASDF, ASDF/FIND-SYSTEM:LOAD-SYSTEM-DEFINITION-ERROR : Error while trying to load definition for system hu.dwim.perec+swank from pathname /home/testgrid/cl-test-grid/work-dir/agent/quicklisp/dists/quicklisp/software/hu.dwim.perec-20150608-darcs/hu.dwim.perec+swank.asd: no symbol named "NON-PROPAGATING-OPERATION" in "ASDF/INTERFACE"
(LOAD hu.dwim.perec+iolib FAIL) needs newer ASDF, ASDF/FIND-SYSTEM:LOAD-SYSTEM-DEFINITION-ERROR : Error while trying to load definition for system hu.dwim.perec+iolib from pathname /home/testgrid/cl-test-grid/work-dir/agent/quicklisp/dists/quicklisp/software/hu.dwim.perec-20150608-darcs/hu.dwim.perec+iolib.asd: no symbol named "NON-PROPAGATING-OPERATION" in "ASDF/INTERFACE"
(LOAD hu.dwim.perec+hu.dwim.quasi-quote.xml FAIL) needs newer ASDF, ASDF/FIND-SYSTEM:LOAD-SYSTEM-DEFINITION-ERROR : Error while trying to load definition for system hu.dwim.perec+hu.dwim.quasi-quote.xml from pathname /home/testgrid/cl-test-grid/work-dir/agent/quicklisp/dists/quicklisp/software/hu.dwim.perec-20150608-darcs/hu.dwim.perec+hu.dwim.quasi-quote.xml.asd: no symbol named "NON-PROPAGATING-OPERATION" in "ASDF/INTERFACE"
(LOAD hu.dwim.perec FAIL) needs newer ASDF, ASDF/FIND-SYSTEM:LOAD-SYSTEM-DEFINITION-ERROR : Error while trying to load definition for system hu.dwim.perec from pathname /home/testgrid/cl-test-grid/work-dir/agent/quicklisp/dists/quicklisp/software/hu.dwim.perec-20150608-darcs/hu.dwim.perec.asd: no symbol named "NON-PROPAGATING-OPERATION" in "ASDF/INTERFACE"
(LOAD hu.dwim.perec.test FAIL) QUICKLISP-CLIENT:SYSTEM-NOT-FOUND : System "sb-sprof" not found
(LOAD hu.dwim.perec.sqlite.test FAIL) QUICKLISP-CLIENT:SYSTEM-NOT-FOUND : System "sb-sprof" not found
(LOAD hu.dwim.perec.sqlite FAIL) QUICKLISP-CLIENT:SYSTEM-NOT-FOUND : System "sb-sprof" not found
(LOAD hu.dwim.perec.postgresql.test FAIL) QUICKLISP-CLIENT:SYSTEM-NOT-FOUND : System "sb-sprof" not found
(LOAD hu.dwim.perec.postgresql FAIL) QUICKLISP-CLIENT:SYSTEM-NOT-FOUND : System "sb-sprof" not found
(LOAD hu.dwim.perec.oracle.test FAIL) QUICKLISP-CLIENT:SYSTEM-NOT-FOUND : System "sb-sprof" not found
(LOAD hu.dwim.perec.oracle FAIL) QUICKLISP-CLIENT:SYSTEM-NOT-FOUND : System "sb-sprof" not found
(LOAD hu.dwim.perec.all.test FAIL) QUICKLISP-CLIENT:SYSTEM-NOT-FOUND : System "sb-sprof" not found
(LOAD hu.dwim.perec.all FAIL) QUICKLISP-CLIENT:SYSTEM-NOT-FOUND : System "sb-sprof" not found
(LOAD hu.dwim.perec+swank FAIL) QUICKLISP-CLIENT:SYSTEM-NOT-FOUND : System "sb-sprof" not found
(LOAD hu.dwim.perec+iolib FAIL) QUICKLISP-CLIENT:SYSTEM-NOT-FOUND : System "sb-sprof" not found
(LOAD hu.dwim.perec+hu.dwim.quasi-quote.xml FAIL) QUICKLISP-CLIENT:SYSTEM-NOT-FOUND : System "sb-sprof" not found
(LOAD hu.dwim.perec FAIL) QUICKLISP-CLIENT:SYSTEM-NOT-FOUND : System "sb-sprof" not found
sbcl-1.1.16-linux-x86
(LOAD hu.dwim.perec.test FAIL) needs newer ASDF, ASDF/FIND-SYSTEM:LOAD-SYSTEM-DEFINITION-ERROR : Error while trying to load definition for system hu.dwim.perec.test from pathname /home/testgrid/cl-test-grid/work-dir/agent/quicklisp/dists/quicklisp/software/hu.dwim.perec-20150608-darcs/hu.dwim.perec.test.asd: no symbol named "NON-PROPAGATING-OPERATION" in "ASDF/INTERFACE"
(LOAD hu.dwim.perec.sqlite.test FAIL) needs newer ASDF, ASDF/FIND-SYSTEM:LOAD-SYSTEM-DEFINITION-ERROR : Error while trying to load definition for system hu.dwim.perec.sqlite.test from pathname /home/testgrid/cl-test-grid/work-dir/agent/quicklisp/dists/quicklisp/software/hu.dwim.perec-20150608-darcs/hu.dwim.perec.sqlite.test.asd: no symbol named "NON-PROPAGATING-OPERATION" in "ASDF/INTERFACE"
(LOAD hu.dwim.perec.sqlite FAIL) needs newer ASDF, ASDF/FIND-SYSTEM:LOAD-SYSTEM-DEFINITION-ERROR : Error while trying to load definition for system hu.dwim.perec.sqlite from pathname /home/testgrid/cl-test-grid/work-dir/agent/quicklisp/dists/quicklisp/software/hu.dwim.perec-20150608-darcs/hu.dwim.perec.sqlite.asd: no symbol named "NON-PROPAGATING-OPERATION" in "ASDF/INTERFACE"
(LOAD hu.dwim.perec.postgresql.test FAIL) needs newer ASDF, ASDF/FIND-SYSTEM:LOAD-SYSTEM-DEFINITION-ERROR : Error while trying to load definition for system hu.dwim.perec.postgresql.test from pathname /home/testgrid/cl-test-grid/work-dir/agent/quicklisp/dists/quicklisp/software/hu.dwim.perec-20150608-darcs/hu.dwim.perec.postgresql.test.asd: no symbol named "NON-PROPAGATING-OPERATION" in "ASDF/INTERFACE"
(LOAD hu.dwim.perec.postgresql FAIL) needs newer ASDF, ASDF/FIND-SYSTEM:LOAD-SYSTEM-DEFINITION-ERROR : Error while trying to load definition for system hu.dwim.perec.postgresql from pathname /home/testgrid/cl-test-grid/work-dir/agent/quicklisp/dists/quicklisp/software/hu.dwim.perec-20150608-darcs/hu.dwim.perec.postgresql.asd: no symbol named "NON-PROPAGATING-OPERATION" in "ASDF/INTERFACE"
(LOAD hu.dwim.perec.oracle.test FAIL) needs newer ASDF, ASDF/FIND-SYSTEM:LOAD-SYSTEM-DEFINITION-ERROR : Error while trying to load definition for system hu.dwim.perec.oracle.test from pathname /home/testgrid/cl-test-grid/work-dir/agent/quicklisp/dists/quicklisp/software/hu.dwim.perec-20150608-darcs/hu.dwim.perec.oracle.test.asd: no symbol named "NON-PROPAGATING-OPERATION" in "ASDF/INTERFACE"
(LOAD hu.dwim.perec.oracle FAIL) needs newer ASDF, ASDF/FIND-SYSTEM:LOAD-SYSTEM-DEFINITION-ERROR : Error while trying to load definition for system hu.dwim.perec.oracle from pathname /home/testgrid/cl-test-grid/work-dir/agent/quicklisp/dists/quicklisp/software/hu.dwim.perec-20150608-darcs/hu.dwim.perec.oracle.asd: no symbol named "NON-PROPAGATING-OPERATION" in "ASDF/INTERFACE"
(LOAD hu.dwim.perec.all.test FAIL) needs newer ASDF, ASDF/FIND-SYSTEM:LOAD-SYSTEM-DEFINITION-ERROR : Error while trying to load definition for system hu.dwim.perec.all.test from pathname /home/testgrid/cl-test-grid/work-dir/agent/quicklisp/dists/quicklisp/software/hu.dwim.perec-20150608-darcs/hu.dwim.perec.all.test.asd: no symbol named "NON-PROPAGATING-OPERATION" in "ASDF/INTERFACE"
(LOAD hu.dwim.perec.all FAIL) needs newer ASDF, ASDF/FIND-SYSTEM:LOAD-SYSTEM-DEFINITION-ERROR : Error while trying to load definition for system hu.dwim.perec.all from pathname /home/testgrid/cl-test-grid/work-dir/agent/quicklisp/dists/quicklisp/software/hu.dwim.perec-20150608-darcs/hu.dwim.perec.all.asd: no symbol named "NON-PROPAGATING-OPERATION" in "ASDF/INTERFACE"
(LOAD hu.dwim.perec+swank FAIL) needs newer ASDF, ASDF/FIND-SYSTEM:LOAD-SYSTEM-DEFINITION-ERROR : Error while trying to load definition for system hu.dwim.perec+swank from pathname /home/testgrid/cl-test-grid/work-dir/agent/quicklisp/dists/quicklisp/software/hu.dwim.perec-20150608-darcs/hu.dwim.perec+swank.asd: no symbol named "NON-PROPAGATING-OPERATION" in "ASDF/INTERFACE"
(LOAD hu.dwim.perec+iolib FAIL) needs newer ASDF, ASDF/FIND-SYSTEM:LOAD-SYSTEM-DEFINITION-ERROR : Error while trying to load definition for system hu.dwim.perec+iolib from pathname /home/testgrid/cl-test-grid/work-dir/agent/quicklisp/dists/quicklisp/software/hu.dwim.perec-20150608-darcs/hu.dwim.perec+iolib.asd: no symbol named "NON-PROPAGATING-OPERATION" in "ASDF/INTERFACE"
(LOAD hu.dwim.perec+hu.dwim.quasi-quote.xml FAIL) needs newer ASDF, ASDF/FIND-SYSTEM:LOAD-SYSTEM-DEFINITION-ERROR : Error while trying to load definition for system hu.dwim.perec+hu.dwim.quasi-quote.xml from pathname /home/testgrid/cl-test-grid/work-dir/agent/quicklisp/dists/quicklisp/software/hu.dwim.perec-20150608-darcs/hu.dwim.perec+hu.dwim.quasi-quote.xml.asd: no symbol named "NON-PROPAGATING-OPERATION" in "ASDF/INTERFACE"
(LOAD hu.dwim.perec FAIL) needs newer ASDF, ASDF/FIND-SYSTEM:LOAD-SYSTEM-DEFINITION-ERROR : Error while trying to load definition for system hu.dwim.perec from pathname /home/testgrid/cl-test-grid/work-dir/agent/quicklisp/dists/quicklisp/software/hu.dwim.perec-20150608-darcs/hu.dwim.perec.asd: no symbol named "NON-PROPAGATING-OPERATION" in "ASDF/INTERFACE"
(LOAD hu.dwim.perec.test FAIL) ASDF/FIND-SYSTEM:MISSING-COMPONENT : Component "iolib/sockets" not found
(LOAD hu.dwim.perec.sqlite.test FAIL) ASDF/FIND-SYSTEM:MISSING-COMPONENT : Component "iolib/sockets" not found
(LOAD hu.dwim.perec.postgresql.test FAIL) ASDF/FIND-SYSTEM:MISSING-COMPONENT : Component "iolib/sockets" not found
(LOAD hu.dwim.perec.oracle.test FAIL) ASDF/FIND-SYSTEM:MISSING-COMPONENT : Component "iolib/sockets" not found
(LOAD hu.dwim.perec.all.test FAIL) ASDF/FIND-SYSTEM:MISSING-COMPONENT : Component "iolib/sockets" not found
(LOAD hu.dwim.perec+iolib FAIL) ASDF/FIND-SYSTEM:MISSING-COMPONENT : Component "iolib/sockets" not found
sbcl-1.2.3-linux-x64
(LOAD hu.dwim.perec.test FAIL) COMMON-LISP:SIMPLE-ERROR : External process exited with code 1. Command was: "g++" "-m64" "-Wno-write-strings" "-I/home/hijarian/systems/cl-test-grid/work-dir/agent/quicklisp/dists/quicklisp/software/iolib-20150302-git/src/grovel/" "-o" "/home/hijarian/systems/cl-test-grid/work-dir/agent/test-runs/20150609131809-sbcl-1.2.3-linux-x64/fasl/ql/dists/quicklisp/software/iolib-20150302-git/src/syscalls/ffi-types-unix" "/home/hijarian/systems/cl-test-grid/work-dir/agent/test-runs/20150609131809-sbcl-1.2.3-linux-x64/fasl/ql/dists/quicklisp/software/iolib-20150302-git/src/syscalls/ffi-types-unix.c" Output was: /home/hijarian/systems/cl-test-grid/work-dir/agent/test-runs/20150609131809-sbcl-1.2.3-linux-x64/fasl/ql/dists/quicklisp/software/iolib-20150302-git/src/syscalls/ffi-types-unix.c:14:17: fatal error: lfp.h: Нет такого файла или каталога #include <lfp.h> ^ compilation terminated.
(LOAD hu.dwim.perec.sqlite.test FAIL) COMMON-LISP:SIMPLE-ERROR : External process exited with code 1. Command was: "g++" "-m64" "-Wno-write-strings" "-I/home/hijarian/systems/cl-test-grid/work-dir/agent/quicklisp/dists/quicklisp/software/iolib-20150302-git/src/grovel/" "-o" "/home/hijarian/systems/cl-test-grid/work-dir/agent/test-runs/20150609131809-sbcl-1.2.3-linux-x64/fasl/ql/dists/quicklisp/software/iolib-20150302-git/src/syscalls/ffi-types-unix" "/home/hijarian/systems/cl-test-grid/work-dir/agent/test-runs/20150609131809-sbcl-1.2.3-linux-x64/fasl/ql/dists/quicklisp/software/iolib-20150302-git/src/syscalls/ffi-types-unix.c" Output was: /home/hijarian/systems/cl-test-grid/work-dir/agent/test-runs/20150609131809-sbcl-1.2.3-linux-x64/fasl/ql/dists/quicklisp/software/iolib-20150302-git/src/syscalls/ffi-types-unix.c:14:17: fatal error: lfp.h: Нет такого файла или каталога #include <lfp.h> ^ compilation terminated.
(LOAD hu.dwim.perec.postgresql.test FAIL) COMMON-LISP:SIMPLE-ERROR : External process exited with code 1. Command was: "g++" "-m64" "-Wno-write-strings" "-I/home/hijarian/systems/cl-test-grid/work-dir/agent/quicklisp/dists/quicklisp/software/iolib-20150302-git/src/grovel/" "-o" "/home/hijarian/systems/cl-test-grid/work-dir/agent/test-runs/20150609131809-sbcl-1.2.3-linux-x64/fasl/ql/dists/quicklisp/software/iolib-20150302-git/src/syscalls/ffi-types-unix" "/home/hijarian/systems/cl-test-grid/work-dir/agent/test-runs/20150609131809-sbcl-1.2.3-linux-x64/fasl/ql/dists/quicklisp/software/iolib-20150302-git/src/syscalls/ffi-types-unix.c" Output was: /home/hijarian/systems/cl-test-grid/work-dir/agent/test-runs/20150609131809-sbcl-1.2.3-linux-x64/fasl/ql/dists/quicklisp/software/iolib-20150302-git/src/syscalls/ffi-types-unix.c:14:17: fatal error: lfp.h: Нет такого файла или каталога #include <lfp.h> ^ compilation terminated.
(LOAD hu.dwim.perec.oracle.test FAIL) COMMON-LISP:SIMPLE-ERROR : External process exited with code 1. Command was: "g++" "-m64" "-Wno-write-strings" "-I/home/hijarian/systems/cl-test-grid/work-dir/agent/quicklisp/dists/quicklisp/software/iolib-20150302-git/src/grovel/" "-o" "/home/hijarian/systems/cl-test-grid/work-dir/agent/test-runs/20150609131809-sbcl-1.2.3-linux-x64/fasl/ql/dists/quicklisp/software/iolib-20150302-git/src/syscalls/ffi-types-unix" "/home/hijarian/systems/cl-test-grid/work-dir/agent/test-runs/20150609131809-sbcl-1.2.3-linux-x64/fasl/ql/dists/quicklisp/software/iolib-20150302-git/src/syscalls/ffi-types-unix.c" Output was: /home/hijarian/systems/cl-test-grid/work-dir/agent/test-runs/20150609131809-sbcl-1.2.3-linux-x64/fasl/ql/dists/quicklisp/software/iolib-20150302-git/src/syscalls/ffi-types-unix.c:14:17: fatal error: lfp.h: Нет такого файла или каталога #include <lfp.h> ^ compilation terminated.
(LOAD hu.dwim.perec.all.test FAIL) COMMON-LISP:SIMPLE-ERROR : External process exited with code 1. Command was: "g++" "-m64" "-Wno-write-strings" "-I/home/hijarian/systems/cl-test-grid/work-dir/agent/quicklisp/dists/quicklisp/software/iolib-20150302-git/src/grovel/" "-o" "/home/hijarian/systems/cl-test-grid/work-dir/agent/test-runs/20150609131809-sbcl-1.2.3-linux-x64/fasl/ql/dists/quicklisp/software/iolib-20150302-git/src/syscalls/ffi-types-unix" "/home/hijarian/systems/cl-test-grid/work-dir/agent/test-runs/20150609131809-sbcl-1.2.3-linux-x64/fasl/ql/dists/quicklisp/software/iolib-20150302-git/src/syscalls/ffi-types-unix.c" Output was: /home/hijarian/systems/cl-test-grid/work-dir/agent/test-runs/20150609131809-sbcl-1.2.3-linux-x64/fasl/ql/dists/quicklisp/software/iolib-20150302-git/src/syscalls/ffi-types-unix.c:14:17: fatal error: lfp.h: Нет такого файла или каталога #include <lfp.h> ^ compilation terminated.
(LOAD hu.dwim.perec+iolib FAIL) COMMON-LISP:SIMPLE-ERROR : External process exited with code 1. Command was: "g++" "-m64" "-Wno-write-strings" "-I/home/hijarian/systems/cl-test-grid/work-dir/agent/quicklisp/dists/quicklisp/software/iolib-20150302-git/src/grovel/" "-o" "/home/hijarian/systems/cl-test-grid/work-dir/agent/test-runs/20150609131809-sbcl-1.2.3-linux-x64/fasl/ql/dists/quicklisp/software/iolib-20150302-git/src/syscalls/ffi-types-unix" "/home/hijarian/systems/cl-test-grid/work-dir/agent/test-runs/20150609131809-sbcl-1.2.3-linux-x64/fasl/ql/dists/quicklisp/software/iolib-20150302-git/src/syscalls/ffi-types-unix.c" Output was: /home/hijarian/systems/cl-test-grid/work-dir/agent/test-runs/20150609131809-sbcl-1.2.3-linux-x64/fasl/ql/dists/quicklisp/software/iolib-20150302-git/src/syscalls/ffi-types-unix.c:14:17: fatal error: lfp.h: Нет такого файла или каталога #include <lfp.h> ^ compilation terminated.
(LOAD hu.dwim.perec.test FAIL) COMMON-LISP:SIMPLE-ERROR : External process exited with code 1. Command was: "g++" "-m64" "-Wno-write-strings" "-I/home/hijarian/systems/cl-test-grid/work-dir/agent/quicklisp/dists/quicklisp/software/iolib-20150302-git/src/grovel/" "-o" "/home/hijarian/systems/cl-test-grid/work-dir/agent/test-runs/20150518190329-sbcl-1.2.3-linux-x64/fasl/ql/dists/quicklisp/software/iolib-20150302-git/src/syscalls/ffi-types-unix" "/home/hijarian/systems/cl-test-grid/work-dir/agent/test-runs/20150518190329-sbcl-1.2.3-linux-x64/fasl/ql/dists/quicklisp/software/iolib-20150302-git/src/syscalls/ffi-types-unix.c" Output was: /home/hijarian/systems/cl-test-grid/work-dir/agent/test-runs/20150518190329-sbcl-1.2.3-linux-x64/fasl/ql/dists/quicklisp/software/iolib-20150302-git/src/syscalls/ffi-types-unix.c:14:17: fatal error: lfp.h: Нет такого файла или каталога #include <lfp.h> ^ compilation terminated.
(LOAD hu.dwim.perec.sqlite.test FAIL) COMMON-LISP:SIMPLE-ERROR : External process exited with code 1. Command was: "g++" "-m64" "-Wno-write-strings" "-I/home/hijarian/systems/cl-test-grid/work-dir/agent/quicklisp/dists/quicklisp/software/iolib-20150302-git/src/grovel/" "-o" "/home/hijarian/systems/cl-test-grid/work-dir/agent/test-runs/20150518190329-sbcl-1.2.3-linux-x64/fasl/ql/dists/quicklisp/software/iolib-20150302-git/src/syscalls/ffi-types-unix" "/home/hijarian/systems/cl-test-grid/work-dir/agent/test-runs/20150518190329-sbcl-1.2.3-linux-x64/fasl/ql/dists/quicklisp/software/iolib-20150302-git/src/syscalls/ffi-types-unix.c" Output was: /home/hijarian/systems/cl-test-grid/work-dir/agent/test-runs/20150518190329-sbcl-1.2.3-linux-x64/fasl/ql/dists/quicklisp/software/iolib-20150302-git/src/syscalls/ffi-types-unix.c:14:17: fatal error: lfp.h: Нет такого файла или каталога #include <lfp.h> ^ compilation terminated.
(LOAD hu.dwim.perec.postgresql.test FAIL) COMMON-LISP:SIMPLE-ERROR : External process exited with code 1. Command was: "g++" "-m64" "-Wno-write-strings" "-I/home/hijarian/systems/cl-test-grid/work-dir/agent/quicklisp/dists/quicklisp/software/iolib-20150302-git/src/grovel/" "-o" "/home/hijarian/systems/cl-test-grid/work-dir/agent/test-runs/20150518190329-sbcl-1.2.3-linux-x64/fasl/ql/dists/quicklisp/software/iolib-20150302-git/src/syscalls/ffi-types-unix" "/home/hijarian/systems/cl-test-grid/work-dir/agent/test-runs/20150518190329-sbcl-1.2.3-linux-x64/fasl/ql/dists/quicklisp/software/iolib-20150302-git/src/syscalls/ffi-types-unix.c" Output was: /home/hijarian/systems/cl-test-grid/work-dir/agent/test-runs/20150518190329-sbcl-1.2.3-linux-x64/fasl/ql/dists/quicklisp/software/iolib-20150302-git/src/syscalls/ffi-types-unix.c:14:17: fatal error: lfp.h: Нет такого файла или каталога #include <lfp.h> ^ compilation terminated.
(LOAD hu.dwim.perec.oracle.test FAIL) COMMON-LISP:SIMPLE-ERROR : External process exited with code 1. Command was: "g++" "-m64" "-Wno-write-strings" "-I/home/hijarian/systems/cl-test-grid/work-dir/agent/quicklisp/dists/quicklisp/software/iolib-20150302-git/src/grovel/" "-o" "/home/hijarian/systems/cl-test-grid/work-dir/agent/test-runs/20150518190329-sbcl-1.2.3-linux-x64/fasl/ql/dists/quicklisp/software/iolib-20150302-git/src/syscalls/ffi-types-unix" "/home/hijarian/systems/cl-test-grid/work-dir/agent/test-runs/20150518190329-sbcl-1.2.3-linux-x64/fasl/ql/dists/quicklisp/software/iolib-20150302-git/src/syscalls/ffi-types-unix.c" Output was: /home/hijarian/systems/cl-test-grid/work-dir/agent/test-runs/20150518190329-sbcl-1.2.3-linux-x64/fasl/ql/dists/quicklisp/software/iolib-20150302-git/src/syscalls/ffi-types-unix.c:14:17: fatal error: lfp.h: Нет такого файла или каталога #include <lfp.h> ^ compilation terminated.
(LOAD hu.dwim.perec.all.test FAIL) COMMON-LISP:SIMPLE-ERROR : External process exited with code 1. Command was: "g++" "-m64" "-Wno-write-strings" "-I/home/hijarian/systems/cl-test-grid/work-dir/agent/quicklisp/dists/quicklisp/software/iolib-20150302-git/src/grovel/" "-o" "/home/hijarian/systems/cl-test-grid/work-dir/agent/test-runs/20150518190329-sbcl-1.2.3-linux-x64/fasl/ql/dists/quicklisp/software/iolib-20150302-git/src/syscalls/ffi-types-unix" "/home/hijarian/systems/cl-test-grid/work-dir/agent/test-runs/20150518190329-sbcl-1.2.3-linux-x64/fasl/ql/dists/quicklisp/software/iolib-20150302-git/src/syscalls/ffi-types-unix.c" Output was: /home/hijarian/systems/cl-test-grid/work-dir/agent/test-runs/20150518190329-sbcl-1.2.3-linux-x64/fasl/ql/dists/quicklisp/software/iolib-20150302-git/src/syscalls/ffi-types-unix.c:14:17: fatal error: lfp.h: Нет такого файла или каталога #include <lfp.h> ^ compilation terminated.
(LOAD hu.dwim.perec+iolib FAIL) COMMON-LISP:SIMPLE-ERROR : External process exited with code 1. Command was: "g++" "-m64" "-Wno-write-strings" "-I/home/hijarian/systems/cl-test-grid/work-dir/agent/quicklisp/dists/quicklisp/software/iolib-20150302-git/src/grovel/" "-o" "/home/hijarian/systems/cl-test-grid/work-dir/agent/test-runs/20150518190329-sbcl-1.2.3-linux-x64/fasl/ql/dists/quicklisp/software/iolib-20150302-git/src/syscalls/ffi-types-unix" "/home/hijarian/systems/cl-test-grid/work-dir/agent/test-runs/20150518190329-sbcl-1.2.3-linux-x64/fasl/ql/dists/quicklisp/software/iolib-20150302-git/src/syscalls/ffi-types-unix.c" Output was: /home/hijarian/systems/cl-test-grid/work-dir/agent/test-runs/20150518190329-sbcl-1.2.3-linux-x64/fasl/ql/dists/quicklisp/software/iolib-20150302-git/src/syscalls/ffi-types-unix.c:14:17: fatal error: lfp.h: Нет такого файла или каталога #include <lfp.h> ^ compilation terminated.
sbcl-1.2.6-linux-x86
(LOAD hu.dwim.perec.test FAIL) ffi, CFFI:LOAD-FOREIGN-LIBRARY-ERROR : Unable to load foreign library (ZLIB). Error opening shared object "libz.so": libz.so: cannot open shared object file: No such file or directory.
(LOAD hu.dwim.perec.sqlite.test FAIL) ffi, CFFI:LOAD-FOREIGN-LIBRARY-ERROR : Unable to load foreign library (ZLIB). Error opening shared object "libz.so": libz.so: cannot open shared object file: No such file or directory.
(LOAD hu.dwim.perec.postgresql.test FAIL) ffi, CFFI:LOAD-FOREIGN-LIBRARY-ERROR : Unable to load foreign library (ZLIB). Error opening shared object "libz.so": libz.so: cannot open shared object file: No such file or directory.
(LOAD hu.dwim.perec.oracle.test FAIL) ffi, CFFI:LOAD-FOREIGN-LIBRARY-ERROR : Unable to load foreign library (ZLIB). Error opening shared object "libz.so": libz.so: cannot open shared object file: No such file or directory.
(LOAD hu.dwim.perec.all.test FAIL) ffi, CFFI:LOAD-FOREIGN-LIBRARY-ERROR : Unable to load foreign library (ZLIB). Error opening shared object "libz.so": libz.so: cannot open shared object file: No such file or directory.
(LOAD hu.dwim.perec.test FAIL) ffi, CFFI:LOAD-FOREIGN-LIBRARY-ERROR : Unable to load foreign library (ZLIB). Error opening shared object "libz.so": libz.so: cannot open shared object file: No such file or directory.
(LOAD hu.dwim.perec.sqlite.test FAIL) ffi, CFFI:LOAD-FOREIGN-LIBRARY-ERROR : Unable to load foreign library (ZLIB). Error opening shared object "libz.so": libz.so: cannot open shared object file: No such file or directory.
(LOAD hu.dwim.perec.postgresql.test FAIL) ffi, CFFI:LOAD-FOREIGN-LIBRARY-ERROR : Unable to load foreign library (ZLIB). Error opening shared object "libz.so": libz.so: cannot open shared object file: No such file or directory.
(LOAD hu.dwim.perec.oracle.test FAIL) ffi, CFFI:LOAD-FOREIGN-LIBRARY-ERROR : Unable to load foreign library (ZLIB). Error opening shared object "libz.so": libz.so: cannot open shared object file: No such file or directory.
(LOAD hu.dwim.perec.all.test FAIL) ffi, CFFI:LOAD-FOREIGN-LIBRARY-ERROR : Unable to load foreign library (ZLIB). Error opening shared object "libz.so": libz.so: cannot open shared object file: No such file or directory.

Breakdown by testcases: for every failed testcase the lisp implmentations it fails on

The library does not have a testsuite adapter for CL Test Grid.

To reports overview

Generated at: 2015-06-20 14:24:33 GMT.