hemlock results collected by cl-test-grid

Results on the last two Quicklisp distributions

 quicklisp 2015-07-10quicklisp 2015-06-08
abcl-1.2.1-fasl42-linux-x86
(LOAD hemlock.tty FAIL) ASDF/FIND-SYSTEM:LOAD-SYSTEM-DEFINITION-ERROR : Error while trying to load definition for system conium from pathname /home/testgrid/cl-test-grid/work-dir/agent/quicklisp/dists/quicklisp/software/conium-20140713-git/conium.asd: Invalid component designator: (abcl)
(LOAD hemlock.qt FAIL) ASDF/FIND-SYSTEM:LOAD-SYSTEM-DEFINITION-ERROR : Error while trying to load definition for system conium from pathname /home/testgrid/cl-test-grid/work-dir/agent/quicklisp/dists/quicklisp/software/conium-20140713-git/conium.asd: Invalid component designator: (abcl)
(LOAD hemlock.clx FAIL) ASDF/FIND-SYSTEM:LOAD-SYSTEM-DEFINITION-ERROR : Error while trying to load definition for system conium from pathname /home/testgrid/cl-test-grid/work-dir/agent/quicklisp/dists/quicklisp/software/conium-20140713-git/conium.asd: Invalid component designator: (abcl)
(LOAD hemlock.base FAIL) ASDF/FIND-SYSTEM:LOAD-SYSTEM-DEFINITION-ERROR : Error while trying to load definition for system conium from pathname /home/testgrid/cl-test-grid/work-dir/agent/quicklisp/dists/quicklisp/software/conium-20140713-git/conium.asd: Invalid component designator: (abcl)
(LOAD hemlock.tty FAIL) ASDF/FIND-SYSTEM:LOAD-SYSTEM-DEFINITION-ERROR : Error while trying to load definition for system conium from pathname /home/testgrid/cl-test-grid/work-dir/agent/quicklisp/dists/quicklisp/software/conium-20140713-git/conium.asd: Invalid component designator: (abcl)
(LOAD hemlock.qt FAIL) ASDF/FIND-SYSTEM:LOAD-SYSTEM-DEFINITION-ERROR : Error while trying to load definition for system conium from pathname /home/testgrid/cl-test-grid/work-dir/agent/quicklisp/dists/quicklisp/software/conium-20140713-git/conium.asd: Invalid component designator: (abcl)
(LOAD hemlock.clx FAIL) ASDF/FIND-SYSTEM:LOAD-SYSTEM-DEFINITION-ERROR : Error while trying to load definition for system conium from pathname /home/testgrid/cl-test-grid/work-dir/agent/quicklisp/dists/quicklisp/software/conium-20140713-git/conium.asd: Invalid component designator: (abcl)
(LOAD hemlock.base FAIL) ASDF/FIND-SYSTEM:LOAD-SYSTEM-DEFINITION-ERROR : Error while trying to load definition for system conium from pathname /home/testgrid/cl-test-grid/work-dir/agent/quicklisp/dists/quicklisp/software/conium-20140713-git/conium.asd: Invalid component designator: (abcl)
abcl-1.3.0-fasl42-linux-x86
(LOAD hemlock.tty FAIL) ASDF/FIND-SYSTEM:LOAD-SYSTEM-DEFINITION-ERROR : Error while trying to load definition for system conium from pathname /home/testgrid/cl-test-grid/work-dir/agent/quicklisp/dists/quicklisp/software/conium-20140713-git/conium.asd: Invalid component designator: (abcl)
(LOAD hemlock.qt FAIL) ASDF/FIND-SYSTEM:LOAD-SYSTEM-DEFINITION-ERROR : Error while trying to load definition for system conium from pathname /home/testgrid/cl-test-grid/work-dir/agent/quicklisp/dists/quicklisp/software/conium-20140713-git/conium.asd: Invalid component designator: (abcl)
(LOAD hemlock.clx FAIL) ASDF/FIND-SYSTEM:LOAD-SYSTEM-DEFINITION-ERROR : Error while trying to load definition for system clx from pathname /home/testgrid/cl-test-grid/work-dir/agent/quicklisp/dists/quicklisp/software/clx-20150407-git/clx.asd: don't recognize component type :XRENDER-SOURCE-FILE
(LOAD hemlock.base FAIL) ASDF/FIND-SYSTEM:LOAD-SYSTEM-DEFINITION-ERROR : Error while trying to load definition for system conium from pathname /home/testgrid/cl-test-grid/work-dir/agent/quicklisp/dists/quicklisp/software/conium-20140713-git/conium.asd: Invalid component designator: (abcl)
(LOAD hemlock.tty FAIL) ASDF/FIND-SYSTEM:LOAD-SYSTEM-DEFINITION-ERROR : Error while trying to load definition for system conium from pathname /home/testgrid/cl-test-grid/work-dir/agent/quicklisp/dists/quicklisp/software/conium-20140713-git/conium.asd: Invalid component designator: (abcl)
(LOAD hemlock.qt FAIL) ASDF/FIND-SYSTEM:LOAD-SYSTEM-DEFINITION-ERROR : Error while trying to load definition for system conium from pathname /home/testgrid/cl-test-grid/work-dir/agent/quicklisp/dists/quicklisp/software/conium-20140713-git/conium.asd: Invalid component designator: (abcl)
(LOAD hemlock.clx FAIL) ASDF/FIND-SYSTEM:LOAD-SYSTEM-DEFINITION-ERROR : Error while trying to load definition for system clx from pathname /home/testgrid/cl-test-grid/work-dir/agent/quicklisp/dists/quicklisp/software/clx-20150407-git/clx.asd: don't recognize component type :XRENDER-SOURCE-FILE
(LOAD hemlock.base FAIL) ASDF/FIND-SYSTEM:LOAD-SYSTEM-DEFINITION-ERROR : Error while trying to load definition for system conium from pathname /home/testgrid/cl-test-grid/work-dir/agent/quicklisp/dists/quicklisp/software/conium-20140713-git/conium.asd: Invalid component designator: (abcl)
abcl-1.3.1-fasl42-linux-x86
(LOAD hemlock.tty FAIL) ASDF/FIND-SYSTEM:LOAD-SYSTEM-DEFINITION-ERROR : Error while trying to load definition for system conium from pathname /home/testgrid/cl-test-grid/work-dir/agent/quicklisp/dists/quicklisp/software/conium-20140713-git/conium.asd: Invalid component designator: (abcl)
(LOAD hemlock.qt FAIL) ASDF/FIND-SYSTEM:LOAD-SYSTEM-DEFINITION-ERROR : Error while trying to load definition for system conium from pathname /home/testgrid/cl-test-grid/work-dir/agent/quicklisp/dists/quicklisp/software/conium-20140713-git/conium.asd: Invalid component designator: (abcl)
(LOAD hemlock.clx FAIL) ASDF/FIND-SYSTEM:LOAD-SYSTEM-DEFINITION-ERROR : Error while trying to load definition for system conium from pathname /home/testgrid/cl-test-grid/work-dir/agent/quicklisp/dists/quicklisp/software/conium-20140713-git/conium.asd: Invalid component designator: (abcl)
(LOAD hemlock.base FAIL) ASDF/FIND-SYSTEM:LOAD-SYSTEM-DEFINITION-ERROR : Error while trying to load definition for system conium from pathname /home/testgrid/cl-test-grid/work-dir/agent/quicklisp/dists/quicklisp/software/conium-20140713-git/conium.asd: Invalid component designator: (abcl)
(LOAD hemlock.tty FAIL) ASDF/FIND-SYSTEM:LOAD-SYSTEM-DEFINITION-ERROR : Error while trying to load definition for system conium from pathname /home/testgrid/cl-test-grid/work-dir/agent/quicklisp/dists/quicklisp/software/conium-20140713-git/conium.asd: Invalid component designator: (abcl)
(LOAD hemlock.qt FAIL) ASDF/FIND-SYSTEM:LOAD-SYSTEM-DEFINITION-ERROR : Error while trying to load definition for system conium from pathname /home/testgrid/cl-test-grid/work-dir/agent/quicklisp/dists/quicklisp/software/conium-20140713-git/conium.asd: Invalid component designator: (abcl)
(LOAD hemlock.clx FAIL) ASDF/FIND-SYSTEM:LOAD-SYSTEM-DEFINITION-ERROR : Error while trying to load definition for system conium from pathname /home/testgrid/cl-test-grid/work-dir/agent/quicklisp/dists/quicklisp/software/conium-20140713-git/conium.asd: Invalid component designator: (abcl)
(LOAD hemlock.base FAIL) ASDF/FIND-SYSTEM:LOAD-SYSTEM-DEFINITION-ERROR : Error while trying to load definition for system conium from pathname /home/testgrid/cl-test-grid/work-dir/agent/quicklisp/dists/quicklisp/software/conium-20140713-git/conium.asd: Invalid component designator: (abcl)
abcl-1.3.2-fasl42-linux-x86
(LOAD hemlock.tty FAIL) ASDF/FIND-SYSTEM:LOAD-SYSTEM-DEFINITION-ERROR : Error while trying to load definition for system conium from pathname /home/testgrid/cl-test-grid/work-dir/agent/quicklisp/dists/quicklisp/software/conium-20140713-git/conium.asd: Invalid component designator: (abcl)
(LOAD hemlock.qt FAIL) ASDF/FIND-SYSTEM:LOAD-SYSTEM-DEFINITION-ERROR : Error while trying to load definition for system conium from pathname /home/testgrid/cl-test-grid/work-dir/agent/quicklisp/dists/quicklisp/software/conium-20140713-git/conium.asd: Invalid component designator: (abcl)
(LOAD hemlock.clx FAIL) ASDF/FIND-SYSTEM:LOAD-SYSTEM-DEFINITION-ERROR : Error while trying to load definition for system conium from pathname /home/testgrid/cl-test-grid/work-dir/agent/quicklisp/dists/quicklisp/software/conium-20140713-git/conium.asd: Invalid component designator: (abcl)
(LOAD hemlock.base FAIL) ASDF/FIND-SYSTEM:LOAD-SYSTEM-DEFINITION-ERROR : Error while trying to load definition for system conium from pathname /home/testgrid/cl-test-grid/work-dir/agent/quicklisp/dists/quicklisp/software/conium-20140713-git/conium.asd: Invalid component designator: (abcl)
(LOAD hemlock.tty FAIL) ASDF/FIND-SYSTEM:LOAD-SYSTEM-DEFINITION-ERROR : Error while trying to load definition for system conium from pathname /home/testgrid/cl-test-grid/work-dir/agent/quicklisp/dists/quicklisp/software/conium-20140713-git/conium.asd: Invalid component designator: (abcl)
(LOAD hemlock.qt FAIL) ASDF/FIND-SYSTEM:LOAD-SYSTEM-DEFINITION-ERROR : Error while trying to load definition for system conium from pathname /home/testgrid/cl-test-grid/work-dir/agent/quicklisp/dists/quicklisp/software/conium-20140713-git/conium.asd: Invalid component designator: (abcl)
(LOAD hemlock.clx FAIL) ASDF/FIND-SYSTEM:LOAD-SYSTEM-DEFINITION-ERROR : Error while trying to load definition for system conium from pathname /home/testgrid/cl-test-grid/work-dir/agent/quicklisp/dists/quicklisp/software/conium-20140713-git/conium.asd: Invalid component designator: (abcl)
(LOAD hemlock.base FAIL) ASDF/FIND-SYSTEM:LOAD-SYSTEM-DEFINITION-ERROR : Error while trying to load definition for system conium from pathname /home/testgrid/cl-test-grid/work-dir/agent/quicklisp/dists/quicklisp/software/conium-20140713-git/conium.asd: Invalid component designator: (abcl)
ccl-1.10-r16196-f96-linux-x64
(LOAD hemlock.tty FAIL) COMMON-LISP:SIMPLE-ERROR : External process exited with code 1. Command was: "g++" "-m64" "-Wno-write-strings" "-I/home/hijarian/systems/cl-test-grid/work-dir/agent/quicklisp/dists/quicklisp/software/iolib-20150302-git/src/grovel/" "-o" "/home/hijarian/systems/cl-test-grid/work-dir/agent/test-runs/20150609102449-ccl-1.10-r16196-f96-linux-x64/fasl/ql/dists/quicklisp/software/iolib-20150302-git/src/syscalls/ffi-types-unix" "/home/hijarian/systems/cl-test-grid/work-dir/agent/test-runs/20150609102449-ccl-1.10-r16196-f96-linux-x64/fasl/ql/dists/quicklisp/software/iolib-20150302-git/src/syscalls/ffi-types-unix.c" Output was: /home/hijarian/systems/cl-test-grid/work-dir/agent/test-runs/20150609102449-ccl-1.10-r16196-f96-linux-x64/fasl/ql/dists/quicklisp/software/iolib-20150302-git/src/syscalls/ffi-types-unix.c:14:17: fatal error: lfp.h: Нет такого файла или каталога #include <lfp.h> ^ compilation terminated.
(LOAD hemlock.qt FAIL) COMMON-LISP:SIMPLE-ERROR : External process exited with code 1. Command was: "g++" "-m64" "-Wno-write-strings" "-I/home/hijarian/systems/cl-test-grid/work-dir/agent/quicklisp/dists/quicklisp/software/iolib-20150302-git/src/grovel/" "-o" "/home/hijarian/systems/cl-test-grid/work-dir/agent/test-runs/20150609102449-ccl-1.10-r16196-f96-linux-x64/fasl/ql/dists/quicklisp/software/iolib-20150302-git/src/syscalls/ffi-types-unix" "/home/hijarian/systems/cl-test-grid/work-dir/agent/test-runs/20150609102449-ccl-1.10-r16196-f96-linux-x64/fasl/ql/dists/quicklisp/software/iolib-20150302-git/src/syscalls/ffi-types-unix.c" Output was: /home/hijarian/systems/cl-test-grid/work-dir/agent/test-runs/20150609102449-ccl-1.10-r16196-f96-linux-x64/fasl/ql/dists/quicklisp/software/iolib-20150302-git/src/syscalls/ffi-types-unix.c:14:17: fatal error: lfp.h: Нет такого файла или каталога #include <lfp.h> ^ compilation terminated.
(LOAD hemlock.clx FAIL) COMMON-LISP:SIMPLE-ERROR : External process exited with code 1. Command was: "g++" "-m64" "-Wno-write-strings" "-I/home/hijarian/systems/cl-test-grid/work-dir/agent/quicklisp/dists/quicklisp/software/iolib-20150302-git/src/grovel/" "-o" "/home/hijarian/systems/cl-test-grid/work-dir/agent/test-runs/20150609102449-ccl-1.10-r16196-f96-linux-x64/fasl/ql/dists/quicklisp/software/iolib-20150302-git/src/syscalls/ffi-types-unix" "/home/hijarian/systems/cl-test-grid/work-dir/agent/test-runs/20150609102449-ccl-1.10-r16196-f96-linux-x64/fasl/ql/dists/quicklisp/software/iolib-20150302-git/src/syscalls/ffi-types-unix.c" Output was: /home/hijarian/systems/cl-test-grid/work-dir/agent/test-runs/20150609102449-ccl-1.10-r16196-f96-linux-x64/fasl/ql/dists/quicklisp/software/iolib-20150302-git/src/syscalls/ffi-types-unix.c:14:17: fatal error: lfp.h: Нет такого файла или каталога #include <lfp.h> ^ compilation terminated.
(LOAD hemlock.base FAIL) COMMON-LISP:SIMPLE-ERROR : External process exited with code 1. Command was: "g++" "-m64" "-Wno-write-strings" "-I/home/hijarian/systems/cl-test-grid/work-dir/agent/quicklisp/dists/quicklisp/software/iolib-20150302-git/src/grovel/" "-o" "/home/hijarian/systems/cl-test-grid/work-dir/agent/test-runs/20150609102449-ccl-1.10-r16196-f96-linux-x64/fasl/ql/dists/quicklisp/software/iolib-20150302-git/src/syscalls/ffi-types-unix" "/home/hijarian/systems/cl-test-grid/work-dir/agent/test-runs/20150609102449-ccl-1.10-r16196-f96-linux-x64/fasl/ql/dists/quicklisp/software/iolib-20150302-git/src/syscalls/ffi-types-unix.c" Output was: /home/hijarian/systems/cl-test-grid/work-dir/agent/test-runs/20150609102449-ccl-1.10-r16196-f96-linux-x64/fasl/ql/dists/quicklisp/software/iolib-20150302-git/src/syscalls/ffi-types-unix.c:14:17: fatal error: lfp.h: Нет такого файла или каталога #include <lfp.h> ^ compilation terminated.
ccl-1.10-r16196-f96-linux-x86
(LOAD hemlock.qt FAIL) COMMON-LISP:SIMPLE-ERROR : No qmake found.
(LOAD hemlock.qt FAIL) COMMON-LISP:SIMPLE-ERROR : No qmake found.
ccl-1.8-r15286m-f95-linux-x86
(LOAD hemlock.tty FAIL) ASDF:MISSING-COMPONENT : Component "iolib/os" not found
(LOAD hemlock.qt FAIL) needs newer ASDF, ASDF:LOAD-SYSTEM-DEFINITION-ERROR : Error while trying to load definition for system named-readtables from pathname /home/testgrid/cl-test-grid/work-dir/agent/quicklisp/dists/quicklisp/software/named-readtables-20150608-git/named-readtables.asd: :MAILTO is an invalid initarg to REINITIALIZE-INSTANCE for #<STANDARD-CLASS ASDF:SYSTEM>. Valid initargs: (:NAME :VERSION :DESCRIPTION :LONG-DESCRIPTION :IN-ORDER-TO :DO-FIRST :PARENT :PATHNAME :AROUND-COMPILE :ENCODING :PROPERTIES :COMPONENTS :IF-COMPONENT-DEP-FAILS :DEFAULT-COMPONENT-CLASS :AUTHOR :MAINTAINER :LICENCE :LICENSE :SOURCE-FILE :DEFSYSTEM-DEPENDS-ON).
(LOAD hemlock.clx FAIL) ASDF:MISSING-COMPONENT : Component "iolib/os" not found
(LOAD hemlock.base FAIL) ASDF:MISSING-COMPONENT : Component "iolib/os" not found
(LOAD hemlock.tty FAIL) ASDF:MISSING-COMPONENT : Component "iolib/os" not found
(LOAD hemlock.qt FAIL) needs newer ASDF, ASDF:LOAD-SYSTEM-DEFINITION-ERROR : Error while trying to load definition for system named-readtables from pathname /home/testgrid/cl-test-grid/work-dir/agent/quicklisp/dists/quicklisp/software/named-readtables-20150608-git/named-readtables.asd: :MAILTO is an invalid initarg to REINITIALIZE-INSTANCE for #<STANDARD-CLASS ASDF:SYSTEM>. Valid initargs: (:NAME :VERSION :DESCRIPTION :LONG-DESCRIPTION :IN-ORDER-TO :DO-FIRST :PARENT :PATHNAME :AROUND-COMPILE :ENCODING :PROPERTIES :COMPONENTS :IF-COMPONENT-DEP-FAILS :DEFAULT-COMPONENT-CLASS :AUTHOR :MAINTAINER :LICENCE :LICENSE :SOURCE-FILE :DEFSYSTEM-DEPENDS-ON).
(LOAD hemlock.clx FAIL) ASDF:MISSING-COMPONENT : Component "iolib/os" not found
(LOAD hemlock.base FAIL) ASDF:MISSING-COMPONENT : Component "iolib/os" not found
ccl-1.9-r15756-f96-linux-x86
(LOAD hemlock.qt FAIL) COMMON-LISP:TYPE-ERROR : The value NIL is not of the expected type NUMBER.
(LOAD hemlock.qt FAIL) COMMON-LISP:TYPE-ERROR : The value NIL is not of the expected type NUMBER.
clisp-2.49-unix-x64
(LOAD hemlock.tty FAIL) ASDF:MISSING-COMPONENT : Component "iolib/os" not found
(LOAD hemlock.qt FAIL) ASDF:LOAD-SYSTEM-DEFINITION-ERROR : Error while trying to load definition for system named-readtables from pathname /home/hijarian/systems/cl-test-grid/work-dir/agent/quicklisp/dists/quicklisp/software/named-readtables-20150608-git/named-readtables.asd: REINITIALIZE-INSTANCE: некорректная пара ключевое слово/значение :MAILTO, "mega@retes.hu" в списке аргументов. Разрешенные ключевые слова: (:NAME :VERSION :IN-ORDER-TO :DO-FIRST :PARENT :PATHNAME :AROUND-COMPILE :ENCODING :PROPERTIES :COMPONENTS :IF-COMPONENT-DEP-FAILS :DEFAULT-COMPONENT-CLASS :DESCRIPTION :LONG-DESCRIPTION :AUTHOR :MAINTAINER :LICENCE :LICENSE :SOURCE-FILE :DEFSYSTEM-DEPENDS-ON)
(LOAD hemlock.clx FAIL) ASDF:MISSING-COMPONENT : Component "iolib/os" not found
(LOAD hemlock.base FAIL) ASDF:MISSING-COMPONENT : Component "iolib/os" not found
clisp-2.49-unix-x86
(LOAD hemlock.tty FAIL) ASDF:MISSING-COMPONENT : Component "iolib/os" not found
(LOAD hemlock.qt FAIL) needs newer ASDF, ASDF:LOAD-SYSTEM-DEFINITION-ERROR : Error while trying to load definition for system named-readtables from pathname /home/testgrid/cl-test-grid/work-dir/agent/quicklisp/dists/quicklisp/software/named-readtables-20150608-git/named-readtables.asd: REINITIALIZE-INSTANCE: illegal keyword/value pair :MAILTO, "mega@retes.hu" in argument list. The allowed keywords are (:NAME :VERSION :IN-ORDER-TO :DO-FIRST :PARENT :PATHNAME :AROUND-COMPILE :ENCODING :PROPERTIES :COMPONENTS :IF-COMPONENT-DEP-FAILS :DEFAULT-COMPONENT-CLASS :DESCRIPTION :LONG-DESCRIPTION :AUTHOR :MAINTAINER :LICENCE :LICENSE :SOURCE-FILE :DEFSYSTEM-DEPENDS-ON)
(LOAD hemlock.clx FAIL) ASDF:MISSING-COMPONENT : Component "iolib/os" not found
(LOAD hemlock.base FAIL) ASDF:MISSING-COMPONENT : Component "iolib/os" not found
(LOAD hemlock.tty FAIL) ASDF:MISSING-COMPONENT : Component "iolib/os" not found
(LOAD hemlock.qt FAIL) needs newer ASDF, ASDF:LOAD-SYSTEM-DEFINITION-ERROR : Error while trying to load definition for system named-readtables from pathname /home/testgrid/cl-test-grid/work-dir/agent/quicklisp/dists/quicklisp/software/named-readtables-20150608-git/named-readtables.asd: REINITIALIZE-INSTANCE: illegal keyword/value pair :MAILTO, "mega@retes.hu" in argument list. The allowed keywords are (:NAME :VERSION :IN-ORDER-TO :DO-FIRST :PARENT :PATHNAME :AROUND-COMPILE :ENCODING :PROPERTIES :COMPONENTS :IF-COMPONENT-DEP-FAILS :DEFAULT-COMPONENT-CLASS :DESCRIPTION :LONG-DESCRIPTION :AUTHOR :MAINTAINER :LICENCE :LICENSE :SOURCE-FILE :DEFSYSTEM-DEPENDS-ON)
(LOAD hemlock.clx FAIL) ASDF:MISSING-COMPONENT : Component "iolib/os" not found
(LOAD hemlock.base FAIL) ASDF:MISSING-COMPONENT : Component "iolib/os" not found
cmu-snapshot-2013-04__20d_unicode_-linux-x86
(LOAD hemlock.tty FAIL) ASDF/FIND-SYSTEM:LOAD-SYSTEM-DEFINITION-ERROR : Error while trying to load definition for system hemlock.base from pathname /home/testgrid/cl-test-grid/work-dir/agent/quicklisp/dists/quicklisp/software/hemlock-20150709-git/hemlock.base.asd: Error in function "Top-Level Form": It looks like you're trying to load a modern version of Hemlock into a CMUCL image that already has an old Hemlock present. Hit the restart to replace all old packages.
(LOAD hemlock.qt FAIL) ASDF/FIND-SYSTEM:LOAD-SYSTEM-DEFINITION-ERROR : Error while trying to load definition for system hemlock.base from pathname /home/testgrid/cl-test-grid/work-dir/agent/quicklisp/dists/quicklisp/software/hemlock-20150709-git/hemlock.base.asd: Error in function "Top-Level Form": It looks like you're trying to load a modern version of Hemlock into a CMUCL image that already has an old Hemlock present. Hit the restart to replace all old packages.
(LOAD hemlock.clx FAIL) ASDF/FIND-SYSTEM:LOAD-SYSTEM-DEFINITION-ERROR : Error while trying to load definition for system hemlock.base from pathname /home/testgrid/cl-test-grid/work-dir/agent/quicklisp/dists/quicklisp/software/hemlock-20150709-git/hemlock.base.asd: Error in function "Top-Level Form": It looks like you're trying to load a modern version of Hemlock into a CMUCL image that already has an old Hemlock present. Hit the restart to replace all old packages.
(LOAD hemlock.base FAIL) ASDF/FIND-SYSTEM:LOAD-SYSTEM-DEFINITION-ERROR : Error while trying to load definition for system hemlock.base from pathname /home/testgrid/cl-test-grid/work-dir/agent/quicklisp/dists/quicklisp/software/hemlock-20150709-git/hemlock.base.asd: Error in function "Top-Level Form": It looks like you're trying to load a modern version of Hemlock into a CMUCL image that already has an old Hemlock present. Hit the restart to replace all old packages.
(LOAD hemlock.tty FAIL) ASDF/FIND-SYSTEM:LOAD-SYSTEM-DEFINITION-ERROR : Error while trying to load definition for system hemlock.base from pathname /home/testgrid/cl-test-grid/work-dir/agent/quicklisp/dists/quicklisp/software/hemlock-20120909-git/hemlock.base.asd: Error in function "Top-Level Form": It looks like you're trying to load a modern version of Hemlock into a CMUCL image that already has an old Hemlock present. Hit the restart to replace all old packages.
(LOAD hemlock.qt FAIL) ASDF/FIND-SYSTEM:LOAD-SYSTEM-DEFINITION-ERROR : Error while trying to load definition for system hemlock.base from pathname /home/testgrid/cl-test-grid/work-dir/agent/quicklisp/dists/quicklisp/software/hemlock-20120909-git/hemlock.base.asd: Error in function "Top-Level Form": It looks like you're trying to load a modern version of Hemlock into a CMUCL image that already has an old Hemlock present. Hit the restart to replace all old packages.
(LOAD hemlock.clx FAIL) ASDF/FIND-SYSTEM:LOAD-SYSTEM-DEFINITION-ERROR : Error while trying to load definition for system hemlock.base from pathname /home/testgrid/cl-test-grid/work-dir/agent/quicklisp/dists/quicklisp/software/hemlock-20120909-git/hemlock.base.asd: Error in function "Top-Level Form": It looks like you're trying to load a modern version of Hemlock into a CMUCL image that already has an old Hemlock present. Hit the restart to replace all old packages.
(LOAD hemlock.base FAIL) ASDF/FIND-SYSTEM:LOAD-SYSTEM-DEFINITION-ERROR : Error while trying to load definition for system hemlock.base from pathname /home/testgrid/cl-test-grid/work-dir/agent/quicklisp/dists/quicklisp/software/hemlock-20120909-git/hemlock.base.asd: Error in function "Top-Level Form": It looks like you're trying to load a modern version of Hemlock into a CMUCL image that already has an old Hemlock present. Hit the restart to replace all old packages.
cmu-snapshot-2014-01__20e_unicode_-linux-x86
(LOAD hemlock.tty FAIL) ASDF/FIND-SYSTEM:LOAD-SYSTEM-DEFINITION-ERROR : Error while trying to load definition for system hemlock.base from pathname /home/testgrid/cl-test-grid/work-dir/agent/quicklisp/dists/quicklisp/software/hemlock-20150709-git/hemlock.base.asd: Error in function "Top-Level Form": It looks like you're trying to load a modern version of Hemlock into a CMUCL image that already has an old Hemlock present. Hit the restart to replace all old packages.
(LOAD hemlock.qt FAIL) ASDF/FIND-SYSTEM:LOAD-SYSTEM-DEFINITION-ERROR : Error while trying to load definition for system hemlock.base from pathname /home/testgrid/cl-test-grid/work-dir/agent/quicklisp/dists/quicklisp/software/hemlock-20150709-git/hemlock.base.asd: Error in function "Top-Level Form": It looks like you're trying to load a modern version of Hemlock into a CMUCL image that already has an old Hemlock present. Hit the restart to replace all old packages.
(LOAD hemlock.clx FAIL) ASDF/FIND-SYSTEM:LOAD-SYSTEM-DEFINITION-ERROR : Error while trying to load definition for system hemlock.base from pathname /home/testgrid/cl-test-grid/work-dir/agent/quicklisp/dists/quicklisp/software/hemlock-20150709-git/hemlock.base.asd: Error in function "Top-Level Form": It looks like you're trying to load a modern version of Hemlock into a CMUCL image that already has an old Hemlock present. Hit the restart to replace all old packages.
(LOAD hemlock.base FAIL) ASDF/FIND-SYSTEM:LOAD-SYSTEM-DEFINITION-ERROR : Error while trying to load definition for system hemlock.base from pathname /home/testgrid/cl-test-grid/work-dir/agent/quicklisp/dists/quicklisp/software/hemlock-20150709-git/hemlock.base.asd: Error in function "Top-Level Form": It looks like you're trying to load a modern version of Hemlock into a CMUCL image that already has an old Hemlock present. Hit the restart to replace all old packages.
(LOAD hemlock.tty FAIL) ASDF/FIND-SYSTEM:LOAD-SYSTEM-DEFINITION-ERROR : Error while trying to load definition for system hemlock.base from pathname /home/testgrid/cl-test-grid/work-dir/agent/quicklisp/dists/quicklisp/software/hemlock-20120909-git/hemlock.base.asd: Error in function "Top-Level Form": It looks like you're trying to load a modern version of Hemlock into a CMUCL image that already has an old Hemlock present. Hit the restart to replace all old packages.
(LOAD hemlock.qt FAIL) ASDF/FIND-SYSTEM:LOAD-SYSTEM-DEFINITION-ERROR : Error while trying to load definition for system hemlock.base from pathname /home/testgrid/cl-test-grid/work-dir/agent/quicklisp/dists/quicklisp/software/hemlock-20120909-git/hemlock.base.asd: Error in function "Top-Level Form": It looks like you're trying to load a modern version of Hemlock into a CMUCL image that already has an old Hemlock present. Hit the restart to replace all old packages.
(LOAD hemlock.clx FAIL) ASDF/FIND-SYSTEM:LOAD-SYSTEM-DEFINITION-ERROR : Error while trying to load definition for system hemlock.base from pathname /home/testgrid/cl-test-grid/work-dir/agent/quicklisp/dists/quicklisp/software/hemlock-20120909-git/hemlock.base.asd: Error in function "Top-Level Form": It looks like you're trying to load a modern version of Hemlock into a CMUCL image that already has an old Hemlock present. Hit the restart to replace all old packages.
(LOAD hemlock.base FAIL) ASDF/FIND-SYSTEM:LOAD-SYSTEM-DEFINITION-ERROR : Error while trying to load definition for system hemlock.base from pathname /home/testgrid/cl-test-grid/work-dir/agent/quicklisp/dists/quicklisp/software/hemlock-20120909-git/hemlock.base.asd: Error in function "Top-Level Form": It looks like you're trying to load a modern version of Hemlock into a CMUCL image that already has an old Hemlock present. Hit the restart to replace all old packages.
cmu-snapshot-2014-05-dirty__20e_unicode_-linux-x86
(LOAD hemlock.tty FAIL) ASDF/FIND-SYSTEM:LOAD-SYSTEM-DEFINITION-ERROR : Error while trying to load definition for system hemlock.base from pathname /home/testgrid/cl-test-grid/work-dir/agent/quicklisp/dists/quicklisp/software/hemlock-20150709-git/hemlock.base.asd: Error in function "Top-Level Form": It looks like you're trying to load a modern version of Hemlock into a CMUCL image that already has an old Hemlock present. Hit the restart to replace all old packages.
(LOAD hemlock.qt FAIL) ASDF/FIND-SYSTEM:LOAD-SYSTEM-DEFINITION-ERROR : Error while trying to load definition for system hemlock.base from pathname /home/testgrid/cl-test-grid/work-dir/agent/quicklisp/dists/quicklisp/software/hemlock-20150709-git/hemlock.base.asd: Error in function "Top-Level Form": It looks like you're trying to load a modern version of Hemlock into a CMUCL image that already has an old Hemlock present. Hit the restart to replace all old packages.
(LOAD hemlock.clx FAIL) ASDF/FIND-SYSTEM:LOAD-SYSTEM-DEFINITION-ERROR : Error while trying to load definition for system hemlock.base from pathname /home/testgrid/cl-test-grid/work-dir/agent/quicklisp/dists/quicklisp/software/hemlock-20150709-git/hemlock.base.asd: Error in function "Top-Level Form": It looks like you're trying to load a modern version of Hemlock into a CMUCL image that already has an old Hemlock present. Hit the restart to replace all old packages.
(LOAD hemlock.base FAIL) ASDF/FIND-SYSTEM:LOAD-SYSTEM-DEFINITION-ERROR : Error while trying to load definition for system hemlock.base from pathname /home/testgrid/cl-test-grid/work-dir/agent/quicklisp/dists/quicklisp/software/hemlock-20150709-git/hemlock.base.asd: Error in function "Top-Level Form": It looks like you're trying to load a modern version of Hemlock into a CMUCL image that already has an old Hemlock present. Hit the restart to replace all old packages.
(LOAD hemlock.tty FAIL) ASDF/FIND-SYSTEM:LOAD-SYSTEM-DEFINITION-ERROR : Error while trying to load definition for system hemlock.base from pathname /home/testgrid/cl-test-grid/work-dir/agent/quicklisp/dists/quicklisp/software/hemlock-20120909-git/hemlock.base.asd: Error in function "Top-Level Form": It looks like you're trying to load a modern version of Hemlock into a CMUCL image that already has an old Hemlock present. Hit the restart to replace all old packages.
(LOAD hemlock.qt FAIL) ASDF/FIND-SYSTEM:LOAD-SYSTEM-DEFINITION-ERROR : Error while trying to load definition for system hemlock.base from pathname /home/testgrid/cl-test-grid/work-dir/agent/quicklisp/dists/quicklisp/software/hemlock-20120909-git/hemlock.base.asd: Error in function "Top-Level Form": It looks like you're trying to load a modern version of Hemlock into a CMUCL image that already has an old Hemlock present. Hit the restart to replace all old packages.
(LOAD hemlock.clx FAIL) ASDF/FIND-SYSTEM:LOAD-SYSTEM-DEFINITION-ERROR : Error while trying to load definition for system hemlock.base from pathname /home/testgrid/cl-test-grid/work-dir/agent/quicklisp/dists/quicklisp/software/hemlock-20120909-git/hemlock.base.asd: Error in function "Top-Level Form": It looks like you're trying to load a modern version of Hemlock into a CMUCL image that already has an old Hemlock present. Hit the restart to replace all old packages.
(LOAD hemlock.base FAIL) ASDF/FIND-SYSTEM:LOAD-SYSTEM-DEFINITION-ERROR : Error while trying to load definition for system hemlock.base from pathname /home/testgrid/cl-test-grid/work-dir/agent/quicklisp/dists/quicklisp/software/hemlock-20120909-git/hemlock.base.asd: Error in function "Top-Level Form": It looks like you're trying to load a modern version of Hemlock into a CMUCL image that already has an old Hemlock present. Hit the restart to replace all old packages.
cmu-snapshot-2014-12___20f_unicode_-linux-x86
(LOAD hemlock.tty FAIL) ASDF/FIND-SYSTEM:LOAD-SYSTEM-DEFINITION-ERROR : Error while trying to load definition for system hemlock.base from pathname /home/testgrid/cl-test-grid/work-dir/agent/quicklisp/dists/quicklisp/software/hemlock-20150709-git/hemlock.base.asd: Error in function "Top-Level Form": It looks like you're trying to load a modern version of Hemlock into a CMUCL image that already has an old Hemlock present. Hit the restart to replace all old packages.
(LOAD hemlock.qt FAIL) ASDF/FIND-SYSTEM:LOAD-SYSTEM-DEFINITION-ERROR : Error while trying to load definition for system hemlock.base from pathname /home/testgrid/cl-test-grid/work-dir/agent/quicklisp/dists/quicklisp/software/hemlock-20150709-git/hemlock.base.asd: Error in function "Top-Level Form": It looks like you're trying to load a modern version of Hemlock into a CMUCL image that already has an old Hemlock present. Hit the restart to replace all old packages.
(LOAD hemlock.clx FAIL) ASDF/FIND-SYSTEM:LOAD-SYSTEM-DEFINITION-ERROR : Error while trying to load definition for system hemlock.base from pathname /home/testgrid/cl-test-grid/work-dir/agent/quicklisp/dists/quicklisp/software/hemlock-20150709-git/hemlock.base.asd: Error in function "Top-Level Form": It looks like you're trying to load a modern version of Hemlock into a CMUCL image that already has an old Hemlock present. Hit the restart to replace all old packages.
(LOAD hemlock.base FAIL) ASDF/FIND-SYSTEM:LOAD-SYSTEM-DEFINITION-ERROR : Error while trying to load definition for system hemlock.base from pathname /home/testgrid/cl-test-grid/work-dir/agent/quicklisp/dists/quicklisp/software/hemlock-20150709-git/hemlock.base.asd: Error in function "Top-Level Form": It looks like you're trying to load a modern version of Hemlock into a CMUCL image that already has an old Hemlock present. Hit the restart to replace all old packages.
(LOAD hemlock.tty FAIL) ASDF/FIND-SYSTEM:LOAD-SYSTEM-DEFINITION-ERROR : Error while trying to load definition for system hemlock.base from pathname /home/testgrid/cl-test-grid/work-dir/agent/quicklisp/dists/quicklisp/software/hemlock-20120909-git/hemlock.base.asd: Error in function "Top-Level Form": It looks like you're trying to load a modern version of Hemlock into a CMUCL image that already has an old Hemlock present. Hit the restart to replace all old packages.
(LOAD hemlock.qt FAIL) ASDF/FIND-SYSTEM:LOAD-SYSTEM-DEFINITION-ERROR : Error while trying to load definition for system hemlock.base from pathname /home/testgrid/cl-test-grid/work-dir/agent/quicklisp/dists/quicklisp/software/hemlock-20120909-git/hemlock.base.asd: Error in function "Top-Level Form": It looks like you're trying to load a modern version of Hemlock into a CMUCL image that already has an old Hemlock present. Hit the restart to replace all old packages.
(LOAD hemlock.clx FAIL) ASDF/FIND-SYSTEM:LOAD-SYSTEM-DEFINITION-ERROR : Error while trying to load definition for system hemlock.base from pathname /home/testgrid/cl-test-grid/work-dir/agent/quicklisp/dists/quicklisp/software/hemlock-20120909-git/hemlock.base.asd: Error in function "Top-Level Form": It looks like you're trying to load a modern version of Hemlock into a CMUCL image that already has an old Hemlock present. Hit the restart to replace all old packages.
(LOAD hemlock.base FAIL) ASDF/FIND-SYSTEM:LOAD-SYSTEM-DEFINITION-ERROR : Error while trying to load definition for system hemlock.base from pathname /home/testgrid/cl-test-grid/work-dir/agent/quicklisp/dists/quicklisp/software/hemlock-20120909-git/hemlock.base.asd: Error in function "Top-Level Form": It looks like you're trying to load a modern version of Hemlock into a CMUCL image that already has an old Hemlock present. Hit the restart to replace all old packages.
ecl-13.5.1-unknown-linux-i686-bytecode
(LOAD hemlock.tty FAIL) ASDF/FIND-SYSTEM:LOAD-SYSTEM-DEFINITION-ERROR : Error while trying to load definition for system osicat from pathname /home/testgrid/cl-test-grid/work-dir/agent/quicklisp/dists/quicklisp/software/osicat-20150709-git/osicat.asd: The variable C::*CC-FLAGS* is unbound.
(LOAD hemlock.qt FAIL) ASDF/FIND-SYSTEM:LOAD-SYSTEM-DEFINITION-ERROR : Error while trying to load definition for system osicat from pathname /home/testgrid/cl-test-grid/work-dir/agent/quicklisp/dists/quicklisp/software/osicat-20150709-git/osicat.asd: The variable C::*CC-FLAGS* is unbound.
(LOAD hemlock.clx FAIL) ASDF/FIND-SYSTEM:LOAD-SYSTEM-DEFINITION-ERROR : Error while trying to load definition for system osicat from pathname /home/testgrid/cl-test-grid/work-dir/agent/quicklisp/dists/quicklisp/software/osicat-20150709-git/osicat.asd: The variable C::*CC-FLAGS* is unbound.
(LOAD hemlock.base FAIL) ASDF/FIND-SYSTEM:LOAD-SYSTEM-DEFINITION-ERROR : Error while trying to load definition for system osicat from pathname /home/testgrid/cl-test-grid/work-dir/agent/quicklisp/dists/quicklisp/software/osicat-20150709-git/osicat.asd: The variable C::*CC-FLAGS* is unbound.
(LOAD hemlock.tty FAIL) ASDF/FIND-SYSTEM:LOAD-SYSTEM-DEFINITION-ERROR : Error while trying to load definition for system osicat from pathname /home/testgrid/cl-test-grid/work-dir/agent/quicklisp/dists/quicklisp/software/osicat-20150608-git/osicat.asd: The variable C::*CC-FLAGS* is unbound.
(LOAD hemlock.qt FAIL) ASDF/FIND-SYSTEM:LOAD-SYSTEM-DEFINITION-ERROR : Error while trying to load definition for system osicat from pathname /home/testgrid/cl-test-grid/work-dir/agent/quicklisp/dists/quicklisp/software/osicat-20150608-git/osicat.asd: The variable C::*CC-FLAGS* is unbound.
(LOAD hemlock.clx FAIL) ASDF/FIND-SYSTEM:LOAD-SYSTEM-DEFINITION-ERROR : Error while trying to load definition for system osicat from pathname /home/testgrid/cl-test-grid/work-dir/agent/quicklisp/dists/quicklisp/software/osicat-20150608-git/osicat.asd: The variable C::*CC-FLAGS* is unbound.
(LOAD hemlock.base FAIL) ASDF/FIND-SYSTEM:LOAD-SYSTEM-DEFINITION-ERROR : Error while trying to load definition for system osicat from pathname /home/testgrid/cl-test-grid/work-dir/agent/quicklisp/dists/quicklisp/software/osicat-20150608-git/osicat.asd: The variable C::*CC-FLAGS* is unbound.
ecl-13.5.1-unknown-linux-i686-lisp-to-c
(LOAD hemlock.tty FAIL) ASDF/FIND-SYSTEM:LOAD-SYSTEM-DEFINITION-ERROR : Error while trying to load definition for system osicat from pathname /home/testgrid/cl-test-grid/work-dir/agent/quicklisp/dists/quicklisp/software/osicat-20150709-git/osicat.asd: COMPILE-FILE-ERROR while compiling #<cl-source-file "alexandria" "macros">
(LOAD hemlock.qt FAIL) ASDF/FIND-SYSTEM:LOAD-SYSTEM-DEFINITION-ERROR : Error while trying to load definition for system osicat from pathname /home/testgrid/cl-test-grid/work-dir/agent/quicklisp/dists/quicklisp/software/osicat-20150709-git/osicat.asd: COMPILE-FILE-ERROR while compiling #<cl-source-file "alexandria" "macros">
(LOAD hemlock.clx FAIL) ASDF/FIND-SYSTEM:LOAD-SYSTEM-DEFINITION-ERROR : Error while trying to load definition for system osicat from pathname /home/testgrid/cl-test-grid/work-dir/agent/quicklisp/dists/quicklisp/software/osicat-20150709-git/osicat.asd: COMPILE-FILE-ERROR while compiling #<cl-source-file "alexandria" "macros">
(LOAD hemlock.base FAIL) ASDF/FIND-SYSTEM:LOAD-SYSTEM-DEFINITION-ERROR : Error while trying to load definition for system osicat from pathname /home/testgrid/cl-test-grid/work-dir/agent/quicklisp/dists/quicklisp/software/osicat-20150709-git/osicat.asd: COMPILE-FILE-ERROR while compiling #<cl-source-file "alexandria" "macros">
(LOAD hemlock.tty FAIL) ASDF/FIND-SYSTEM:LOAD-SYSTEM-DEFINITION-ERROR : Error while trying to load definition for system osicat from pathname /home/testgrid/cl-test-grid/work-dir/agent/quicklisp/dists/quicklisp/software/osicat-20150608-git/osicat.asd: COMPILE-FILE-ERROR while compiling #<cl-source-file "alexandria" "macros">
(LOAD hemlock.qt FAIL) ASDF/FIND-SYSTEM:LOAD-SYSTEM-DEFINITION-ERROR : Error while trying to load definition for system osicat from pathname /home/testgrid/cl-test-grid/work-dir/agent/quicklisp/dists/quicklisp/software/osicat-20150608-git/osicat.asd: COMPILE-FILE-ERROR while compiling #<cl-source-file "alexandria" "macros">
(LOAD hemlock.clx FAIL) ASDF/FIND-SYSTEM:LOAD-SYSTEM-DEFINITION-ERROR : Error while trying to load definition for system osicat from pathname /home/testgrid/cl-test-grid/work-dir/agent/quicklisp/dists/quicklisp/software/osicat-20150608-git/osicat.asd: COMPILE-FILE-ERROR while compiling #<cl-source-file "alexandria" "macros">
(LOAD hemlock.base FAIL) ASDF/FIND-SYSTEM:LOAD-SYSTEM-DEFINITION-ERROR : Error while trying to load definition for system osicat from pathname /home/testgrid/cl-test-grid/work-dir/agent/quicklisp/dists/quicklisp/software/osicat-20150608-git/osicat.asd: COMPILE-FILE-ERROR while compiling #<cl-source-file "alexandria" "macros">
ecl-15.2.21-ee989b97-linux-i686-bytecode
(LOAD hemlock.tty FAIL) ASDF/FIND-SYSTEM:LOAD-SYSTEM-DEFINITION-ERROR : Error while trying to load definition for system osicat from pathname /home/testgrid/cl-test-grid/work-dir/agent/quicklisp/dists/quicklisp/software/osicat-20150709-git/osicat.asd: The variable C::*CC-FLAGS* is unbound.
(LOAD hemlock.qt FAIL) ASDF/FIND-SYSTEM:LOAD-SYSTEM-DEFINITION-ERROR : Error while trying to load definition for system osicat from pathname /home/testgrid/cl-test-grid/work-dir/agent/quicklisp/dists/quicklisp/software/osicat-20150709-git/osicat.asd: The variable C::*CC-FLAGS* is unbound.
(LOAD hemlock.clx FAIL) ASDF/FIND-SYSTEM:LOAD-SYSTEM-DEFINITION-ERROR : Error while trying to load definition for system osicat from pathname /home/testgrid/cl-test-grid/work-dir/agent/quicklisp/dists/quicklisp/software/osicat-20150709-git/osicat.asd: The variable C::*CC-FLAGS* is unbound.
(LOAD hemlock.base FAIL) ASDF/FIND-SYSTEM:LOAD-SYSTEM-DEFINITION-ERROR : Error while trying to load definition for system osicat from pathname /home/testgrid/cl-test-grid/work-dir/agent/quicklisp/dists/quicklisp/software/osicat-20150709-git/osicat.asd: The variable C::*CC-FLAGS* is unbound.
(LOAD hemlock.tty FAIL) ASDF/FIND-SYSTEM:LOAD-SYSTEM-DEFINITION-ERROR : Error while trying to load definition for system osicat from pathname /home/testgrid/cl-test-grid/work-dir/agent/quicklisp/dists/quicklisp/software/osicat-20150608-git/osicat.asd: The variable C::*CC-FLAGS* is unbound.
(LOAD hemlock.qt FAIL) ASDF/FIND-SYSTEM:LOAD-SYSTEM-DEFINITION-ERROR : Error while trying to load definition for system osicat from pathname /home/testgrid/cl-test-grid/work-dir/agent/quicklisp/dists/quicklisp/software/osicat-20150608-git/osicat.asd: The variable C::*CC-FLAGS* is unbound.
(LOAD hemlock.clx FAIL) ASDF/FIND-SYSTEM:LOAD-SYSTEM-DEFINITION-ERROR : Error while trying to load definition for system osicat from pathname /home/testgrid/cl-test-grid/work-dir/agent/quicklisp/dists/quicklisp/software/osicat-20150608-git/osicat.asd: The variable C::*CC-FLAGS* is unbound.
(LOAD hemlock.base FAIL) ASDF/FIND-SYSTEM:LOAD-SYSTEM-DEFINITION-ERROR : Error while trying to load definition for system osicat from pathname /home/testgrid/cl-test-grid/work-dir/agent/quicklisp/dists/quicklisp/software/osicat-20150608-git/osicat.asd: The variable C::*CC-FLAGS* is unbound.
ecl-15.2.21-ee989b97-linux-i686-lisp-to-c
(LOAD hemlock.tty FAIL) ASDF/FIND-SYSTEM:LOAD-SYSTEM-DEFINITION-ERROR : Error while trying to load definition for system osicat from pathname /home/testgrid/cl-test-grid/work-dir/agent/quicklisp/dists/quicklisp/software/osicat-20150709-git/osicat.asd: COMPILE-FILE-ERROR while compiling #<cl-source-file "alexandria" "macros">
(LOAD hemlock.qt FAIL) ASDF/FIND-SYSTEM:LOAD-SYSTEM-DEFINITION-ERROR : Error while trying to load definition for system osicat from pathname /home/testgrid/cl-test-grid/work-dir/agent/quicklisp/dists/quicklisp/software/osicat-20150709-git/osicat.asd: COMPILE-FILE-ERROR while compiling #<cl-source-file "alexandria" "macros">
(LOAD hemlock.clx FAIL) ASDF/FIND-SYSTEM:LOAD-SYSTEM-DEFINITION-ERROR : Error while trying to load definition for system osicat from pathname /home/testgrid/cl-test-grid/work-dir/agent/quicklisp/dists/quicklisp/software/osicat-20150709-git/osicat.asd: COMPILE-FILE-ERROR while compiling #<cl-source-file "alexandria" "macros">
(LOAD hemlock.base FAIL) ASDF/FIND-SYSTEM:LOAD-SYSTEM-DEFINITION-ERROR : Error while trying to load definition for system osicat from pathname /home/testgrid/cl-test-grid/work-dir/agent/quicklisp/dists/quicklisp/software/osicat-20150709-git/osicat.asd: COMPILE-FILE-ERROR while compiling #<cl-source-file "alexandria" "macros">
(LOAD hemlock.tty FAIL) ASDF/FIND-SYSTEM:LOAD-SYSTEM-DEFINITION-ERROR : Error while trying to load definition for system osicat from pathname /home/testgrid/cl-test-grid/work-dir/agent/quicklisp/dists/quicklisp/software/osicat-20150608-git/osicat.asd: COMPILE-FILE-ERROR while compiling #<cl-source-file "alexandria" "macros">
(LOAD hemlock.qt FAIL) ASDF/FIND-SYSTEM:LOAD-SYSTEM-DEFINITION-ERROR : Error while trying to load definition for system osicat from pathname /home/testgrid/cl-test-grid/work-dir/agent/quicklisp/dists/quicklisp/software/osicat-20150608-git/osicat.asd: COMPILE-FILE-ERROR while compiling #<cl-source-file "alexandria" "macros">
(LOAD hemlock.clx FAIL) ASDF/FIND-SYSTEM:LOAD-SYSTEM-DEFINITION-ERROR : Error while trying to load definition for system osicat from pathname /home/testgrid/cl-test-grid/work-dir/agent/quicklisp/dists/quicklisp/software/osicat-20150608-git/osicat.asd: COMPILE-FILE-ERROR while compiling #<cl-source-file "alexandria" "macros">
(LOAD hemlock.base FAIL) ASDF/FIND-SYSTEM:LOAD-SYSTEM-DEFINITION-ERROR : Error while trying to load definition for system osicat from pathname /home/testgrid/cl-test-grid/work-dir/agent/quicklisp/dists/quicklisp/software/osicat-20150608-git/osicat.asd: COMPILE-FILE-ERROR while compiling #<cl-source-file "alexandria" "macros">
ecl-15.2.21-ee989b97-linux-x64-bytecode
(LOAD hemlock.tty FAIL) ASDF/FIND-SYSTEM:LOAD-SYSTEM-DEFINITION-ERROR : Error while trying to load definition for system osicat from pathname /home/hijarian/systems/cl-test-grid/work-dir/agent/quicklisp/dists/quicklisp/software/osicat-20150608-git/osicat.asd: The variable C::*CC-FLAGS* is unbound.
(LOAD hemlock.qt FAIL) ASDF/FIND-SYSTEM:LOAD-SYSTEM-DEFINITION-ERROR : Error while trying to load definition for system osicat from pathname /home/hijarian/systems/cl-test-grid/work-dir/agent/quicklisp/dists/quicklisp/software/osicat-20150608-git/osicat.asd: The variable C::*CC-FLAGS* is unbound.
(LOAD hemlock.clx FAIL) ASDF/FIND-SYSTEM:LOAD-SYSTEM-DEFINITION-ERROR : Error while trying to load definition for system osicat from pathname /home/hijarian/systems/cl-test-grid/work-dir/agent/quicklisp/dists/quicklisp/software/osicat-20150608-git/osicat.asd: The variable C::*CC-FLAGS* is unbound.
(LOAD hemlock.base FAIL) ASDF/FIND-SYSTEM:LOAD-SYSTEM-DEFINITION-ERROR : Error while trying to load definition for system osicat from pathname /home/hijarian/systems/cl-test-grid/work-dir/agent/quicklisp/dists/quicklisp/software/osicat-20150608-git/osicat.asd: The variable C::*CC-FLAGS* is unbound.
ecl-15.2.21-ee989b97-linux-x64-lisp-to-c
(LOAD hemlock.tty FAIL) ASDF/FIND-SYSTEM:LOAD-SYSTEM-DEFINITION-ERROR : Error while trying to load definition for system osicat from pathname /home/hijarian/systems/cl-test-grid/work-dir/agent/quicklisp/dists/quicklisp/software/osicat-20150608-git/osicat.asd: COMPILE-FILE-ERROR while compiling #<cl-source-file "alexandria" "macros">
(LOAD hemlock.qt FAIL) ASDF/FIND-SYSTEM:LOAD-SYSTEM-DEFINITION-ERROR : Error while trying to load definition for system osicat from pathname /home/hijarian/systems/cl-test-grid/work-dir/agent/quicklisp/dists/quicklisp/software/osicat-20150608-git/osicat.asd: COMPILE-FILE-ERROR while compiling #<cl-source-file "alexandria" "macros">
(LOAD hemlock.clx FAIL) ASDF/FIND-SYSTEM:LOAD-SYSTEM-DEFINITION-ERROR : Error while trying to load definition for system osicat from pathname /home/hijarian/systems/cl-test-grid/work-dir/agent/quicklisp/dists/quicklisp/software/osicat-20150608-git/osicat.asd: COMPILE-FILE-ERROR while compiling #<cl-source-file "alexandria" "macros">
(LOAD hemlock.base FAIL) ASDF/FIND-SYSTEM:LOAD-SYSTEM-DEFINITION-ERROR : Error while trying to load definition for system osicat from pathname /home/hijarian/systems/cl-test-grid/work-dir/agent/quicklisp/dists/quicklisp/software/osicat-20150608-git/osicat.asd: COMPILE-FILE-ERROR while compiling #<cl-source-file "alexandria" "macros">
sbcl-1.0.58-linux-x86
(LOAD hemlock.tty FAIL) ASDF:MISSING-COMPONENT : Component "iolib/os" not found
(LOAD hemlock.qt FAIL) ASDF:LOAD-SYSTEM-DEFINITION-ERROR : Error while trying to load definition for system named-readtables from pathname /home/testgrid/cl-test-grid/work-dir/agent/quicklisp/dists/quicklisp/software/named-readtables-20150608-git/named-readtables.asd: READ error during COMPILE-FILE: :ASCII stream decoding error on #<SB-SYS:FD-STREAM for "file /home/testgrid/cl-test-grid/work-dir/agent/quicklisp/dists/quicklisp/software/named-readtables-20150608-git/named-readtables.asd" {B8882C1}>: the octet sequence #(195) cannot be decoded. (in form starting at line: 11, column: 25, file-position: 321)
(LOAD hemlock.clx FAIL) ASDF:MISSING-COMPONENT : Component "iolib/os" not found
(LOAD hemlock.base FAIL) ASDF:MISSING-COMPONENT : Component "iolib/os" not found
(LOAD hemlock.tty FAIL) ASDF:MISSING-COMPONENT : Component "iolib/os" not found
(LOAD hemlock.qt FAIL) ASDF:LOAD-SYSTEM-DEFINITION-ERROR : Error while trying to load definition for system named-readtables from pathname /home/testgrid/cl-test-grid/work-dir/agent/quicklisp/dists/quicklisp/software/named-readtables-20150608-git/named-readtables.asd: READ error during COMPILE-FILE: :ASCII stream decoding error on #<SB-SYS:FD-STREAM for "file /home/testgrid/cl-test-grid/work-dir/agent/quicklisp/dists/quicklisp/software/named-readtables-20150608-git/named-readtables.asd" {B888591}>: the octet sequence #(195) cannot be decoded. (in form starting at line: 11, column: 25, file-position: 321)
(LOAD hemlock.clx FAIL) ASDF:MISSING-COMPONENT : Component "iolib/os" not found
(LOAD hemlock.base FAIL) ASDF:MISSING-COMPONENT : Component "iolib/os" not found
sbcl-1.1.11-linux-x86
(LOAD hemlock.qt FAIL) COMMON-LISP:SIMPLE-ERROR : No qmake found.
(LOAD hemlock.qt FAIL) COMMON-LISP:SIMPLE-ERROR : No qmake found.
sbcl-1.1.16-linux-x86
(LOAD hemlock.qt FAIL) COMMON-LISP:SIMPLE-ERROR : No qmake found.
(LOAD hemlock.qt FAIL) COMMON-LISP:SIMPLE-ERROR : No qmake found.
sbcl-1.2.3-linux-x64
(LOAD hemlock.tty FAIL) COMMON-LISP:SIMPLE-ERROR : External process exited with code 1. Command was: "g++" "-m64" "-Wno-write-strings" "-I/home/hijarian/systems/cl-test-grid/work-dir/agent/quicklisp/dists/quicklisp/software/iolib-20150302-git/src/grovel/" "-o" "/home/hijarian/systems/cl-test-grid/work-dir/agent/test-runs/20150609131809-sbcl-1.2.3-linux-x64/fasl/ql/dists/quicklisp/software/iolib-20150302-git/src/syscalls/ffi-types-unix" "/home/hijarian/systems/cl-test-grid/work-dir/agent/test-runs/20150609131809-sbcl-1.2.3-linux-x64/fasl/ql/dists/quicklisp/software/iolib-20150302-git/src/syscalls/ffi-types-unix.c" Output was: /home/hijarian/systems/cl-test-grid/work-dir/agent/test-runs/20150609131809-sbcl-1.2.3-linux-x64/fasl/ql/dists/quicklisp/software/iolib-20150302-git/src/syscalls/ffi-types-unix.c:14:17: fatal error: lfp.h: Нет такого файла или каталога #include <lfp.h> ^ compilation terminated.
(LOAD hemlock.qt FAIL) COMMON-LISP:SIMPLE-ERROR : External process exited with code 1. Command was: "g++" "-m64" "-Wno-write-strings" "-I/home/hijarian/systems/cl-test-grid/work-dir/agent/quicklisp/dists/quicklisp/software/iolib-20150302-git/src/grovel/" "-o" "/home/hijarian/systems/cl-test-grid/work-dir/agent/test-runs/20150609131809-sbcl-1.2.3-linux-x64/fasl/ql/dists/quicklisp/software/iolib-20150302-git/src/syscalls/ffi-types-unix" "/home/hijarian/systems/cl-test-grid/work-dir/agent/test-runs/20150609131809-sbcl-1.2.3-linux-x64/fasl/ql/dists/quicklisp/software/iolib-20150302-git/src/syscalls/ffi-types-unix.c" Output was: /home/hijarian/systems/cl-test-grid/work-dir/agent/test-runs/20150609131809-sbcl-1.2.3-linux-x64/fasl/ql/dists/quicklisp/software/iolib-20150302-git/src/syscalls/ffi-types-unix.c:14:17: fatal error: lfp.h: Нет такого файла или каталога #include <lfp.h> ^ compilation terminated.
(LOAD hemlock.clx FAIL) COMMON-LISP:SIMPLE-ERROR : External process exited with code 1. Command was: "g++" "-m64" "-Wno-write-strings" "-I/home/hijarian/systems/cl-test-grid/work-dir/agent/quicklisp/dists/quicklisp/software/iolib-20150302-git/src/grovel/" "-o" "/home/hijarian/systems/cl-test-grid/work-dir/agent/test-runs/20150609131809-sbcl-1.2.3-linux-x64/fasl/ql/dists/quicklisp/software/iolib-20150302-git/src/syscalls/ffi-types-unix" "/home/hijarian/systems/cl-test-grid/work-dir/agent/test-runs/20150609131809-sbcl-1.2.3-linux-x64/fasl/ql/dists/quicklisp/software/iolib-20150302-git/src/syscalls/ffi-types-unix.c" Output was: /home/hijarian/systems/cl-test-grid/work-dir/agent/test-runs/20150609131809-sbcl-1.2.3-linux-x64/fasl/ql/dists/quicklisp/software/iolib-20150302-git/src/syscalls/ffi-types-unix.c:14:17: fatal error: lfp.h: Нет такого файла или каталога #include <lfp.h> ^ compilation terminated.
(LOAD hemlock.base FAIL) COMMON-LISP:SIMPLE-ERROR : External process exited with code 1. Command was: "g++" "-m64" "-Wno-write-strings" "-I/home/hijarian/systems/cl-test-grid/work-dir/agent/quicklisp/dists/quicklisp/software/iolib-20150302-git/src/grovel/" "-o" "/home/hijarian/systems/cl-test-grid/work-dir/agent/test-runs/20150609131809-sbcl-1.2.3-linux-x64/fasl/ql/dists/quicklisp/software/iolib-20150302-git/src/syscalls/ffi-types-unix" "/home/hijarian/systems/cl-test-grid/work-dir/agent/test-runs/20150609131809-sbcl-1.2.3-linux-x64/fasl/ql/dists/quicklisp/software/iolib-20150302-git/src/syscalls/ffi-types-unix.c" Output was: /home/hijarian/systems/cl-test-grid/work-dir/agent/test-runs/20150609131809-sbcl-1.2.3-linux-x64/fasl/ql/dists/quicklisp/software/iolib-20150302-git/src/syscalls/ffi-types-unix.c:14:17: fatal error: lfp.h: Нет такого файла или каталога #include <lfp.h> ^ compilation terminated.
sbcl-1.2.6-linux-x86
(LOAD hemlock.qt FAIL) COMMON-LISP:SIMPLE-ERROR : No qmake found.
(LOAD hemlock.qt FAIL) COMMON-LISP:SIMPLE-ERROR : No qmake found.

Breakdown by testcases: for every failed testcase the lisp implmentations it fails on

The library does not have a testsuite adapter for CL Test Grid.

To reports overview

Generated at: 2015-07-23 13:00:31 GMT.