gsll results collected by cl-test-grid

Results on the last two Quicklisp distributions

 quicklisp 2015-04-07quicklisp 2015-03-02
abcl-1.2.1-fasl42-linux-x86
(LOAD gsll FAIL) COMMON-LISP:END-OF-FILE : #<END-OF-FILE {54CF52}>
(LOAD gsll FAIL) ASDF/FIND-SYSTEM:LOAD-SYSTEM-DEFINITION-ERROR : Error while trying to load definition for system gsll from pathname /home/testgrid/cl-test-grid/work-dir/agent/quicklisp/dists/quicklisp/software/gsll-20140211-git/gsll.asd: External process exited with code 1. Command was: "cc" "-m32" "-I/home/testgrid/cl-test-grid/work-dir/agent/quicklisp/dists/quicklisp/software/cffi_0.14.0/" "-o" "/home/testgrid/cl-test-grid/work-dir/agent/test-runs/20150306123015-abcl-1.2.1-fasl42-linux-x86/fasl/ql/dists/quicklisp/software/cffi_0.14.0/libffi/libffi-unix" "/home/testgrid/cl-test-grid/work-dir/agent/test-runs/20150306123015-abcl-1.2.1-fasl42-linux-x86/fasl/ql/dists/quicklisp/software/cffi_0.14.0/libffi/libffi-unix.c" Output was: /home/testgrid/cl-test-grid/work-dir/agent/test-runs/20150306123015-abcl-1.2.1-fasl42-linux-x86/fasl/ql/dists/quicklisp/software/cffi_0.14.0/libffi/libffi-unix.c:7:17: fatal error: ffi.h: No such file or directory compilation terminated.
abcl-1.3.0-fasl42-linux-x86
(LOAD gsll FAIL) ASDF/FIND-SYSTEM:LOAD-SYSTEM-DEFINITION-ERROR : Error while trying to load definition for system osicat from pathname /home/testgrid/cl-test-grid/work-dir/agent/quicklisp/dists/quicklisp/software/osicat-20150302-git/osicat.asd: don't recognize component type :GROVEL-FILE
(LOAD gsll FAIL) ASDF/FIND-SYSTEM:LOAD-SYSTEM-DEFINITION-ERROR : Error while trying to load definition for system gsll from pathname /home/testgrid/cl-test-grid/work-dir/agent/quicklisp/dists/quicklisp/software/gsll-20140211-git/gsll.asd: External process exited with code 1. Command was: "cc" "-m32" "-I/home/testgrid/cl-test-grid/work-dir/agent/quicklisp/dists/quicklisp/software/cffi_0.14.0/" "-o" "/home/testgrid/cl-test-grid/work-dir/agent/test-runs/20150306001540-abcl-1.3.0-fasl42-linux-x86/fasl/ql/dists/quicklisp/software/cffi_0.14.0/libffi/libffi-unix" "/home/testgrid/cl-test-grid/work-dir/agent/test-runs/20150306001540-abcl-1.3.0-fasl42-linux-x86/fasl/ql/dists/quicklisp/software/cffi_0.14.0/libffi/libffi-unix.c" Output was: /home/testgrid/cl-test-grid/work-dir/agent/test-runs/20150306001540-abcl-1.3.0-fasl42-linux-x86/fasl/ql/dists/quicklisp/software/cffi_0.14.0/libffi/libffi-unix.c:7:17: fatal error: ffi.h: No such file or directory compilation terminated.
abcl-1.3.1-fasl42-linux-x86
(LOAD gsll FAIL) COMMON-LISP:END-OF-FILE : #<END-OF-FILE {15F0D4F}>
(LOAD gsll FAIL) ASDF/FIND-SYSTEM:LOAD-SYSTEM-DEFINITION-ERROR : Error while trying to load definition for system gsll from pathname /home/testgrid/cl-test-grid/work-dir/agent/quicklisp/dists/quicklisp/software/gsll-20140211-git/gsll.asd: External process exited with code 1. Command was: "cc" "-m32" "-I/home/testgrid/cl-test-grid/work-dir/agent/quicklisp/dists/quicklisp/software/cffi_0.14.0/" "-o" "/home/testgrid/cl-test-grid/work-dir/agent/test-runs/20150304065331-abcl-1.3.1-fasl42-linux-x86/fasl/ql/dists/quicklisp/software/cffi_0.14.0/libffi/libffi-unix" "/home/testgrid/cl-test-grid/work-dir/agent/test-runs/20150304065331-abcl-1.3.1-fasl42-linux-x86/fasl/ql/dists/quicklisp/software/cffi_0.14.0/libffi/libffi-unix.c" Output was: /home/testgrid/cl-test-grid/work-dir/agent/test-runs/20150304065331-abcl-1.3.1-fasl42-linux-x86/fasl/ql/dists/quicklisp/software/cffi_0.14.0/libffi/libffi-unix.c:7:17: fatal error: ffi.h: No such file or directory compilation terminated.
ccl-1.10-r16196-f96-linux-x64
(LOAD gsll FAIL) COMMON-LISP:END-OF-FILE : Unexpected end of file on #<STRING-INPUT-STREAM #x302001DF1B0D>, near position 26, within "--prefix\" "
(LOAD gsll FAIL) ASDF/FIND-SYSTEM:LOAD-SYSTEM-DEFINITION-ERROR : Error while trying to load definition for system gsll from pathname /home/joram/dev/lisp/cl-test-grid/work-dir/agent/quicklisp/dists/quicklisp/software/gsll-20140211-git/gsll.asd: External process exited with code 1. Command was: "cc" "-m64" "-I/home/joram/dev/lisp/cl-test-grid/work-dir/agent/quicklisp/dists/quicklisp/software/cffi_0.14.0/" "-o" "/home/joram/dev/lisp/cl-test-grid/work-dir/agent/test-runs/20150316132516-ccl-1.10-r16196-f96-linux-x64/fasl/ql/dists/quicklisp/software/cffi_0.14.0/libffi/libffi-unix" "/home/joram/dev/lisp/cl-test-grid/work-dir/agent/test-runs/20150316132516-ccl-1.10-r16196-f96-linux-x64/fasl/ql/dists/quicklisp/software/cffi_0.14.0/libffi/libffi-unix.c" Output was: /home/joram/dev/lisp/cl-test-grid/work-dir/agent/test-runs/20150316132516-ccl-1.10-r16196-f96-linux-x64/fasl/ql/dists/quicklisp/software/cffi_0.14.0/libffi/libffi-unix.c:7:17: fatal error: ffi.h: No such file or directory #include <ffi.h> ^ compilation terminated.
(LOAD gsll FAIL) COMMON-LISP:END-OF-FILE : Unexpected end of file on #<STRING-INPUT-STREAM #x302001CDA71D>, near position 26, within "--prefix\" "
ccl-1.10-r16196-f96-linux-x86
(LOAD gsll FAIL) COMMON-LISP:END-OF-FILE : Unexpected end of file on #<STRING-INPUT-STREAM #x190309CE>, near position 26, within "--prefix\" "
(LOAD gsll FAIL) ASDF/FIND-SYSTEM:LOAD-SYSTEM-DEFINITION-ERROR : Error while trying to load definition for system gsll from pathname /home/testgrid/cl-test-grid/work-dir/agent/quicklisp/dists/quicklisp/software/gsll-20140211-git/gsll.asd: External process exited with code 1. Command was: "cc" "-m32" "-I/home/testgrid/cl-test-grid/work-dir/agent/quicklisp/dists/quicklisp/software/cffi_0.14.0/" "-o" "/home/testgrid/cl-test-grid/work-dir/agent/test-runs/20150303151515-ccl-1.10-r16196-f96-linux-x86/fasl/ql/dists/quicklisp/software/cffi_0.14.0/libffi/libffi-unix" "/home/testgrid/cl-test-grid/work-dir/agent/test-runs/20150303151515-ccl-1.10-r16196-f96-linux-x86/fasl/ql/dists/quicklisp/software/cffi_0.14.0/libffi/libffi-unix.c" Output was: /home/testgrid/cl-test-grid/work-dir/agent/test-runs/20150303151515-ccl-1.10-r16196-f96-linux-x86/fasl/ql/dists/quicklisp/software/cffi_0.14.0/libffi/libffi-unix.c:7:17: fatal error: ffi.h: No such file or directory compilation terminated.
ccl-1.8-r15286m-f95-linux-x86
(LOAD gsll FAIL) ASDF:LOAD-SYSTEM-DEFINITION-ERROR : Error while trying to load definition for system foreign-array from pathname /home/testgrid/cl-test-grid/work-dir/agent/quicklisp/dists/quicklisp/software/antik-20150407-git/foreign-array.asd: Error while trying to load definition for system static-vectors from pathname /home/testgrid/cl-test-grid/work-dir/agent/quicklisp/dists/quicklisp/software/static-vectors-1.6/static-vectors.asd: You need ASDF >= 2.32 to load this system correctly.
(LOAD gsll FAIL) ASDF:LOAD-SYSTEM-DEFINITION-ERROR : Error while trying to load definition for system gsll from pathname /home/testgrid/cl-test-grid/work-dir/agent/quicklisp/dists/quicklisp/software/gsll-20140211-git/gsll.asd: External process exited with code 1. Command was: "cc" "-m32" "-I/home/testgrid/cl-test-grid/work-dir/agent/quicklisp/dists/quicklisp/software/cffi_0.14.0/" "-o" "/home/testgrid/cl-test-grid/work-dir/agent/test-runs/20150305063513-ccl-1.8-r15286m-f95-linux-x86/fasl/ql/dists/quicklisp/software/cffi_0.14.0/libffi/libffi-unix" "/home/testgrid/cl-test-grid/work-dir/agent/test-runs/20150305063513-ccl-1.8-r15286m-f95-linux-x86/fasl/ql/dists/quicklisp/software/cffi_0.14.0/libffi/libffi-unix.c" Output was: /home/testgrid/cl-test-grid/work-dir/agent/test-runs/20150305063513-ccl-1.8-r15286m-f95-linux-x86/fasl/ql/dists/quicklisp/software/cffi_0.14.0/libffi/libffi-unix.c:7:17: fatal error: ffi.h: No such file or directory compilation terminated.
ccl-1.9-r15756-f96-linux-x86
(LOAD gsll FAIL) COMMON-LISP:END-OF-FILE : Unexpected end of file on #<STRING-INPUT-STREAM #x192B7E7E>, near position 26, within "--prefix\" "
(LOAD gsll FAIL) ASDF/FIND-SYSTEM:LOAD-SYSTEM-DEFINITION-ERROR : Error while trying to load definition for system gsll from pathname /home/testgrid/cl-test-grid/work-dir/agent/quicklisp/dists/quicklisp/software/gsll-20140211-git/gsll.asd: External process exited with code 1. Command was: "cc" "-m32" "-I/home/testgrid/cl-test-grid/work-dir/agent/quicklisp/dists/quicklisp/software/cffi_0.14.0/" "-o" "/home/testgrid/cl-test-grid/work-dir/agent/test-runs/20150304204839-ccl-1.9-r15756-f96-linux-x86/fasl/ql/dists/quicklisp/software/cffi_0.14.0/libffi/libffi-unix" "/home/testgrid/cl-test-grid/work-dir/agent/test-runs/20150304204839-ccl-1.9-r15756-f96-linux-x86/fasl/ql/dists/quicklisp/software/cffi_0.14.0/libffi/libffi-unix.c" Output was: /home/testgrid/cl-test-grid/work-dir/agent/test-runs/20150304204839-ccl-1.9-r15756-f96-linux-x86/fasl/ql/dists/quicklisp/software/cffi_0.14.0/libffi/libffi-unix.c:7:17: fatal error: ffi.h: No such file or directory compilation terminated.
clisp-2.49-unix-x64
(LOAD gsll FAIL) ASDF:LOAD-SYSTEM-DEFINITION-ERROR : Error while trying to load definition for system named-readtables from pathname /home/hijarian/systems/cl-test-grid/work-dir/agent/quicklisp/dists/quicklisp/software/named-readtables-20150302-git/named-readtables.asd: REINITIALIZE-INSTANCE: некорректная пара ключевое слово/значение :MAILTO, "mega@retes.hu" в списке аргументов. Разрешенные ключевые слова: (:NAME :VERSION :IN-ORDER-TO :DO-FIRST :PARENT :PATHNAME :AROUND-COMPILE :ENCODING :PROPERTIES :COMPONENTS :IF-COMPONENT-DEP-FAILS :DEFAULT-COMPONENT-CLASS :DESCRIPTION :LONG-DESCRIPTION :AUTHOR :MAINTAINER :LICENCE :LICENSE :SOURCE-FILE :DEFSYSTEM-DEPENDS-ON)
(LOAD gsll FAIL) ASDF:LOAD-SYSTEM-DEFINITION-ERROR : Error while trying to load definition for system gsll from pathname /home/joram/dev/lisp/cl-test-grid/work-dir/agent/quicklisp/dists/quicklisp/software/gsll-20140211-git/gsll.asd: External process exited with code 1. Command was: "cc" "-m64" "-I/home/joram/dev/lisp/cl-test-grid/work-dir/agent/quicklisp/dists/quicklisp/software/cffi_0.14.0/" "-o" "/home/joram/dev/lisp/cl-test-grid/work-dir/agent/test-runs/20150316111645-clisp-2.49-unix-x64/fasl/ql/dists/quicklisp/software/cffi_0.14.0/libffi/libffi-unix" "/home/joram/dev/lisp/cl-test-grid/work-dir/agent/test-runs/20150316111645-clisp-2.49-unix-x64/fasl/ql/dists/quicklisp/software/cffi_0.14.0/libffi/libffi-unix.c" Output was: <see above>
(LOAD gsll FAIL) SYSTEM::SIMPLE-PACKAGE-ERROR : EXPORT(COMMON-LISP:TIME): #<PACKAGE COMMON-LISP> заблокирован
clisp-2.49-unix-x86
(LOAD gsll FAIL) ASDF:LOAD-SYSTEM-DEFINITION-ERROR : Error while trying to load definition for system named-readtables from pathname /home/testgrid/cl-test-grid/work-dir/agent/quicklisp/dists/quicklisp/software/named-readtables-20150302-git/named-readtables.asd: REINITIALIZE-INSTANCE: illegal keyword/value pair :MAILTO, "mega@retes.hu" in argument list. The allowed keywords are (:NAME :VERSION :IN-ORDER-TO :DO-FIRST :PARENT :PATHNAME :AROUND-COMPILE :ENCODING :PROPERTIES :COMPONENTS :IF-COMPONENT-DEP-FAILS :DEFAULT-COMPONENT-CLASS :DESCRIPTION :LONG-DESCRIPTION :AUTHOR :MAINTAINER :LICENCE :LICENSE :SOURCE-FILE :DEFSYSTEM-DEPENDS-ON)
(LOAD gsll FAIL) ASDF:LOAD-SYSTEM-DEFINITION-ERROR : Error while trying to load definition for system gsll from pathname /home/testgrid/cl-test-grid/work-dir/agent/quicklisp/dists/quicklisp/software/gsll-20140211-git/gsll.asd: External process exited with code 1. Command was: "cc" "-m32" "-I/home/testgrid/cl-test-grid/work-dir/agent/quicklisp/dists/quicklisp/software/cffi_0.14.0/" "-o" "/home/testgrid/cl-test-grid/work-dir/agent/test-runs/20150303213703-clisp-2.49-unix-x86/fasl/ql/dists/quicklisp/software/cffi_0.14.0/libffi/libffi-unix" "/home/testgrid/cl-test-grid/work-dir/agent/test-runs/20150303213703-clisp-2.49-unix-x86/fasl/ql/dists/quicklisp/software/cffi_0.14.0/libffi/libffi-unix.c" Output was: <see above>
cmu-snapshot-2013-04__20d_unicode_-linux-x86
(LOAD gsll FAIL) C::COMPILER-ERROR : (during macroexpansion) Error in function LISP::ASSERT-ERROR: The assertion (OR (NULL OPTS) (EQ (POP TYPE-LIST) '&OPTIONAL)) failed.
(LOAD gsll FAIL) ASDF/FIND-SYSTEM:LOAD-SYSTEM-DEFINITION-ERROR : Error while trying to load definition for system gsll from pathname /home/testgrid/cl-test-grid/work-dir/agent/quicklisp/dists/quicklisp/software/gsll-20140211-git/gsll.asd: Error in function CFFI-GROVEL:GROVEL-ERROR: External process exited with code 1. Command was: "cc" "-m32" "-I/home/testgrid/cl-test-grid/work-dir/agent/quicklisp/dists/quicklisp/software/cffi_0.14.0/" "-o" "/home/testgrid/cl-test-grid/work-dir/agent/test-runs/20150305141412-cmu-snapshot-2013-04__20d_unicode_-linux-x86/fasl/ql/dists/quicklisp/software/cffi_0.14.0/libffi/libffi-unix" "/home/testgrid/cl-test-grid/work-dir/agent/test-runs/20150305141412-cmu-snapshot-2013-04__20d_unicode_-linux-x86/fasl/ql/dists/quicklisp/software/cffi_0.14.0/libffi/libffi-unix.c" Output was: /home/testgrid/cl-test-grid/work-dir/agent/test-runs/20150305141412-cmu-snapshot-2013-04__20d_unicode_-linux-x86/fasl/ql/dists/quicklisp/software/cffi_0.14.0/libffi/libffi-unix.c:7:17: fatal error: ffi.h: No such file or directory compilation terminated.
cmu-snapshot-2014-01__20e_unicode_-linux-x86
(LOAD gsll FAIL) C::COMPILER-ERROR : (during macroexpansion) Error in function LISP::ASSERT-ERROR: The assertion (OR (NULL OPTS) (EQ (POP TYPE-LIST) '&OPTIONAL)) failed.
(LOAD gsll FAIL) ASDF/FIND-SYSTEM:LOAD-SYSTEM-DEFINITION-ERROR : Error while trying to load definition for system gsll from pathname /home/testgrid/cl-test-grid/work-dir/agent/quicklisp/dists/quicklisp/software/gsll-20140211-git/gsll.asd: Error in function CFFI-GROVEL:GROVEL-ERROR: External process exited with code 1. Command was: "cc" "-m32" "-I/home/testgrid/cl-test-grid/work-dir/agent/quicklisp/dists/quicklisp/software/cffi_0.14.0/" "-o" "/home/testgrid/cl-test-grid/work-dir/agent/test-runs/20150305112724-cmu-snapshot-2014-01__20e_unicode_-linux-x86/fasl/ql/dists/quicklisp/software/cffi_0.14.0/libffi/libffi-unix" "/home/testgrid/cl-test-grid/work-dir/agent/test-runs/20150305112724-cmu-snapshot-2014-01__20e_unicode_-linux-x86/fasl/ql/dists/quicklisp/software/cffi_0.14.0/libffi/libffi-unix.c" Output was: /home/testgrid/cl-test-grid/work-dir/agent/test-runs/20150305112724-cmu-snapshot-2014-01__20e_unicode_-linux-x86/fasl/ql/dists/quicklisp/software/cffi_0.14.0/libffi/libffi-unix.c:7:17: fatal error: ffi.h: No such file or directory compilation terminated.
cmu-snapshot-2014-05-dirty__20e_unicode_-linux-x86
(LOAD gsll FAIL) C::COMPILER-ERROR : (during macroexpansion) Error in function LISP::ASSERT-ERROR: The assertion (OR (NULL OPTS) (EQ (POP TYPE-LIST) '&OPTIONAL)) failed.
(LOAD gsll FAIL) ASDF/FIND-SYSTEM:LOAD-SYSTEM-DEFINITION-ERROR : Error while trying to load definition for system gsll from pathname /home/testgrid/cl-test-grid/work-dir/agent/quicklisp/dists/quicklisp/software/gsll-20140211-git/gsll.asd: Error in function CFFI-GROVEL:GROVEL-ERROR: External process exited with code 1. Command was: "cc" "-m32" "-I/home/testgrid/cl-test-grid/work-dir/agent/quicklisp/dists/quicklisp/software/cffi_0.14.0/" "-o" "/home/testgrid/cl-test-grid/work-dir/agent/test-runs/20150305084304-cmu-snapshot-2014-05-dirty__20e_unicode_-linux-x86/fasl/ql/dists/quicklisp/software/cffi_0.14.0/libffi/libffi-unix" "/home/testgrid/cl-test-grid/work-dir/agent/test-runs/20150305084304-cmu-snapshot-2014-05-dirty__20e_unicode_-linux-x86/fasl/ql/dists/quicklisp/software/cffi_0.14.0/libffi/libffi-unix.c" Output was: /home/testgrid/cl-test-grid/work-dir/agent/test-runs/20150305084304-cmu-snapshot-2014-05-dirty__20e_unicode_-linux-x86/fasl/ql/dists/quicklisp/software/cffi_0.14.0/libffi/libffi-unix.c:7:17: fatal error: ffi.h: No such file or directory compilation terminated.
cmu-snapshot-2014-12___20f_unicode_-linux-x86
(LOAD gsll FAIL) C::COMPILER-ERROR : (during macroexpansion) Error in function LISP::ASSERT-ERROR: The assertion (OR (NULL OPTS) (EQ (POP TYPE-LIST) '&OPTIONAL)) failed.
(LOAD gsll FAIL) ASDF/FIND-SYSTEM:LOAD-SYSTEM-DEFINITION-ERROR : Error while trying to load definition for system gsll from pathname /home/testgrid/cl-test-grid/work-dir/agent/quicklisp/dists/quicklisp/software/gsll-20140211-git/gsll.asd: Error in function CFFI-GROVEL:GROVEL-ERROR: External process exited with code 1. Command was: "cc" "-m32" "-I/home/testgrid/cl-test-grid/work-dir/agent/quicklisp/dists/quicklisp/software/cffi_0.14.0/" "-o" "/home/testgrid/cl-test-grid/work-dir/agent/test-runs/20150303185904-cmu-snapshot-2014-12___20f_unicode_-linux-x86/fasl/ql/dists/quicklisp/software/cffi_0.14.0/libffi/libffi-unix" "/home/testgrid/cl-test-grid/work-dir/agent/test-runs/20150303185904-cmu-snapshot-2014-12___20f_unicode_-linux-x86/fasl/ql/dists/quicklisp/software/cffi_0.14.0/libffi/libffi-unix.c" Output was: /home/testgrid/cl-test-grid/work-dir/agent/test-runs/20150303185904-cmu-snapshot-2014-12___20f_unicode_-linux-x86/fasl/ql/dists/quicklisp/software/cffi_0.14.0/libffi/libffi-unix.c:7:17: fatal error: ffi.h: No such file or directory compilation terminated.
ecl-13.5.1-76a84246-linux-x64-bytecode
(LOAD gsll FAIL) ASDF/FIND-SYSTEM:LOAD-SYSTEM-DEFINITION-ERROR : Error while trying to load definition for system gsll from pathname /home/hijarian/systems/cl-test-grid/work-dir/agent/quicklisp/dists/quicklisp/software/gsll-20150407-git/gsll.asd: Error while trying to load definition for system cffi-libffi from pathname /home/hijarian/systems/cl-test-grid/work-dir/agent/quicklisp/dists/quicklisp/software/cffi_0.14.0/cffi-libffi.asd: The variable C::*CC-FLAGS* is unbound.
(LOAD gsll FAIL) ASDF/FIND-SYSTEM:LOAD-SYSTEM-DEFINITION-ERROR : Error while trying to load definition for system gsll from pathname /home/hijarian/systems/cl-test-grid/work-dir/agent/quicklisp/dists/quicklisp/software/gsll-20140211-git/gsll.asd: Error while trying to load definition for system cffi-libffi from pathname /home/hijarian/systems/cl-test-grid/work-dir/agent/quicklisp/dists/quicklisp/software/cffi_0.14.0/cffi-libffi.asd: The variable C::*CC-FLAGS* is unbound.
ecl-13.5.1-76a84246-linux-x64-lisp-to-c
(LOAD gsll FAIL) UIOP/LISP-BUILD:COMPILE-FILE-ERROR : COMPILE-FILE-ERROR while compiling #<cl-source-file "gsll" "init" "init">
(LOAD gsll FAIL) UIOP/LISP-BUILD:COMPILE-FILE-ERROR : COMPILE-FILE-ERROR while compiling #<cl-source-file "antik" "physical-quantities" "format-output">
ecl-13.5.1-unknown-linux-i686-bytecode
(LOAD gsll FAIL) ASDF/FIND-SYSTEM:LOAD-SYSTEM-DEFINITION-ERROR : Error while trying to load definition for system gsll from pathname /home/testgrid/cl-test-grid/work-dir/agent/quicklisp/dists/quicklisp/software/gsll-20150407-git/gsll.asd: Error while trying to load definition for system cffi-libffi from pathname /home/testgrid/cl-test-grid/work-dir/agent/quicklisp/dists/quicklisp/software/cffi_0.14.0/cffi-libffi.asd: The variable C::*CC-FLAGS* is unbound.
(LOAD gsll FAIL) ASDF/FIND-SYSTEM:LOAD-SYSTEM-DEFINITION-ERROR : Error while trying to load definition for system gsll from pathname /home/testgrid/cl-test-grid/work-dir/agent/quicklisp/dists/quicklisp/software/gsll-20140211-git/gsll.asd: Error while trying to load definition for system cffi-libffi from pathname /home/testgrid/cl-test-grid/work-dir/agent/quicklisp/dists/quicklisp/software/cffi_0.14.0/cffi-libffi.asd: The variable C::*CC-FLAGS* is unbound.
ecl-13.5.1-unknown-linux-i686-lisp-to-c
(LOAD gsll FAIL) UIOP/LISP-BUILD:COMPILE-FILE-ERROR : COMPILE-FILE-ERROR while compiling #<cl-source-file "gsll" "init" "init">
(LOAD gsll FAIL) ASDF/FIND-SYSTEM:LOAD-SYSTEM-DEFINITION-ERROR : Error while trying to load definition for system gsll from pathname /home/testgrid/cl-test-grid/work-dir/agent/quicklisp/dists/quicklisp/software/gsll-20140211-git/gsll.asd: External process exited with code 1. Command was: "cc" "-m32" " -D_GNU_SOURCE -D_FILE_OFFSET_BITS=64 -g -O2 -fPIC -D_GNU_SOURCE -D_FILE_OFFSET_BITS=64 -g -O2 -fPIC -D_THREAD_SAFE -Dlinux" "-I/home/testgrid/cl-test-grid/work-dir/agent/quicklisp/dists/quicklisp/software/cffi_0.14.0/" "-o" "/home/testgrid/cl-test-grid/work-dir/agent/test-runs/20150304033255-ecl-13.5.1-unknown-linux-i686-lisp-to-c/fasl/ql/dists/quicklisp/software/cffi_0.14.0/libffi/libffi-unix" "/home/testgrid/cl-test-grid/work-dir/agent/test-runs/20150304033255-ecl-13.5.1-unknown-linux-i686-lisp-to-c/fasl/ql/dists/quicklisp/software/cffi_0.14.0/libffi/libffi-unix.c" Output was: <see above>
ecl-15.2.21-ee989b97-linux-i686-bytecode
(LOAD gsll FAIL) ASDF/FIND-SYSTEM:LOAD-SYSTEM-DEFINITION-ERROR : Error while trying to load definition for system gsll from pathname /home/testgrid/cl-test-grid/work-dir/agent/quicklisp/dists/quicklisp/software/gsll-20150407-git/gsll.asd: Error while trying to load definition for system cffi-libffi from pathname /home/testgrid/cl-test-grid/work-dir/agent/quicklisp/dists/quicklisp/software/cffi_0.14.0/cffi-libffi.asd: The variable C::*CC-FLAGS* is unbound.
(LOAD gsll FAIL) ASDF/FIND-SYSTEM:LOAD-SYSTEM-DEFINITION-ERROR : Error while trying to load definition for system gsll from pathname /home/testgrid/cl-test-grid/work-dir/agent/quicklisp/dists/quicklisp/software/gsll-20140211-git/gsll.asd: Error while trying to load definition for system cffi-libffi from pathname /home/testgrid/cl-test-grid/work-dir/agent/quicklisp/dists/quicklisp/software/cffi_0.14.0/cffi-libffi.asd: The variable C::*CC-FLAGS* is unbound.
ecl-15.2.21-ee989b97-linux-i686-lisp-to-c
(LOAD gsll FAIL) UIOP/LISP-BUILD:COMPILE-FILE-ERROR : COMPILE-FILE-ERROR while compiling #<cl-source-file "gsll" "init" "init">
(LOAD gsll FAIL) ASDF/FIND-SYSTEM:LOAD-SYSTEM-DEFINITION-ERROR : Error while trying to load definition for system gsll from pathname /home/testgrid/cl-test-grid/work-dir/agent/quicklisp/dists/quicklisp/software/gsll-20140211-git/gsll.asd: External process exited with code 1. Command was: "cc" "-m32" " -D_GNU_SOURCE -D_FILE_OFFSET_BITS=64 -g -O2 -fPIC -D_THREAD_SAFE -Dlinux" "-I/home/testgrid/cl-test-grid/work-dir/agent/quicklisp/dists/quicklisp/software/cffi_0.14.0/" "-o" "/home/testgrid/cl-test-grid/work-dir/agent/test-runs/20150305202806-ecl-15.2.21-ee989b97-linux-i686-lisp-to-c/fasl/ql/dists/quicklisp/software/cffi_0.14.0/libffi/libffi-unix" "/home/testgrid/cl-test-grid/work-dir/agent/test-runs/20150305202806-ecl-15.2.21-ee989b97-linux-i686-lisp-to-c/fasl/ql/dists/quicklisp/software/cffi_0.14.0/libffi/libffi-unix.c" Output was: <see above>
sbcl-1.0.58-linux-x86
(LOAD gsll FAIL) ASDF:LOAD-SYSTEM-DEFINITION-ERROR : Error while trying to load definition for system foreign-array from pathname /home/testgrid/cl-test-grid/work-dir/agent/quicklisp/dists/quicklisp/software/antik-20150407-git/foreign-array.asd: Error while trying to load definition for system static-vectors from pathname /home/testgrid/cl-test-grid/work-dir/agent/quicklisp/dists/quicklisp/software/static-vectors-1.6/static-vectors.asd: READ error during COMPILE-FILE: You need ASDF >= 2.32 to load this system correctly. (in form starting at line: 1, column: 0, file-position: 0)
(LOAD gsll FAIL) ASDF:LOAD-SYSTEM-DEFINITION-ERROR : Error while trying to load definition for system gsll from pathname /home/testgrid/cl-test-grid/work-dir/agent/quicklisp/dists/quicklisp/software/gsll-20140211-git/gsll.asd: External process exited with code 1. Command was: "cc" "-m32" "-I/home/testgrid/cl-test-grid/work-dir/agent/quicklisp/dists/quicklisp/software/cffi_0.14.0/" "-o" "/home/testgrid/cl-test-grid/work-dir/agent/test-runs/20150305041710-sbcl-1.0.58-linux-x86/fasl/ql/dists/quicklisp/software/cffi_0.14.0/libffi/libffi-unix" "/home/testgrid/cl-test-grid/work-dir/agent/test-runs/20150305041710-sbcl-1.0.58-linux-x86/fasl/ql/dists/quicklisp/software/cffi_0.14.0/libffi/libffi-unix.c" Output was: /home/testgrid/cl-test-grid/work-dir/agent/test-runs/20150305041710-sbcl-1.0.58-linux-x86/fasl/ql/dists/quicklisp/software/cffi_0.14.0/libffi/libffi-unix.c:7:17: fatal error: ffi.h: No such file or directory compilation terminated.
sbcl-1.1.11-linux-x86
(LOAD gsll FAIL) COMMON-LISP:SIMPLE-ERROR : The dispatch character #\# already exists.
(LOAD gsll FAIL) ASDF/FIND-SYSTEM:LOAD-SYSTEM-DEFINITION-ERROR : Error while trying to load definition for system gsll from pathname /home/testgrid/cl-test-grid/work-dir/agent/quicklisp/dists/quicklisp/software/gsll-20140211-git/gsll.asd: External process exited with code 1. Command was: "cc" "-m32" "-I/home/testgrid/cl-test-grid/work-dir/agent/quicklisp/dists/quicklisp/software/cffi_0.14.0/" "-o" "/home/testgrid/cl-test-grid/work-dir/agent/test-runs/20150305021818-sbcl-1.1.11-linux-x86/fasl/ql/dists/quicklisp/software/cffi_0.14.0/libffi/libffi-unix" "/home/testgrid/cl-test-grid/work-dir/agent/test-runs/20150305021818-sbcl-1.1.11-linux-x86/fasl/ql/dists/quicklisp/software/cffi_0.14.0/libffi/libffi-unix.c" Output was: /home/testgrid/cl-test-grid/work-dir/agent/test-runs/20150305021818-sbcl-1.1.11-linux-x86/fasl/ql/dists/quicklisp/software/cffi_0.14.0/libffi/libffi-unix.c:7:17: fatal error: ffi.h: No such file or directory compilation terminated.
sbcl-1.1.16-linux-x86
(LOAD gsll FAIL) COMMON-LISP:SIMPLE-ERROR : The dispatch character #\# already exists.
(LOAD gsll FAIL) ASDF/FIND-SYSTEM:LOAD-SYSTEM-DEFINITION-ERROR : Error while trying to load definition for system gsll from pathname /home/testgrid/cl-test-grid/work-dir/agent/quicklisp/dists/quicklisp/software/gsll-20140211-git/gsll.asd: External process exited with code 1. Command was: "cc" "-m32" "-I/home/testgrid/cl-test-grid/work-dir/agent/quicklisp/dists/quicklisp/software/cffi_0.14.0/" "-o" "/home/testgrid/cl-test-grid/work-dir/agent/test-runs/20150305002319-sbcl-1.1.16-linux-x86/fasl/ql/dists/quicklisp/software/cffi_0.14.0/libffi/libffi-unix" "/home/testgrid/cl-test-grid/work-dir/agent/test-runs/20150305002319-sbcl-1.1.16-linux-x86/fasl/ql/dists/quicklisp/software/cffi_0.14.0/libffi/libffi-unix.c" Output was: /home/testgrid/cl-test-grid/work-dir/agent/test-runs/20150305002319-sbcl-1.1.16-linux-x86/fasl/ql/dists/quicklisp/software/cffi_0.14.0/libffi/libffi-unix.c:7:17: fatal error: ffi.h: No such file or directory compilation terminated.
sbcl-1.2.3-linux-x64
(LOAD gsll FAIL) UIOP/LISP-BUILD:COMPILE-FILE-ERROR : COMPILE-FILE-ERROR while compiling #<CL-SOURCE-FILE "gsll" "init" "init">
(LOAD gsll FAIL) UIOP/LISP-BUILD:COMPILE-FILE-ERROR : COMPILE-FILE-ERROR while compiling #<CL-SOURCE-FILE "gsll" "init" "init">
sbcl-1.2.6-linux-x86
(LOAD gsll FAIL) UIOP/LISP-BUILD:COMPILE-FILE-ERROR : COMPILE-FILE-ERROR while compiling #<CL-SOURCE-FILE "gsll" "init" "init">
(LOAD gsll FAIL) ASDF/FIND-SYSTEM:LOAD-SYSTEM-DEFINITION-ERROR : Error while trying to load definition for system gsll from pathname /home/testgrid/cl-test-grid/work-dir/agent/quicklisp/dists/quicklisp/software/gsll-20140211-git/gsll.asd: External process exited with code 1. Command was: "cc" "-m32" "-I/home/testgrid/cl-test-grid/work-dir/agent/quicklisp/dists/quicklisp/software/cffi_0.14.0/" "-o" "/home/testgrid/cl-test-grid/work-dir/agent/test-runs/20150303132132-sbcl-1.2.6-linux-x86/fasl/ql/dists/quicklisp/software/cffi_0.14.0/libffi/libffi-unix" "/home/testgrid/cl-test-grid/work-dir/agent/test-runs/20150303132132-sbcl-1.2.6-linux-x86/fasl/ql/dists/quicklisp/software/cffi_0.14.0/libffi/libffi-unix.c" Output was: /home/testgrid/cl-test-grid/work-dir/agent/test-runs/20150303132132-sbcl-1.2.6-linux-x86/fasl/ql/dists/quicklisp/software/cffi_0.14.0/libffi/libffi-unix.c:7:17: fatal error: ffi.h: No such file or directory compilation terminated.
sbcl-1.2.8-linux-x64
(LOAD gsll FAIL) ASDF/FIND-SYSTEM:LOAD-SYSTEM-DEFINITION-ERROR : Error while trying to load definition for system gsll from pathname /home/joram/dev/lisp/cl-test-grid/work-dir/agent/quicklisp/dists/quicklisp/software/gsll-20140211-git/gsll.asd: External process exited with code 1. Command was: "cc" "-m64" "-I/home/joram/dev/lisp/cl-test-grid/work-dir/agent/quicklisp/dists/quicklisp/software/cffi_0.14.0/" "-o" "/home/joram/dev/lisp/cl-test-grid/work-dir/agent/test-runs/20150316154043-sbcl-1.2.8-linux-x64/fasl/ql/dists/quicklisp/software/cffi_0.14.0/libffi/libffi-unix" "/home/joram/dev/lisp/cl-test-grid/work-dir/agent/test-runs/20150316154043-sbcl-1.2.8-linux-x64/fasl/ql/dists/quicklisp/software/cffi_0.14.0/libffi/libffi-unix.c" Output was: /home/joram/dev/lisp/cl-test-grid/work-dir/agent/test-runs/20150316154043-sbcl-1.2.8-linux-x64/fasl/ql/dists/quicklisp/software/cffi_0.14.0/libffi/libffi-unix.c:7:17: fatal error: ffi.h: No such file or directory #include <ffi.h> ^ compilation terminated.

Breakdown by testcases: for every failed testcase the lisp implmentations it fails on

The library does not have a testsuite adapter for CL Test Grid.

To reports overview

Generated at: 2015-04-17 13:41:59 GMT.