dbus results collected by cl-test-grid

Results on the last two Quicklisp distributions

 quicklisp 2018-04-30quicklisp 2018-03-28
abcl-1.2.1-fasl42-linux-x86
(LOAD dbus FAIL) ASDF/FIND-SYSTEM:LOAD-SYSTEM-DEFINITION-ERROR : Error while trying to load definition for system dbus from pathname /home/testgrid/cl-test-grid/work-dir/agent/quicklisp/dists/quicklisp/software/dbus-20180228-git/dbus.asd: The symbol "REGISTER-SYSTEM-PACKAGES" was not found in package ASDF.
abcl-1.3.0-fasl42-linux-x86
(LOAD dbus FAIL) ASDF/FIND-SYSTEM:LOAD-SYSTEM-DEFINITION-ERROR : Error while trying to load definition for system dbus from pathname /home/testgrid/cl-test-grid/work-dir/agent/quicklisp/dists/quicklisp/software/dbus-20180228-git/dbus.asd: Component :ASDF does not match version 3.1.2, required by #<ASDF/SYSTEM:SYSTEM "asdf-package-system">
abcl-1.3.1-fasl42-linux-x86
(LOAD dbus FAIL) ASDF/FIND-SYSTEM:LOAD-SYSTEM-DEFINITION-ERROR : Error while trying to load definition for system dbus from pathname /home/testgrid/cl-test-grid/work-dir/agent/quicklisp/dists/quicklisp/software/dbus-20180228-git/dbus.asd: Component :ASDF does not match version 3.1.2, required by #<ASDF/SYSTEM:SYSTEM "asdf-package-system">
abcl-1.3.2-fasl42-linux-x86
(LOAD dbus FAIL) COMMON-LISP:SIMPLE-ERROR : COMPILE-CONSTANT unhandled case #<EQ HASH-TABLE 1 entry, 11 buckets {1653164}>
abcl-1.4.0-fasl42-linux-x86
(LOAD dbus FAIL) ASDF/FIND-SYSTEM:LOAD-SYSTEM-DEFINITION-ERROR : Error while trying to load definition for system iolib from pathname /home/testgrid/cl-test-grid/work-dir/agent/quicklisp/dists/quicklisp/software/iolib-v0.8.3/iolib.asd: org.armedbear.lisp.Go
abcl-1.5.0-fasl43-linux-x86
acl-10.0-linux-x86
(LOAD dbus FAIL) COMMON-LISP:SIMPLE-ERROR : this platform does not support :unsigned-long-long
acl-10.0m-linux-x86
(LOAD dbus FAIL) common-lisp:simple-error : this platform does not support :unsigned-long-long
acl-10.0ms-linux-x86
(LOAD dbus FAIL) common-lisp:simple-error : this platform does not support :unsigned-long-long
acl-10.0s-linux-x86
(LOAD dbus FAIL) COMMON-LISP:SIMPLE-ERROR : this platform does not support :unsigned-long-long
(LOAD dbus FAIL) COMMON-LISP:SIMPLE-ERROR : this platform does not support :unsigned-long-long
ccl-1.10-r16196-f96-linux-x86
ccl-1.11-5-rv1.11.5-f96-linux-x86
ccl-1.11-r16635-f101-linux-arm
(LOAD dbus FAIL) IOLIB/GROVEL::GROVEL-ERROR : External process exited with code 71. Command was: "g++" "-marm" "-Wno-write-strings" "-I/home/testgrid/cl-test-grid/work-dir/agent/quicklisp/dists/quicklisp/software/iolib-v0.8.3/src/grovel/" "-o" "/home/testgrid/cl-test-grid/work-dir/agent/test-runs/20180510071612-ccl-1.11-r16635-f101-linux-arm/fasl/ql/dists/quicklisp/software/iolib-v0.8.3/src/syscalls/ffi-types-unix" "/home/testgrid/cl-test-grid/work-dir/agent/test-runs/20180510071612-ccl-1.11-r16635-f101-linux-arm/fasl/ql/dists/quicklisp/software/iolib-v0.8.3/src/syscalls/ffi-types-unix.c" Output was: Error output was:
ccl-1.11-r16635-f96-linux-x86
ccl-1.11-r16702m-f101-linux-arm
(LOAD dbus FAIL) IOLIB/GROVEL::GROVEL-ERROR : External process exited with code 1. Command was: "g++" "-marm" "-Wno-write-strings" "-I/home/testgrid/cl-test-grid/work-dir/agent/quicklisp/dists/quicklisp/software/iolib-v0.8.3/src/grovel/" "-o" "/home/testgrid/cl-test-grid/work-dir/agent/test-runs/20180401030522-ccl-1.11-r16702m-f101-linux-arm/fasl/ql/dists/quicklisp/software/iolib-v0.8.3/src/syscalls/ffi-types-unix" "/home/testgrid/cl-test-grid/work-dir/agent/test-runs/20180401030522-ccl-1.11-r16702m-f101-linux-arm/fasl/ql/dists/quicklisp/software/iolib-v0.8.3/src/syscalls/ffi-types-unix.c" Output was: Error output was: /home/testgrid/cl-test-grid/work-dir/agent/test-runs/20180401030522-ccl-1.11-r16702m-f101-linux-arm/fasl/ql/dists/quicklisp/software/iolib-v0.8.3/src/syscalls/ffi-types-unix.c:14:17: fatal error: lfp.h: No such file or directory compilation terminated.
ccl-1.8-r15286m-f95-linux-x86
(LOAD dbus FAIL) ASDF:LOAD-SYSTEM-DEFINITION-ERROR : Error while trying to load definition for system dbus from pathname /home/testgrid/cl-test-grid/work-dir/agent/quicklisp/dists/quicklisp/software/dbus-20180228-git/dbus.asd: Reader error: No external symbol named "REGISTER-SYSTEM-PACKAGES" in package #<Package "ASDF"> .
ccl-1.9-r15756-f96-linux-x86
(LOAD dbus FAIL) ASDF/FIND-SYSTEM:LOAD-SYSTEM-DEFINITION-ERROR : Error while trying to load definition for system dbus from pathname /home/testgrid/cl-test-grid/work-dir/agent/quicklisp/dists/quicklisp/software/dbus-20180228-git/dbus.asd: Reader error: No external symbol named "REGISTER-SYSTEM-PACKAGES" in package #<Package "ASDF/INTERFACE"> .
clisp-2.49-unix-x86
(LOAD dbus FAIL) ASDF:LOAD-SYSTEM-DEFINITION-ERROR : Error while trying to load definition for system dbus from pathname /home/testgrid/cl-test-grid/work-dir/agent/quicklisp/dists/quicklisp/software/dbus-20180228-git/dbus.asd: READ from #<INPUT BUFFERED FILE-STREAM CHARACTER #P"/home/testgrid/cl-test-grid/work-dir/agent/quicklisp/dists/quicklisp/software/dbus-20180228-git/dbus.asd" @9>: #<PACKAGE ASDF> has no external symbol with name "REGISTER-SYSTEM-PACKAGES"
(LOAD dbus FAIL) ASDF:LOAD-SYSTEM-DEFINITION-ERROR : Error while trying to load definition for system dbus from pathname /home/testgrid/cl-test-grid/work-dir/agent/quicklisp/dists/quicklisp/software/dbus-20180228-git/dbus.asd: READ from #<INPUT BUFFERED FILE-STREAM CHARACTER #P"/home/testgrid/cl-test-grid/work-dir/agent/quicklisp/dists/quicklisp/software/dbus-20180228-git/dbus.asd" @9>: #<PACKAGE ASDF> has no external symbol with name "REGISTER-SYSTEM-PACKAGES"
cmu-snapshot-2013-04__20d_unicode_-linux-x86
(LOAD dbus FAIL) ASDF/FIND-SYSTEM:LOAD-SYSTEM-DEFINITION-ERROR : Error while trying to load definition for system dbus from pathname /home/testgrid/cl-test-grid/work-dir/agent/quicklisp/dists/quicklisp/software/dbus-20180228-git/dbus.asd: Reader error at 344 on #<Stream for file "/home/testgrid/cl-test-grid/work-dir/agent/quicklisp/dists/quicklisp/software/dbus-20180228-git/dbus.asd">: Symbol "REGISTER-SYSTEM-PACKAGES" not found in the ASDF/INTERFACE package.
cmu-snapshot-2014-01__20e_unicode_-linux-x86
(LOAD dbus FAIL) ASDF/FIND-SYSTEM:LOAD-SYSTEM-DEFINITION-ERROR : Error while trying to load definition for system dbus from pathname /home/testgrid/cl-test-grid/work-dir/agent/quicklisp/dists/quicklisp/software/dbus-20180228-git/dbus.asd: Reader error at 344 on #<Stream for file "/home/testgrid/cl-test-grid/work-dir/agent/quicklisp/dists/quicklisp/software/dbus-20180228-git/dbus.asd">: Symbol "REGISTER-SYSTEM-PACKAGES" not found in the ASDF/INTERFACE package.
cmu-snapshot-2014-05-dirty__20e_unicode_-linux-x86
(LOAD dbus FAIL) ASDF/FIND-SYSTEM:LOAD-SYSTEM-DEFINITION-ERROR : Error while trying to load definition for system dbus from pathname /home/testgrid/cl-test-grid/work-dir/agent/quicklisp/dists/quicklisp/software/dbus-20180228-git/dbus.asd: Reader error at 344 on #<Stream for file "/home/testgrid/cl-test-grid/work-dir/agent/quicklisp/dists/quicklisp/software/dbus-20180228-git/dbus.asd">: Symbol "REGISTER-SYSTEM-PACKAGES" not found in the ASDF/INTERFACE package.
cmu-snapshot-2014-12___20f_unicode_-linux-x86
cmu-snapshot-2016-12__21b_unicode_-linux-x86
ecl-13.5.1-unknown-linux-i686-bytecode
(LOAD dbus FAIL) ASDF/FIND-SYSTEM:LOAD-SYSTEM-DEFINITION-ERROR : Error while trying to load definition for system dbus from pathname /home/testgrid/cl-test-grid/work-dir/agent/quicklisp/dists/quicklisp/software/dbus-20180228-git/dbus.asd: Cannot find the external symbol REGISTER-SYSTEM-PACKAGES in #<"ASDF/INTERFACE" package>.
ecl-13.5.1-unknown-linux-i686-lisp-to-c
(LOAD dbus FAIL) ASDF/FIND-SYSTEM:LOAD-SYSTEM-DEFINITION-ERROR : Error while trying to load definition for system dbus from pathname /home/testgrid/cl-test-grid/work-dir/agent/quicklisp/dists/quicklisp/software/dbus-20180228-git/dbus.asd: Cannot find the external symbol REGISTER-SYSTEM-PACKAGES in #<"ASDF/INTERFACE" package>.
ecl-16.0.0-98fc12d3-linux-i686-bytecode
(LOAD dbus FAIL) ASDF/FIND-SYSTEM:LOAD-SYSTEM-DEFINITION-ERROR : Error while trying to load definition for system iolib from pathname /home/testgrid/cl-test-grid/work-dir/agent/quicklisp/dists/quicklisp/software/iolib-v0.8.3/iolib.asd: The variable C::*CC-FLAGS* is unbound.
ecl-16.0.0-98fc12d3-linux-i686-lisp-to-c
ecl-16.1.2-unknown-linux-x86-bytecode
(LOAD dbus FAIL) ASDF/FIND-SYSTEM:LOAD-SYSTEM-DEFINITION-ERROR : Error while trying to load definition for system iolib from pathname /home/testgrid/cl-test-grid/work-dir/agent/quicklisp/dists/quicklisp/software/iolib-v0.8.3/iolib.asd: The variable C::*CC-FLAGS* is unbound.
(LOAD dbus FAIL) ASDF/FIND-SYSTEM:LOAD-SYSTEM-DEFINITION-ERROR : Error while trying to load definition for system iolib from pathname /home/testgrid/cl-test-grid/work-dir/agent/quicklisp/dists/quicklisp/software/iolib-v0.8.3/iolib.asd: The variable C::*CC-FLAGS* is unbound.
ecl-16.1.2-unknown-linux-x86-lisp-to-c
sbcl-1.0.58-linux-x86
(LOAD dbus FAIL) ASDF:LOAD-SYSTEM-DEFINITION-ERROR : Error while trying to load definition for system dbus from pathname /home/testgrid/cl-test-grid/work-dir/agent/quicklisp/dists/quicklisp/software/dbus-20180228-git/dbus.asd: READ error during COMPILE-FILE: Symbol "REGISTER-SYSTEM-PACKAGES" not found in the ASDF package. Line: 9, Column: 30, File-Position: 343 Stream: #<SB-SYS:FD-STREAM for "file /home/testgrid/cl-test-grid/work-dir/agent/quicklisp/dists/quicklisp/software/dbus-20180228-git/dbus.asd" {B082B59}>
sbcl-1.1.11-linux-x86
(LOAD dbus FAIL) ASDF/FIND-SYSTEM:LOAD-SYSTEM-DEFINITION-ERROR : Error while trying to load definition for system dbus from pathname /home/testgrid/cl-test-grid/work-dir/agent/quicklisp/dists/quicklisp/software/dbus-20180228-git/dbus.asd: READ error during COMPILE-FILE: Symbol "REGISTER-SYSTEM-PACKAGES" not found in the ASDF/INTERFACE package.Line: 9, Column: 30, File-Position: 343Stream: #<SB-SYS:FD-STREAM for "file /home/testgrid/cl-test-grid/work-dir/agent/quicklisp/dists/quicklisp/software/dbus-20180228-git/dbus.asd" {C29A6B9}>
sbcl-1.1.16-linux-x86
(LOAD dbus FAIL) ASDF/FIND-SYSTEM:LOAD-SYSTEM-DEFINITION-ERROR : Error while trying to load definition for system dbus from pathname /home/testgrid/cl-test-grid/work-dir/agent/quicklisp/dists/quicklisp/software/dbus-20180228-git/dbus.asd: READ error during LOAD: Symbol "REGISTER-SYSTEM-PACKAGES" not found in the ASDF/INTERFACE package.Line: 9, Column: 30, File-Position: 343Stream: #<SB-SYS:FD-STREAM for "file /home/testgrid/cl-test-grid/work-dir/agent/quicklisp/dists/quicklisp/software/dbus-20180228-git/dbus.asd" {AF0D6B1}>
sbcl-1.2.6-linux-x86
sbcl-1.3.12-linux-arm
(LOAD dbus FAIL) COMMON-LISP:SIMPLE-ERROR : Couldn't execute "g++": No such file or directory
sbcl-1.3.12-linux-x86
sbcl-1.3.17-linux-x86
sbcl-1.3.2.92-4077405-dirty-linux-arm
(LOAD dbus FAIL) IOLIB/GROVEL::GROVEL-ERROR : External process exited with code 1. Command was: "g++" "-marm" "-Wno-write-strings" "-I/home/testgrid/cl-test-grid/work-dir/agent/quicklisp/dists/quicklisp/software/iolib-v0.8.3/src/grovel/" "-o" "/home/testgrid/cl-test-grid/work-dir/agent/test-runs/20180502085547-sbcl-1.3.2.92-4077405-dirty-linux-arm/fasl/ql/dists/quicklisp/software/iolib-v0.8.3/src/syscalls/ffi-types-unix" "/home/testgrid/cl-test-grid/work-dir/agent/test-runs/20180502085547-sbcl-1.3.2.92-4077405-dirty-linux-arm/fasl/ql/dists/quicklisp/software/iolib-v0.8.3/src/syscalls/ffi-types-unix.c" Output was: Error output was: /home/testgrid/cl-test-grid/work-dir/agent/test-runs/20180502085547-sbcl-1.3.2.92-4077405-dirty-linux-arm/fasl/ql/dists/quicklisp/software/iolib-v0.8.3/src/syscalls/ffi-types-unix.c:14:17: fatal error: lfp.h: No such file or directory compilation terminated.
(LOAD dbus FAIL) IOLIB/GROVEL::GROVEL-ERROR : External process exited with code 1. Command was: "g++" "-marm" "-Wno-write-strings" "-I/home/testgrid/cl-test-grid/work-dir/agent/quicklisp/dists/quicklisp/software/iolib-v0.8.3/src/grovel/" "-o" "/home/testgrid/cl-test-grid/work-dir/agent/test-runs/20180402085142-sbcl-1.3.2.92-4077405-dirty-linux-arm/fasl/ql/dists/quicklisp/software/iolib-v0.8.3/src/syscalls/ffi-types-unix" "/home/testgrid/cl-test-grid/work-dir/agent/test-runs/20180402085142-sbcl-1.3.2.92-4077405-dirty-linux-arm/fasl/ql/dists/quicklisp/software/iolib-v0.8.3/src/syscalls/ffi-types-unix.c" Output was: Error output was: /home/testgrid/cl-test-grid/work-dir/agent/test-runs/20180402085142-sbcl-1.3.2.92-4077405-dirty-linux-arm/fasl/ql/dists/quicklisp/software/iolib-v0.8.3/src/syscalls/ffi-types-unix.c:14:17: fatal error: lfp.h: No such file or directory compilation terminated.
sbcl-1.3.20-linux-x86
sbcl-1.3.21-linux-x86

Breakdown by testcases: for every failed testcase the lisp implmentations it fails on

The library does not have a testsuite adapter for CL Test Grid.

To reports overview

Generated at: 2018-05-11 23:35:23 GMT.