com.informatimago results collected by cl-test-grid

Results on the last two Quicklisp distributions

 quicklisp 2015-12-18quicklisp 2015-10-31
abcl-1.2.1-fasl42-linux-x86
(LOAD com.informatimago.tools.try-systems FAIL) COMMON-LISP:TYPE-ERROR : The value #(#:WHOLE-240664 #:ENVIRONMENT-240665 #:OPTION- #:G240705 #:G240706 #:G240707 #:G240708 #:G240745 #:G240790 #:G240842 #:G240886 #:G240938 #:G240983 #:G241034 #:G241079 #:WHOLE-241528 #:ENVIRONMENT-241529 #:G241905 #:G241898 #:G242147 #:G242133) is not of type LIST.
(LOAD com.informatimago.tools.test FAIL) COMMON-LISP:TYPE-ERROR : The value #(#:WHOLE-240664 #:ENVIRONMENT-240665 #:OPTION- #:G240705 #:G240706 #:G240707 #:G240708 #:G240745 #:G240790 #:G240842 #:G240886 #:G240938 #:G240983 #:G241034 #:G241079 #:WHOLE-241528 #:ENVIRONMENT-241529 #:G241905 #:G241898 #:G242147 #:G242133) is not of type LIST.
(LOAD com.informatimago.tools.script.test FAIL) COMMON-LISP:TYPE-ERROR : The value #(#:WHOLE-240664 #:ENVIRONMENT-240665 #:OPTION- #:G240705 #:G240706 #:G240707 #:G240708 #:G240745 #:G240790 #:G240842 #:G240886 #:G240938 #:G240983 #:G241034 #:G241079 #:WHOLE-241528 #:ENVIRONMENT-241529 #:G241905 #:G241898 #:G242147 #:G242133) is not of type LIST.
(LOAD com.informatimago.tools.script FAIL) COMMON-LISP:TYPE-ERROR : The value #(#:WHOLE-240664 #:ENVIRONMENT-240665 #:OPTION- #:G240705 #:G240706 #:G240707 #:G240708 #:G240745 #:G240790 #:G240842 #:G240886 #:G240938 #:G240983 #:G241034 #:G241079 #:WHOLE-241528 #:ENVIRONMENT-241529 #:G241905 #:G241898 #:G242147 #:G242133) is not of type LIST.
(LOAD com.informatimago.tools.check-asdf.test FAIL) COMMON-LISP:TYPE-ERROR : The value #(#:WHOLE-240664 #:ENVIRONMENT-240665 #:OPTION- #:G240705 #:G240706 #:G240707 #:G240708 #:G240745 #:G240790 #:G240842 #:G240886 #:G240938 #:G240983 #:G241034 #:G241079 #:WHOLE-241528 #:ENVIRONMENT-241529 #:G241905 #:G241898 #:G242147 #:G242133) is not of type LIST.
(LOAD com.informatimago.tools FAIL) COMMON-LISP:TYPE-ERROR : The value #(#:WHOLE-240664 #:ENVIRONMENT-240665 #:OPTION- #:G240705 #:G240706 #:G240707 #:G240708 #:G240745 #:G240790 #:G240842 #:G240886 #:G240938 #:G240983 #:G241034 #:G241079 #:WHOLE-241528 #:ENVIRONMENT-241529 #:G241905 #:G241898 #:G242147 #:G242133) is not of type LIST.
(LOAD com.informatimago.test FAIL) COMMON-LISP:TYPE-ERROR : The value #(#:WHOLE-240664 #:ENVIRONMENT-240665 #:OPTION- #:G240705 #:G240706 #:G240707 #:G240708 #:G240745 #:G240790 #:G240842 #:G240886 #:G240938 #:G240983 #:G241034 #:G241079 #:WHOLE-241528 #:ENVIRONMENT-241529 #:G241905 #:G241898 #:G242147 #:G242133) is not of type LIST.
(LOAD com.informatimago.editor.test FAIL) ffi-grovel, CFFI-GROVEL:GROVEL-ERROR : External process exited with code 1. Command was: "cc" "-m32" "-I/home/testgrid/cl-test-grid/work-dir/agent/quicklisp/dists/quicklisp/software/cffi_0.16.1/" "-o" "/home/testgrid/cl-test-grid/work-dir/agent/test-runs/20151225110854-abcl-1.2.1-fasl42-linux-x86/fasl/ql/dists/quicklisp/software/cl-charms-20151218-git/src/low-level/curses-grovel" "/home/testgrid/cl-test-grid/work-dir/agent/test-runs/20151225110854-abcl-1.2.1-fasl42-linux-x86/fasl/ql/dists/quicklisp/software/cl-charms-20151218-git/src/low-level/curses-grovel.c" Output was: /home/testgrid/cl-test-grid/work-dir/agent/test-runs/20151225110854-abcl-1.2.1-fasl42-linux-x86/fasl/ql/dists/quicklisp/software/cl-charms-20151218-git/src/low-level/curses-grovel.c:6:21: fatal error: ncurses.h: No such file or directory compilation terminated.
(LOAD com.informatimago.editor FAIL) ffi-grovel, CFFI-GROVEL:GROVEL-ERROR : External process exited with code 1. Command was: "cc" "-m32" "-I/home/testgrid/cl-test-grid/work-dir/agent/quicklisp/dists/quicklisp/software/cffi_0.16.1/" "-o" "/home/testgrid/cl-test-grid/work-dir/agent/test-runs/20151225110854-abcl-1.2.1-fasl42-linux-x86/fasl/ql/dists/quicklisp/software/cl-charms-20151218-git/src/low-level/curses-grovel" "/home/testgrid/cl-test-grid/work-dir/agent/test-runs/20151225110854-abcl-1.2.1-fasl42-linux-x86/fasl/ql/dists/quicklisp/software/cl-charms-20151218-git/src/low-level/curses-grovel.c" Output was: /home/testgrid/cl-test-grid/work-dir/agent/test-runs/20151225110854-abcl-1.2.1-fasl42-linux-x86/fasl/ql/dists/quicklisp/software/cl-charms-20151218-git/src/low-level/curses-grovel.c:6:21: fatal error: ncurses.h: No such file or directory compilation terminated.
(LOAD com.informatimago.clext.test FAIL) COMMON-LISP:PACKAGE-ERROR : NIL is not the name of a package.
(LOAD com.informatimago.clext.pipe.test FAIL) COMMON-LISP:PACKAGE-ERROR : NIL is not the name of a package.
(LOAD com.informatimago.clext.pipe FAIL) COMMON-LISP:PACKAGE-ERROR : NIL is not the name of a package.
(LOAD com.informatimago FAIL) COMMON-LISP:TYPE-ERROR : The value #(#:WHOLE-240664 #:ENVIRONMENT-240665 #:OPTION- #:G240705 #:G240706 #:G240707 #:G240708 #:G240745 #:G240790 #:G240842 #:G240886 #:G240938 #:G240983 #:G241034 #:G241079 #:WHOLE-241528 #:ENVIRONMENT-241529 #:G241905 #:G241898 #:G242147 #:G242133) is not of type LIST.
(LOAD com.informatimago.tools.script.test FAIL) COMMON-LISP:TYPE-ERROR : The value #(#:WHOLE-2914 #:ENVIRONMENT-2915 #:OPTION- #:G2955 #:G2956 #:G2957 #:G2958 #:G2995 #:G3040 #:G3092 #:G3136 #:G3188 #:G3233 #:G3284 #:G3329 #:WHOLE-3778 #:ENVIRONMENT-3779 #:G4155 #:G4148 #:G4397 #:G4383) is not of type LIST.
(LOAD com.informatimago.tools.script FAIL) COMMON-LISP:TYPE-ERROR : The value #(#:WHOLE-2914 #:ENVIRONMENT-2915 #:OPTION- #:G2955 #:G2956 #:G2957 #:G2958 #:G2995 #:G3040 #:G3092 #:G3136 #:G3188 #:G3233 #:G3284 #:G3329 #:WHOLE-3778 #:ENVIRONMENT-3779 #:G4155 #:G4148 #:G4397 #:G4383) is not of type LIST.
(LOAD com.informatimago.editor.test FAIL) ffi-grovel, CFFI-GROVEL:GROVEL-ERROR : External process exited with code 1. Command was: "cc" "-m32" "-I/home/testgrid/cl-test-grid/work-dir/agent/quicklisp/dists/quicklisp/software/cffi_0.16.1/" "-o" "/home/testgrid/cl-test-grid/work-dir/agent/test-runs/20151105194918-abcl-1.2.1-fasl42-linux-x86/fasl/ql/dists/quicklisp/software/cl-charms-20151031-git/src/low-level/curses-grovel" "/home/testgrid/cl-test-grid/work-dir/agent/test-runs/20151105194918-abcl-1.2.1-fasl42-linux-x86/fasl/ql/dists/quicklisp/software/cl-charms-20151031-git/src/low-level/curses-grovel.c" Output was: /home/testgrid/cl-test-grid/work-dir/agent/test-runs/20151105194918-abcl-1.2.1-fasl42-linux-x86/fasl/ql/dists/quicklisp/software/cl-charms-20151031-git/src/low-level/curses-grovel.c:6:21: fatal error: ncurses.h: No such file or directory compilation terminated.
(LOAD com.informatimago.editor FAIL) ffi-grovel, CFFI-GROVEL:GROVEL-ERROR : External process exited with code 1. Command was: "cc" "-m32" "-I/home/testgrid/cl-test-grid/work-dir/agent/quicklisp/dists/quicklisp/software/cffi_0.16.1/" "-o" "/home/testgrid/cl-test-grid/work-dir/agent/test-runs/20151105194918-abcl-1.2.1-fasl42-linux-x86/fasl/ql/dists/quicklisp/software/cl-charms-20151031-git/src/low-level/curses-grovel" "/home/testgrid/cl-test-grid/work-dir/agent/test-runs/20151105194918-abcl-1.2.1-fasl42-linux-x86/fasl/ql/dists/quicklisp/software/cl-charms-20151031-git/src/low-level/curses-grovel.c" Output was: /home/testgrid/cl-test-grid/work-dir/agent/test-runs/20151105194918-abcl-1.2.1-fasl42-linux-x86/fasl/ql/dists/quicklisp/software/cl-charms-20151031-git/src/low-level/curses-grovel.c:6:21: fatal error: ncurses.h: No such file or directory compilation terminated.
abcl-1.3.0-fasl42-linux-x86
(LOAD com.informatimago.tools.try-systems FAIL) COMMON-LISP:TYPE-ERROR : The value #(#:WHOLE-240228 #:ENVIRONMENT-240229 #:OPTION- #:G240269 #:G240270 #:G240271 #:G240272 #:G240309 #:G240354 #:G240406 #:G240450 #:G240502 #:G240547 #:G240598 #:G240643 #:WHOLE-241092 #:ENVIRONMENT-241093 #:G241469 #:G241703) is not of type LIST.
(LOAD com.informatimago.tools.test FAIL) COMMON-LISP:TYPE-ERROR : The value #(#:WHOLE-240228 #:ENVIRONMENT-240229 #:OPTION- #:G240269 #:G240270 #:G240271 #:G240272 #:G240309 #:G240354 #:G240406 #:G240450 #:G240502 #:G240547 #:G240598 #:G240643 #:WHOLE-241092 #:ENVIRONMENT-241093 #:G241469 #:G241703) is not of type LIST.
(LOAD com.informatimago.tools.script.test FAIL) COMMON-LISP:TYPE-ERROR : The value #(#:WHOLE-240228 #:ENVIRONMENT-240229 #:OPTION- #:G240269 #:G240270 #:G240271 #:G240272 #:G240309 #:G240354 #:G240406 #:G240450 #:G240502 #:G240547 #:G240598 #:G240643 #:WHOLE-241092 #:ENVIRONMENT-241093 #:G241469 #:G241703) is not of type LIST.
(LOAD com.informatimago.tools.script FAIL) COMMON-LISP:TYPE-ERROR : The value #(#:WHOLE-240228 #:ENVIRONMENT-240229 #:OPTION- #:G240269 #:G240270 #:G240271 #:G240272 #:G240309 #:G240354 #:G240406 #:G240450 #:G240502 #:G240547 #:G240598 #:G240643 #:WHOLE-241092 #:ENVIRONMENT-241093 #:G241469 #:G241703) is not of type LIST.
(LOAD com.informatimago.tools.check-asdf.test FAIL) COMMON-LISP:TYPE-ERROR : The value #(#:WHOLE-240228 #:ENVIRONMENT-240229 #:OPTION- #:G240269 #:G240270 #:G240271 #:G240272 #:G240309 #:G240354 #:G240406 #:G240450 #:G240502 #:G240547 #:G240598 #:G240643 #:WHOLE-241092 #:ENVIRONMENT-241093 #:G241469 #:G241703) is not of type LIST.
(LOAD com.informatimago.tools FAIL) COMMON-LISP:TYPE-ERROR : The value #(#:WHOLE-240228 #:ENVIRONMENT-240229 #:OPTION- #:G240269 #:G240270 #:G240271 #:G240272 #:G240309 #:G240354 #:G240406 #:G240450 #:G240502 #:G240547 #:G240598 #:G240643 #:WHOLE-241092 #:ENVIRONMENT-241093 #:G241469 #:G241703) is not of type LIST.
(LOAD com.informatimago.test FAIL) COMMON-LISP:TYPE-ERROR : The value #(#:WHOLE-240228 #:ENVIRONMENT-240229 #:OPTION- #:G240269 #:G240270 #:G240271 #:G240272 #:G240309 #:G240354 #:G240406 #:G240450 #:G240502 #:G240547 #:G240598 #:G240643 #:WHOLE-241092 #:ENVIRONMENT-241093 #:G241469 #:G241703) is not of type LIST.
(LOAD com.informatimago.small-cl-pgms.botihn FAIL) ASDF/FIND-SYSTEM:LOAD-SYSTEM-DEFINITION-ERROR : Error while trying to load definition for system chipz from pathname /home/testgrid/cl-test-grid/work-dir/agent/quicklisp/dists/quicklisp/software/chipz-20150505-git/chipz.asd: don't recognize component type :TXT-FILE
(LOAD com.informatimago.editor.test FAIL) ffi-grovel, CFFI-GROVEL:GROVEL-ERROR : External process exited with code 1. Command was: "cc" "-m32" "-I/home/testgrid/cl-test-grid/work-dir/agent/quicklisp/dists/quicklisp/software/cffi_0.16.1/" "-o" "/home/testgrid/cl-test-grid/work-dir/agent/test-runs/20151224194809-abcl-1.3.0-fasl42-linux-x86/fasl/ql/dists/quicklisp/software/cl-charms-20151218-git/src/low-level/curses-grovel" "/home/testgrid/cl-test-grid/work-dir/agent/test-runs/20151224194809-abcl-1.3.0-fasl42-linux-x86/fasl/ql/dists/quicklisp/software/cl-charms-20151218-git/src/low-level/curses-grovel.c" Output was: /home/testgrid/cl-test-grid/work-dir/agent/test-runs/20151224194809-abcl-1.3.0-fasl42-linux-x86/fasl/ql/dists/quicklisp/software/cl-charms-20151218-git/src/low-level/curses-grovel.c:6:21: fatal error: ncurses.h: No such file or directory compilation terminated.
(LOAD com.informatimago.editor FAIL) ffi-grovel, CFFI-GROVEL:GROVEL-ERROR : External process exited with code 1. Command was: "cc" "-m32" "-I/home/testgrid/cl-test-grid/work-dir/agent/quicklisp/dists/quicklisp/software/cffi_0.16.1/" "-o" "/home/testgrid/cl-test-grid/work-dir/agent/test-runs/20151224194809-abcl-1.3.0-fasl42-linux-x86/fasl/ql/dists/quicklisp/software/cl-charms-20151218-git/src/low-level/curses-grovel" "/home/testgrid/cl-test-grid/work-dir/agent/test-runs/20151224194809-abcl-1.3.0-fasl42-linux-x86/fasl/ql/dists/quicklisp/software/cl-charms-20151218-git/src/low-level/curses-grovel.c" Output was: /home/testgrid/cl-test-grid/work-dir/agent/test-runs/20151224194809-abcl-1.3.0-fasl42-linux-x86/fasl/ql/dists/quicklisp/software/cl-charms-20151218-git/src/low-level/curses-grovel.c:6:21: fatal error: ncurses.h: No such file or directory compilation terminated.
(LOAD com.informatimago.clext.test FAIL) COMMON-LISP:PACKAGE-ERROR : NIL is not the name of a package.
(LOAD com.informatimago.clext.pipe.test FAIL) COMMON-LISP:PACKAGE-ERROR : NIL is not the name of a package.
(LOAD com.informatimago.clext.pipe FAIL) COMMON-LISP:PACKAGE-ERROR : NIL is not the name of a package.
(LOAD com.informatimago FAIL) COMMON-LISP:TYPE-ERROR : The value #(#:WHOLE-240228 #:ENVIRONMENT-240229 #:OPTION- #:G240269 #:G240270 #:G240271 #:G240272 #:G240309 #:G240354 #:G240406 #:G240450 #:G240502 #:G240547 #:G240598 #:G240643 #:WHOLE-241092 #:ENVIRONMENT-241093 #:G241469 #:G241703) is not of type LIST.
(LOAD com.informatimago.tools.script.test FAIL) COMMON-LISP:TYPE-ERROR : The value #(#:WHOLE-2917 #:ENVIRONMENT-2918 #:OPTION- #:G2958 #:G2959 #:G2960 #:G2961 #:G2998 #:G3043 #:G3095 #:G3139 #:G3191 #:G3236 #:G3287 #:G3332 #:WHOLE-3781 #:ENVIRONMENT-3782 #:G4158 #:G4392) is not of type LIST.
(LOAD com.informatimago.tools.script FAIL) COMMON-LISP:TYPE-ERROR : The value #(#:WHOLE-2917 #:ENVIRONMENT-2918 #:OPTION- #:G2958 #:G2959 #:G2960 #:G2961 #:G2998 #:G3043 #:G3095 #:G3139 #:G3191 #:G3236 #:G3287 #:G3332 #:WHOLE-3781 #:ENVIRONMENT-3782 #:G4158 #:G4392) is not of type LIST.
(LOAD com.informatimago.small-cl-pgms.botihn FAIL) ASDF/FIND-SYSTEM:LOAD-SYSTEM-DEFINITION-ERROR : Error while trying to load definition for system chipz from pathname /home/testgrid/cl-test-grid/work-dir/agent/quicklisp/dists/quicklisp/software/chipz-20150505-git/chipz.asd: don't recognize component type :TXT-FILE
(LOAD com.informatimago.editor.test FAIL) ffi-grovel, CFFI-GROVEL:GROVEL-ERROR : External process exited with code 1. Command was: "cc" "-m32" "-I/home/testgrid/cl-test-grid/work-dir/agent/quicklisp/dists/quicklisp/software/cffi_0.16.1/" "-o" "/home/testgrid/cl-test-grid/work-dir/agent/test-runs/20151105050222-abcl-1.3.0-fasl42-linux-x86/fasl/ql/dists/quicklisp/software/cl-charms-20151031-git/src/low-level/curses-grovel" "/home/testgrid/cl-test-grid/work-dir/agent/test-runs/20151105050222-abcl-1.3.0-fasl42-linux-x86/fasl/ql/dists/quicklisp/software/cl-charms-20151031-git/src/low-level/curses-grovel.c" Output was: /home/testgrid/cl-test-grid/work-dir/agent/test-runs/20151105050222-abcl-1.3.0-fasl42-linux-x86/fasl/ql/dists/quicklisp/software/cl-charms-20151031-git/src/low-level/curses-grovel.c:6:21: fatal error: ncurses.h: No such file or directory compilation terminated.
(LOAD com.informatimago.editor FAIL) ffi-grovel, CFFI-GROVEL:GROVEL-ERROR : External process exited with code 1. Command was: "cc" "-m32" "-I/home/testgrid/cl-test-grid/work-dir/agent/quicklisp/dists/quicklisp/software/cffi_0.16.1/" "-o" "/home/testgrid/cl-test-grid/work-dir/agent/test-runs/20151105050222-abcl-1.3.0-fasl42-linux-x86/fasl/ql/dists/quicklisp/software/cl-charms-20151031-git/src/low-level/curses-grovel" "/home/testgrid/cl-test-grid/work-dir/agent/test-runs/20151105050222-abcl-1.3.0-fasl42-linux-x86/fasl/ql/dists/quicklisp/software/cl-charms-20151031-git/src/low-level/curses-grovel.c" Output was: /home/testgrid/cl-test-grid/work-dir/agent/test-runs/20151105050222-abcl-1.3.0-fasl42-linux-x86/fasl/ql/dists/quicklisp/software/cl-charms-20151031-git/src/low-level/curses-grovel.c:6:21: fatal error: ncurses.h: No such file or directory compilation terminated.
abcl-1.3.1-fasl42-linux-x86
(LOAD com.informatimago.tools.try-systems FAIL) COMMON-LISP:TYPE-ERROR : The value #(#:WHOLE-240228 #:ENVIRONMENT-240229 #:OPTION- #:G240269 #:G240270 #:G240271 #:G240272 #:G240309 #:G240354 #:G240406 #:G240450 #:G240502 #:G240547 #:G240598 #:G240643 #:WHOLE-241092 #:ENVIRONMENT-241093 #:G241469 #:G241703) is not of type LIST.
(LOAD com.informatimago.tools.test FAIL) COMMON-LISP:TYPE-ERROR : The value #(#:WHOLE-240228 #:ENVIRONMENT-240229 #:OPTION- #:G240269 #:G240270 #:G240271 #:G240272 #:G240309 #:G240354 #:G240406 #:G240450 #:G240502 #:G240547 #:G240598 #:G240643 #:WHOLE-241092 #:ENVIRONMENT-241093 #:G241469 #:G241703) is not of type LIST.
(LOAD com.informatimago.tools.script.test FAIL) COMMON-LISP:TYPE-ERROR : The value #(#:WHOLE-240228 #:ENVIRONMENT-240229 #:OPTION- #:G240269 #:G240270 #:G240271 #:G240272 #:G240309 #:G240354 #:G240406 #:G240450 #:G240502 #:G240547 #:G240598 #:G240643 #:WHOLE-241092 #:ENVIRONMENT-241093 #:G241469 #:G241703) is not of type LIST.
(LOAD com.informatimago.tools.script FAIL) COMMON-LISP:TYPE-ERROR : The value #(#:WHOLE-240228 #:ENVIRONMENT-240229 #:OPTION- #:G240269 #:G240270 #:G240271 #:G240272 #:G240309 #:G240354 #:G240406 #:G240450 #:G240502 #:G240547 #:G240598 #:G240643 #:WHOLE-241092 #:ENVIRONMENT-241093 #:G241469 #:G241703) is not of type LIST.
(LOAD com.informatimago.tools.check-asdf.test FAIL) COMMON-LISP:TYPE-ERROR : The value #(#:WHOLE-240228 #:ENVIRONMENT-240229 #:OPTION- #:G240269 #:G240270 #:G240271 #:G240272 #:G240309 #:G240354 #:G240406 #:G240450 #:G240502 #:G240547 #:G240598 #:G240643 #:WHOLE-241092 #:ENVIRONMENT-241093 #:G241469 #:G241703) is not of type LIST.
(LOAD com.informatimago.tools FAIL) COMMON-LISP:TYPE-ERROR : The value #(#:WHOLE-240228 #:ENVIRONMENT-240229 #:OPTION- #:G240269 #:G240270 #:G240271 #:G240272 #:G240309 #:G240354 #:G240406 #:G240450 #:G240502 #:G240547 #:G240598 #:G240643 #:WHOLE-241092 #:ENVIRONMENT-241093 #:G241469 #:G241703) is not of type LIST.
(LOAD com.informatimago.test FAIL) COMMON-LISP:TYPE-ERROR : The value #(#:WHOLE-240228 #:ENVIRONMENT-240229 #:OPTION- #:G240269 #:G240270 #:G240271 #:G240272 #:G240309 #:G240354 #:G240406 #:G240450 #:G240502 #:G240547 #:G240598 #:G240643 #:WHOLE-241092 #:ENVIRONMENT-241093 #:G241469 #:G241703) is not of type LIST.
(LOAD com.informatimago.editor.test FAIL) ffi-grovel, CFFI-GROVEL:GROVEL-ERROR : External process exited with code 1. Command was: "cc" "-m32" "-I/home/testgrid/cl-test-grid/work-dir/agent/quicklisp/dists/quicklisp/software/cffi_0.16.1/" "-o" "/home/testgrid/cl-test-grid/work-dir/agent/test-runs/20151224015518-abcl-1.3.1-fasl42-linux-x86/fasl/ql/dists/quicklisp/software/cl-charms-20151218-git/src/low-level/curses-grovel" "/home/testgrid/cl-test-grid/work-dir/agent/test-runs/20151224015518-abcl-1.3.1-fasl42-linux-x86/fasl/ql/dists/quicklisp/software/cl-charms-20151218-git/src/low-level/curses-grovel.c" Output was: /home/testgrid/cl-test-grid/work-dir/agent/test-runs/20151224015518-abcl-1.3.1-fasl42-linux-x86/fasl/ql/dists/quicklisp/software/cl-charms-20151218-git/src/low-level/curses-grovel.c:6:21: fatal error: ncurses.h: No such file or directory compilation terminated.
(LOAD com.informatimago.editor FAIL) ffi-grovel, CFFI-GROVEL:GROVEL-ERROR : External process exited with code 1. Command was: "cc" "-m32" "-I/home/testgrid/cl-test-grid/work-dir/agent/quicklisp/dists/quicklisp/software/cffi_0.16.1/" "-o" "/home/testgrid/cl-test-grid/work-dir/agent/test-runs/20151224015518-abcl-1.3.1-fasl42-linux-x86/fasl/ql/dists/quicklisp/software/cl-charms-20151218-git/src/low-level/curses-grovel" "/home/testgrid/cl-test-grid/work-dir/agent/test-runs/20151224015518-abcl-1.3.1-fasl42-linux-x86/fasl/ql/dists/quicklisp/software/cl-charms-20151218-git/src/low-level/curses-grovel.c" Output was: /home/testgrid/cl-test-grid/work-dir/agent/test-runs/20151224015518-abcl-1.3.1-fasl42-linux-x86/fasl/ql/dists/quicklisp/software/cl-charms-20151218-git/src/low-level/curses-grovel.c:6:21: fatal error: ncurses.h: No such file or directory compilation terminated.
(LOAD com.informatimago.clext.test FAIL) COMMON-LISP:PACKAGE-ERROR : NIL is not the name of a package.
(LOAD com.informatimago.clext.pipe.test FAIL) COMMON-LISP:PACKAGE-ERROR : NIL is not the name of a package.
(LOAD com.informatimago.clext.pipe FAIL) COMMON-LISP:PACKAGE-ERROR : NIL is not the name of a package.
(LOAD com.informatimago FAIL) COMMON-LISP:TYPE-ERROR : The value #(#:WHOLE-240228 #:ENVIRONMENT-240229 #:OPTION- #:G240269 #:G240270 #:G240271 #:G240272 #:G240309 #:G240354 #:G240406 #:G240450 #:G240502 #:G240547 #:G240598 #:G240643 #:WHOLE-241092 #:ENVIRONMENT-241093 #:G241469 #:G241703) is not of type LIST.
(LOAD com.informatimago.tools.script.test FAIL) COMMON-LISP:TYPE-ERROR : The value #(#:WHOLE-2917 #:ENVIRONMENT-2918 #:OPTION- #:G2958 #:G2959 #:G2960 #:G2961 #:G2998 #:G3043 #:G3095 #:G3139 #:G3191 #:G3236 #:G3287 #:G3332 #:WHOLE-3781 #:ENVIRONMENT-3782 #:G4158 #:G4392) is not of type LIST.
(LOAD com.informatimago.tools.script FAIL) COMMON-LISP:TYPE-ERROR : The value #(#:WHOLE-2917 #:ENVIRONMENT-2918 #:OPTION- #:G2958 #:G2959 #:G2960 #:G2961 #:G2998 #:G3043 #:G3095 #:G3139 #:G3191 #:G3236 #:G3287 #:G3332 #:WHOLE-3781 #:ENVIRONMENT-3782 #:G4158 #:G4392) is not of type LIST.
(LOAD com.informatimago.editor.test FAIL) ffi-grovel, CFFI-GROVEL:GROVEL-ERROR : External process exited with code 1. Command was: "cc" "-m32" "-I/home/testgrid/cl-test-grid/work-dir/agent/quicklisp/dists/quicklisp/software/cffi_0.16.1/" "-o" "/home/testgrid/cl-test-grid/work-dir/agent/test-runs/20151104115539-abcl-1.3.1-fasl42-linux-x86/fasl/ql/dists/quicklisp/software/cl-charms-20151031-git/src/low-level/curses-grovel" "/home/testgrid/cl-test-grid/work-dir/agent/test-runs/20151104115539-abcl-1.3.1-fasl42-linux-x86/fasl/ql/dists/quicklisp/software/cl-charms-20151031-git/src/low-level/curses-grovel.c" Output was: /home/testgrid/cl-test-grid/work-dir/agent/test-runs/20151104115539-abcl-1.3.1-fasl42-linux-x86/fasl/ql/dists/quicklisp/software/cl-charms-20151031-git/src/low-level/curses-grovel.c:6:21: fatal error: ncurses.h: No such file or directory compilation terminated.
(LOAD com.informatimago.editor FAIL) ffi-grovel, CFFI-GROVEL:GROVEL-ERROR : External process exited with code 1. Command was: "cc" "-m32" "-I/home/testgrid/cl-test-grid/work-dir/agent/quicklisp/dists/quicklisp/software/cffi_0.16.1/" "-o" "/home/testgrid/cl-test-grid/work-dir/agent/test-runs/20151104115539-abcl-1.3.1-fasl42-linux-x86/fasl/ql/dists/quicklisp/software/cl-charms-20151031-git/src/low-level/curses-grovel" "/home/testgrid/cl-test-grid/work-dir/agent/test-runs/20151104115539-abcl-1.3.1-fasl42-linux-x86/fasl/ql/dists/quicklisp/software/cl-charms-20151031-git/src/low-level/curses-grovel.c" Output was: /home/testgrid/cl-test-grid/work-dir/agent/test-runs/20151104115539-abcl-1.3.1-fasl42-linux-x86/fasl/ql/dists/quicklisp/software/cl-charms-20151031-git/src/low-level/curses-grovel.c:6:21: fatal error: ncurses.h: No such file or directory compilation terminated.
abcl-1.3.1-fasl42-macosx-x64
(LOAD com.ogamita.swig.test FAIL) COMMON-LISP:FILE-ERROR : The file http does not exist.
(LOAD com.ogamita.swig FAIL) COMMON-LISP:FILE-ERROR : The file http does not exist.
(LOAD com.informatimago.tools.script.test FAIL) COMMON-LISP:TYPE-ERROR : The value #(#:WHOLE-2917 #:ENVIRONMENT-2918 #:OPTION- #:G2958 #:G2959 #:G2960 #:G2961 #:G2998 #:G3043 #:G3095 #:G3139 #:G3191 #:G3236 #:G3287 #:G3332 #:WHOLE-3781 #:ENVIRONMENT-3782 #:G4158 #:G4392) is not of type LIST.
(LOAD com.informatimago.tools.script FAIL) COMMON-LISP:TYPE-ERROR : The value #(#:WHOLE-2917 #:ENVIRONMENT-2918 #:OPTION- #:G2958 #:G2959 #:G2960 #:G2961 #:G2998 #:G3043 #:G3095 #:G3139 #:G3191 #:G3236 #:G3287 #:G3332 #:WHOLE-3781 #:ENVIRONMENT-3782 #:G4158 #:G4392) is not of type LIST.
(LOAD com.informatimago.small-cl-pgms.botihn FAIL) COMMON-LISP:FILE-ERROR : The file http does not exist.
(LOAD com.informatimago.editor.test FAIL) ASDF/FIND-SYSTEM:LOAD-SYSTEM-DEFINITION-ERROR : Error while trying to load definition for system cl-charms from pathname /Users/testgrid/cl-test-grid/work-dir/agent/quicklisp/dists/quicklisp/software/cl-charms-20151031-git/cl-charms.asd: The file http does not exist.
(LOAD com.informatimago.editor FAIL) ASDF/FIND-SYSTEM:LOAD-SYSTEM-DEFINITION-ERROR : Error while trying to load definition for system cl-charms from pathname /Users/testgrid/cl-test-grid/work-dir/agent/quicklisp/dists/quicklisp/software/cl-charms-20151031-git/cl-charms.asd: The file http does not exist.
abcl-1.3.2-fasl42-linux-x86
(LOAD com.informatimago.tools.try-systems FAIL) COMMON-LISP:TYPE-ERROR : The value #(#:WHOLE-240177 #:ENVIRONMENT-240178 #:OPTION- #:G240218 #:G240219 #:G240220 #:G240221 #:G240258 #:G240303 #:G240355 #:G240399 #:G240451 #:G240496 #:G240547 #:G240592 #:WHOLE-241041 #:ENVIRONMENT-241042 #:G241418 #:G241652) is not of type LIST.
(LOAD com.informatimago.tools.test FAIL) COMMON-LISP:TYPE-ERROR : The value #(#:WHOLE-240177 #:ENVIRONMENT-240178 #:OPTION- #:G240218 #:G240219 #:G240220 #:G240221 #:G240258 #:G240303 #:G240355 #:G240399 #:G240451 #:G240496 #:G240547 #:G240592 #:WHOLE-241041 #:ENVIRONMENT-241042 #:G241418 #:G241652) is not of type LIST.
(LOAD com.informatimago.tools.script.test FAIL) COMMON-LISP:TYPE-ERROR : The value #(#:WHOLE-240177 #:ENVIRONMENT-240178 #:OPTION- #:G240218 #:G240219 #:G240220 #:G240221 #:G240258 #:G240303 #:G240355 #:G240399 #:G240451 #:G240496 #:G240547 #:G240592 #:WHOLE-241041 #:ENVIRONMENT-241042 #:G241418 #:G241652) is not of type LIST.
(LOAD com.informatimago.tools.script FAIL) COMMON-LISP:TYPE-ERROR : The value #(#:WHOLE-240177 #:ENVIRONMENT-240178 #:OPTION- #:G240218 #:G240219 #:G240220 #:G240221 #:G240258 #:G240303 #:G240355 #:G240399 #:G240451 #:G240496 #:G240547 #:G240592 #:WHOLE-241041 #:ENVIRONMENT-241042 #:G241418 #:G241652) is not of type LIST.
(LOAD com.informatimago.tools.check-asdf.test FAIL) COMMON-LISP:TYPE-ERROR : The value #(#:WHOLE-240177 #:ENVIRONMENT-240178 #:OPTION- #:G240218 #:G240219 #:G240220 #:G240221 #:G240258 #:G240303 #:G240355 #:G240399 #:G240451 #:G240496 #:G240547 #:G240592 #:WHOLE-241041 #:ENVIRONMENT-241042 #:G241418 #:G241652) is not of type LIST.
(LOAD com.informatimago.tools FAIL) COMMON-LISP:TYPE-ERROR : The value #(#:WHOLE-240177 #:ENVIRONMENT-240178 #:OPTION- #:G240218 #:G240219 #:G240220 #:G240221 #:G240258 #:G240303 #:G240355 #:G240399 #:G240451 #:G240496 #:G240547 #:G240592 #:WHOLE-241041 #:ENVIRONMENT-241042 #:G241418 #:G241652) is not of type LIST.
(LOAD com.informatimago.test FAIL) COMMON-LISP:TYPE-ERROR : The value #(#:WHOLE-240177 #:ENVIRONMENT-240178 #:OPTION- #:G240218 #:G240219 #:G240220 #:G240221 #:G240258 #:G240303 #:G240355 #:G240399 #:G240451 #:G240496 #:G240547 #:G240592 #:WHOLE-241041 #:ENVIRONMENT-241042 #:G241418 #:G241652) is not of type LIST.
(LOAD com.informatimago.editor.test FAIL) ffi-grovel, CFFI-GROVEL:GROVEL-ERROR : External process exited with code 1. Command was: "cc" "-m32" "-I/home/testgrid/cl-test-grid/work-dir/agent/quicklisp/dists/quicklisp/software/cffi_0.16.1/" "-o" "/home/testgrid/cl-test-grid/work-dir/agent/test-runs/20151221172256-abcl-1.3.2-fasl42-linux-x86/fasl/ql/dists/quicklisp/software/cl-charms-20151218-git/src/low-level/curses-grovel" "/home/testgrid/cl-test-grid/work-dir/agent/test-runs/20151221172256-abcl-1.3.2-fasl42-linux-x86/fasl/ql/dists/quicklisp/software/cl-charms-20151218-git/src/low-level/curses-grovel.c" Output was: /home/testgrid/cl-test-grid/work-dir/agent/test-runs/20151221172256-abcl-1.3.2-fasl42-linux-x86/fasl/ql/dists/quicklisp/software/cl-charms-20151218-git/src/low-level/curses-grovel.c:6:21: fatal error: ncurses.h: No such file or directory compilation terminated.
(LOAD com.informatimago.editor FAIL) ffi-grovel, CFFI-GROVEL:GROVEL-ERROR : External process exited with code 1. Command was: "cc" "-m32" "-I/home/testgrid/cl-test-grid/work-dir/agent/quicklisp/dists/quicklisp/software/cffi_0.16.1/" "-o" "/home/testgrid/cl-test-grid/work-dir/agent/test-runs/20151221172256-abcl-1.3.2-fasl42-linux-x86/fasl/ql/dists/quicklisp/software/cl-charms-20151218-git/src/low-level/curses-grovel" "/home/testgrid/cl-test-grid/work-dir/agent/test-runs/20151221172256-abcl-1.3.2-fasl42-linux-x86/fasl/ql/dists/quicklisp/software/cl-charms-20151218-git/src/low-level/curses-grovel.c" Output was: /home/testgrid/cl-test-grid/work-dir/agent/test-runs/20151221172256-abcl-1.3.2-fasl42-linux-x86/fasl/ql/dists/quicklisp/software/cl-charms-20151218-git/src/low-level/curses-grovel.c:6:21: fatal error: ncurses.h: No such file or directory compilation terminated.
(LOAD com.informatimago.clext.test FAIL) COMMON-LISP:PACKAGE-ERROR : NIL is not the name of a package.
(LOAD com.informatimago.clext.pipe.test FAIL) COMMON-LISP:PACKAGE-ERROR : NIL is not the name of a package.
(LOAD com.informatimago.clext.pipe FAIL) COMMON-LISP:PACKAGE-ERROR : NIL is not the name of a package.
(LOAD com.informatimago FAIL) COMMON-LISP:TYPE-ERROR : The value #(#:WHOLE-240177 #:ENVIRONMENT-240178 #:OPTION- #:G240218 #:G240219 #:G240220 #:G240221 #:G240258 #:G240303 #:G240355 #:G240399 #:G240451 #:G240496 #:G240547 #:G240592 #:WHOLE-241041 #:ENVIRONMENT-241042 #:G241418 #:G241652) is not of type LIST.
(LOAD com.informatimago.tools.script.test FAIL) COMMON-LISP:TYPE-ERROR : The value #(#:WHOLE-2919 #:ENVIRONMENT-2920 #:OPTION- #:G2960 #:G2961 #:G2962 #:G2963 #:G3000 #:G3045 #:G3097 #:G3141 #:G3193 #:G3238 #:G3289 #:G3334 #:WHOLE-3783 #:ENVIRONMENT-3784 #:G4160 #:G4394) is not of type LIST.
(LOAD com.informatimago.tools.script FAIL) COMMON-LISP:TYPE-ERROR : The value #(#:WHOLE-2919 #:ENVIRONMENT-2920 #:OPTION- #:G2960 #:G2961 #:G2962 #:G2963 #:G3000 #:G3045 #:G3097 #:G3141 #:G3193 #:G3238 #:G3289 #:G3334 #:WHOLE-3783 #:ENVIRONMENT-3784 #:G4160 #:G4394) is not of type LIST.
(LOAD com.informatimago.editor.test FAIL) ffi-grovel, CFFI-GROVEL:GROVEL-ERROR : External process exited with code 1. Command was: "cc" "-m32" "-I/home/testgrid/cl-test-grid/work-dir/agent/quicklisp/dists/quicklisp/software/cffi_0.16.1/" "-o" "/home/testgrid/cl-test-grid/work-dir/agent/test-runs/20151102072216-abcl-1.3.2-fasl42-linux-x86/fasl/ql/dists/quicklisp/software/cl-charms-20151031-git/src/low-level/curses-grovel" "/home/testgrid/cl-test-grid/work-dir/agent/test-runs/20151102072216-abcl-1.3.2-fasl42-linux-x86/fasl/ql/dists/quicklisp/software/cl-charms-20151031-git/src/low-level/curses-grovel.c" Output was: /home/testgrid/cl-test-grid/work-dir/agent/test-runs/20151102072216-abcl-1.3.2-fasl42-linux-x86/fasl/ql/dists/quicklisp/software/cl-charms-20151031-git/src/low-level/curses-grovel.c:6:21: fatal error: ncurses.h: No such file or directory compilation terminated.
(LOAD com.informatimago.editor FAIL) ffi-grovel, CFFI-GROVEL:GROVEL-ERROR : External process exited with code 1. Command was: "cc" "-m32" "-I/home/testgrid/cl-test-grid/work-dir/agent/quicklisp/dists/quicklisp/software/cffi_0.16.1/" "-o" "/home/testgrid/cl-test-grid/work-dir/agent/test-runs/20151102072216-abcl-1.3.2-fasl42-linux-x86/fasl/ql/dists/quicklisp/software/cl-charms-20151031-git/src/low-level/curses-grovel" "/home/testgrid/cl-test-grid/work-dir/agent/test-runs/20151102072216-abcl-1.3.2-fasl42-linux-x86/fasl/ql/dists/quicklisp/software/cl-charms-20151031-git/src/low-level/curses-grovel.c" Output was: /home/testgrid/cl-test-grid/work-dir/agent/test-runs/20151102072216-abcl-1.3.2-fasl42-linux-x86/fasl/ql/dists/quicklisp/software/cl-charms-20151031-git/src/low-level/curses-grovel.c:6:21: fatal error: ncurses.h: No such file or directory compilation terminated.
ccl-1.10-r16196-f101-linux-arm
(LOAD com.informatimago.tools.try-systems FAIL) COM.INFORMATIMAGO.COMMON-LISP.CESARUM.CHARACTER-SETS:CHARACTER-SET-ERROR : There is no character-set named "NIL"
(LOAD com.informatimago.tools.test FAIL) COM.INFORMATIMAGO.COMMON-LISP.CESARUM.CHARACTER-SETS:CHARACTER-SET-ERROR : There is no character-set named "NIL"
(LOAD com.informatimago.tools.summary.test FAIL) COM.INFORMATIMAGO.COMMON-LISP.CESARUM.CHARACTER-SETS:CHARACTER-SET-ERROR : There is no character-set named "NIL"
(LOAD com.informatimago.tools.summary FAIL) COM.INFORMATIMAGO.COMMON-LISP.CESARUM.CHARACTER-SETS:CHARACTER-SET-ERROR : There is no character-set named "NIL"
(LOAD com.informatimago.tools.source.test FAIL) COM.INFORMATIMAGO.COMMON-LISP.CESARUM.CHARACTER-SETS:CHARACTER-SET-ERROR : There is no character-set named "NIL"
(LOAD com.informatimago.tools.source FAIL) COM.INFORMATIMAGO.COMMON-LISP.CESARUM.CHARACTER-SETS:CHARACTER-SET-ERROR : There is no character-set named "NIL"
(LOAD com.informatimago.tools.make-depends.test FAIL) COM.INFORMATIMAGO.COMMON-LISP.CESARUM.CHARACTER-SETS:CHARACTER-SET-ERROR : There is no character-set named "NIL"
(LOAD com.informatimago.tools.make-depends FAIL) COM.INFORMATIMAGO.COMMON-LISP.CESARUM.CHARACTER-SETS:CHARACTER-SET-ERROR : There is no character-set named "NIL"
(LOAD com.informatimago.tools.check-asdf.test FAIL) COM.INFORMATIMAGO.COMMON-LISP.CESARUM.CHARACTER-SETS:CHARACTER-SET-ERROR : There is no character-set named "NIL"
(LOAD com.informatimago.tools.check-asdf FAIL) COM.INFORMATIMAGO.COMMON-LISP.CESARUM.CHARACTER-SETS:CHARACTER-SET-ERROR : There is no character-set named "NIL"
(LOAD com.informatimago.tools FAIL) COM.INFORMATIMAGO.COMMON-LISP.CESARUM.CHARACTER-SETS:CHARACTER-SET-ERROR : There is no character-set named "NIL"
(LOAD com.informatimago.test FAIL) COM.INFORMATIMAGO.COMMON-LISP.CESARUM.CHARACTER-SETS:CHARACTER-SET-ERROR : There is no character-set named "NIL"
(LOAD com.informatimago.editor.test FAIL) ffi-grovel, CFFI-GROVEL:GROVEL-ERROR : External process exited with code 1. Command was: "cc" "-marm" "-I/home/testgrid/cl-test-grid/work-dir/agent/quicklisp/dists/quicklisp/software/cffi_0.16.1/" "-o" "/home/testgrid/cl-test-grid/work-dir/agent/test-runs/20151221221845-ccl-1.10-r16196-f101-linux-arm/fasl/ql/dists/quicklisp/software/cl-charms-20151218-git/src/low-level/curses-grovel" "/home/testgrid/cl-test-grid/work-dir/agent/test-runs/20151221221845-ccl-1.10-r16196-f101-linux-arm/fasl/ql/dists/quicklisp/software/cl-charms-20151218-git/src/low-level/curses-grovel.c" Output was: /home/testgrid/cl-test-grid/work-dir/agent/test-runs/20151221221845-ccl-1.10-r16196-f101-linux-arm/fasl/ql/dists/quicklisp/software/cl-charms-20151218-git/src/low-level/curses-grovel.c:6:21: fatal error: ncurses.h: No such file or directory #include <ncurses.h> ^ compilation terminated.
(LOAD com.informatimago.editor FAIL) ffi-grovel, CFFI-GROVEL:GROVEL-ERROR : External process exited with code 1. Command was: "cc" "-marm" "-I/home/testgrid/cl-test-grid/work-dir/agent/quicklisp/dists/quicklisp/software/cffi_0.16.1/" "-o" "/home/testgrid/cl-test-grid/work-dir/agent/test-runs/20151221221845-ccl-1.10-r16196-f101-linux-arm/fasl/ql/dists/quicklisp/software/cl-charms-20151218-git/src/low-level/curses-grovel" "/home/testgrid/cl-test-grid/work-dir/agent/test-runs/20151221221845-ccl-1.10-r16196-f101-linux-arm/fasl/ql/dists/quicklisp/software/cl-charms-20151218-git/src/low-level/curses-grovel.c" Output was: /home/testgrid/cl-test-grid/work-dir/agent/test-runs/20151221221845-ccl-1.10-r16196-f101-linux-arm/fasl/ql/dists/quicklisp/software/cl-charms-20151218-git/src/low-level/curses-grovel.c:6:21: fatal error: ncurses.h: No such file or directory #include <ncurses.h> ^ compilation terminated.
(LOAD com.informatimago FAIL) COM.INFORMATIMAGO.COMMON-LISP.CESARUM.CHARACTER-SETS:CHARACTER-SET-ERROR : There is no character-set named "NIL"
(LOAD com.informatimago.editor.test FAIL) ffi-grovel, CFFI-GROVEL:GROVEL-ERROR : External process exited with code 1. Command was: "cc" "-marm" "-I/home/testgrid/cl-test-grid/work-dir/agent/quicklisp/dists/quicklisp/software/cffi_0.16.1/" "-o" "/home/testgrid/cl-test-grid/work-dir/agent/test-runs/20151104042657-ccl-1.10-r16196-f101-linux-arm/fasl/ql/dists/quicklisp/software/cl-charms-20151031-git/src/low-level/curses-grovel" "/home/testgrid/cl-test-grid/work-dir/agent/test-runs/20151104042657-ccl-1.10-r16196-f101-linux-arm/fasl/ql/dists/quicklisp/software/cl-charms-20151031-git/src/low-level/curses-grovel.c" Output was: /home/testgrid/cl-test-grid/work-dir/agent/test-runs/20151104042657-ccl-1.10-r16196-f101-linux-arm/fasl/ql/dists/quicklisp/software/cl-charms-20151031-git/src/low-level/curses-grovel.c:6:21: fatal error: ncurses.h: No such file or directory #include <ncurses.h> ^ compilation terminated.
(LOAD com.informatimago.editor FAIL) ffi-grovel, CFFI-GROVEL:GROVEL-ERROR : External process exited with code 1. Command was: "cc" "-marm" "-I/home/testgrid/cl-test-grid/work-dir/agent/quicklisp/dists/quicklisp/software/cffi_0.16.1/" "-o" "/home/testgrid/cl-test-grid/work-dir/agent/test-runs/20151104042657-ccl-1.10-r16196-f101-linux-arm/fasl/ql/dists/quicklisp/software/cl-charms-20151031-git/src/low-level/curses-grovel" "/home/testgrid/cl-test-grid/work-dir/agent/test-runs/20151104042657-ccl-1.10-r16196-f101-linux-arm/fasl/ql/dists/quicklisp/software/cl-charms-20151031-git/src/low-level/curses-grovel.c" Output was: /home/testgrid/cl-test-grid/work-dir/agent/test-runs/20151104042657-ccl-1.10-r16196-f101-linux-arm/fasl/ql/dists/quicklisp/software/cl-charms-20151031-git/src/low-level/curses-grovel.c:6:21: fatal error: ncurses.h: No such file or directory #include <ncurses.h> ^ compilation terminated.
ccl-1.10-r16196-f96-linux-x64
ccl-1.10-r16196-f96-linux-x86
(LOAD com.informatimago.test FAIL) ffi-grovel, CFFI-GROVEL:GROVEL-ERROR : External process exited with code 1. Command was: "cc" "-m32" "-I/home/testgrid/cl-test-grid/work-dir/agent/quicklisp/dists/quicklisp/software/cffi_0.16.1/" "-o" "/home/testgrid/cl-test-grid/work-dir/agent/test-runs/20151220123809-ccl-1.10-r16196-f96-linux-x86/fasl/ql/dists/quicklisp/software/cl-charms-20151218-git/src/low-level/curses-grovel" "/home/testgrid/cl-test-grid/work-dir/agent/test-runs/20151220123809-ccl-1.10-r16196-f96-linux-x86/fasl/ql/dists/quicklisp/software/cl-charms-20151218-git/src/low-level/curses-grovel.c" Output was: /home/testgrid/cl-test-grid/work-dir/agent/test-runs/20151220123809-ccl-1.10-r16196-f96-linux-x86/fasl/ql/dists/quicklisp/software/cl-charms-20151218-git/src/low-level/curses-grovel.c:6:21: fatal error: ncurses.h: No such file or directory compilation terminated.
(LOAD com.informatimago.editor.test FAIL) ffi-grovel, CFFI-GROVEL:GROVEL-ERROR : External process exited with code 1. Command was: "cc" "-m32" "-I/home/testgrid/cl-test-grid/work-dir/agent/quicklisp/dists/quicklisp/software/cffi_0.16.1/" "-o" "/home/testgrid/cl-test-grid/work-dir/agent/test-runs/20151220123809-ccl-1.10-r16196-f96-linux-x86/fasl/ql/dists/quicklisp/software/cl-charms-20151218-git/src/low-level/curses-grovel" "/home/testgrid/cl-test-grid/work-dir/agent/test-runs/20151220123809-ccl-1.10-r16196-f96-linux-x86/fasl/ql/dists/quicklisp/software/cl-charms-20151218-git/src/low-level/curses-grovel.c" Output was: /home/testgrid/cl-test-grid/work-dir/agent/test-runs/20151220123809-ccl-1.10-r16196-f96-linux-x86/fasl/ql/dists/quicklisp/software/cl-charms-20151218-git/src/low-level/curses-grovel.c:6:21: fatal error: ncurses.h: No such file or directory compilation terminated.
(LOAD com.informatimago.editor FAIL) ffi-grovel, CFFI-GROVEL:GROVEL-ERROR : External process exited with code 1. Command was: "cc" "-m32" "-I/home/testgrid/cl-test-grid/work-dir/agent/quicklisp/dists/quicklisp/software/cffi_0.16.1/" "-o" "/home/testgrid/cl-test-grid/work-dir/agent/test-runs/20151220123809-ccl-1.10-r16196-f96-linux-x86/fasl/ql/dists/quicklisp/software/cl-charms-20151218-git/src/low-level/curses-grovel" "/home/testgrid/cl-test-grid/work-dir/agent/test-runs/20151220123809-ccl-1.10-r16196-f96-linux-x86/fasl/ql/dists/quicklisp/software/cl-charms-20151218-git/src/low-level/curses-grovel.c" Output was: /home/testgrid/cl-test-grid/work-dir/agent/test-runs/20151220123809-ccl-1.10-r16196-f96-linux-x86/fasl/ql/dists/quicklisp/software/cl-charms-20151218-git/src/low-level/curses-grovel.c:6:21: fatal error: ncurses.h: No such file or directory compilation terminated.
(LOAD com.informatimago FAIL) ffi-grovel, CFFI-GROVEL:GROVEL-ERROR : External process exited with code 1. Command was: "cc" "-m32" "-I/home/testgrid/cl-test-grid/work-dir/agent/quicklisp/dists/quicklisp/software/cffi_0.16.1/" "-o" "/home/testgrid/cl-test-grid/work-dir/agent/test-runs/20151220123809-ccl-1.10-r16196-f96-linux-x86/fasl/ql/dists/quicklisp/software/cl-charms-20151218-git/src/low-level/curses-grovel" "/home/testgrid/cl-test-grid/work-dir/agent/test-runs/20151220123809-ccl-1.10-r16196-f96-linux-x86/fasl/ql/dists/quicklisp/software/cl-charms-20151218-git/src/low-level/curses-grovel.c" Output was: /home/testgrid/cl-test-grid/work-dir/agent/test-runs/20151220123809-ccl-1.10-r16196-f96-linux-x86/fasl/ql/dists/quicklisp/software/cl-charms-20151218-git/src/low-level/curses-grovel.c:6:21: fatal error: ncurses.h: No such file or directory compilation terminated.
(LOAD com.informatimago.editor.test FAIL) ffi-grovel, CFFI-GROVEL:GROVEL-ERROR : External process exited with code 1. Command was: "cc" "-m32" "-I/home/testgrid/cl-test-grid/work-dir/agent/quicklisp/dists/quicklisp/software/cffi_0.16.1/" "-o" "/home/testgrid/cl-test-grid/work-dir/agent/test-runs/20151101013712-ccl-1.10-r16196-f96-linux-x86/fasl/ql/dists/quicklisp/software/cl-charms-20151031-git/src/low-level/curses-grovel" "/home/testgrid/cl-test-grid/work-dir/agent/test-runs/20151101013712-ccl-1.10-r16196-f96-linux-x86/fasl/ql/dists/quicklisp/software/cl-charms-20151031-git/src/low-level/curses-grovel.c" Output was: /home/testgrid/cl-test-grid/work-dir/agent/test-runs/20151101013712-ccl-1.10-r16196-f96-linux-x86/fasl/ql/dists/quicklisp/software/cl-charms-20151031-git/src/low-level/curses-grovel.c:6:21: fatal error: ncurses.h: No such file or directory compilation terminated.
(LOAD com.informatimago.editor FAIL) ffi-grovel, CFFI-GROVEL:GROVEL-ERROR : External process exited with code 1. Command was: "cc" "-m32" "-I/home/testgrid/cl-test-grid/work-dir/agent/quicklisp/dists/quicklisp/software/cffi_0.16.1/" "-o" "/home/testgrid/cl-test-grid/work-dir/agent/test-runs/20151101013712-ccl-1.10-r16196-f96-linux-x86/fasl/ql/dists/quicklisp/software/cl-charms-20151031-git/src/low-level/curses-grovel" "/home/testgrid/cl-test-grid/work-dir/agent/test-runs/20151101013712-ccl-1.10-r16196-f96-linux-x86/fasl/ql/dists/quicklisp/software/cl-charms-20151031-git/src/low-level/curses-grovel.c" Output was: /home/testgrid/cl-test-grid/work-dir/agent/test-runs/20151101013712-ccl-1.10-r16196-f96-linux-x86/fasl/ql/dists/quicklisp/software/cl-charms-20151031-git/src/low-level/curses-grovel.c:6:21: fatal error: ncurses.h: No such file or directory compilation terminated.
ccl-1.10-r16196-f96-macosx-x86
(LOAD com.ogamita.swig.test FAIL) ASDF/FIND-COMPONENT:MISSING-DEPENDENCY : Component "packages" not found, required by #<CL-SOURCE-FILE "com.ogamita.swig" "coregraphics">
(LOAD com.ogamita.swig FAIL) ASDF/FIND-COMPONENT:MISSING-DEPENDENCY : Component "packages" not found, required by #<CL-SOURCE-FILE "com.ogamita.swig" "coregraphics">
(LOAD com.informatimago.objcl.test FAIL) COMMON-LISP:FILE-ERROR : Can't create directory "/usr/local/src/ccl-1.10/temp bundle32.app/".
(LOAD com.informatimago.objcl FAIL) COMMON-LISP:FILE-ERROR : Can't create directory "/usr/local/src/ccl-1.10/temp bundle32.app/".
ccl-1.10-r16393-f96-macosx-x64
(LOAD com.ogamita.swig.test FAIL) ASDF/FIND-COMPONENT:MISSING-DEPENDENCY : Component "packages" not found, required by #<CL-SOURCE-FILE "com.ogamita.swig" "coregraphics">
(LOAD com.ogamita.swig FAIL) ASDF/FIND-COMPONENT:MISSING-DEPENDENCY : Component "packages" not found, required by #<CL-SOURCE-FILE "com.ogamita.swig" "coregraphics">
(LOAD com.informatimago.objcl.test FAIL) COMMON-LISP:FILE-ERROR : Can't create directory "/usr/local/src/ccl-1.10/temp bundle64.app/".
(LOAD com.informatimago.objcl FAIL) COMMON-LISP:FILE-ERROR : Can't create directory "/usr/local/src/ccl-1.10/temp bundle64.app/".
ccl-1.11-r16635-f96-linux-x86
(LOAD com.informatimago.test FAIL) ffi-grovel, CFFI-GROVEL:GROVEL-ERROR : External process exited with code 1. Command was: "cc" "-m32" "-I/home/testgrid/cl-test-grid/work-dir/agent/quicklisp/dists/quicklisp/software/cffi_0.16.1/" "-o" "/home/testgrid/cl-test-grid/work-dir/agent/test-runs/20151222104841-ccl-1.11-r16635-f96-linux-x86/fasl/ql/dists/quicklisp/software/cl-charms-20151218-git/src/low-level/curses-grovel" "/home/testgrid/cl-test-grid/work-dir/agent/test-runs/20151222104841-ccl-1.11-r16635-f96-linux-x86/fasl/ql/dists/quicklisp/software/cl-charms-20151218-git/src/low-level/curses-grovel.c" Output was: /home/testgrid/cl-test-grid/work-dir/agent/test-runs/20151222104841-ccl-1.11-r16635-f96-linux-x86/fasl/ql/dists/quicklisp/software/cl-charms-20151218-git/src/low-level/curses-grovel.c:6:21: fatal error: ncurses.h: No such file or directory compilation terminated.
(LOAD com.informatimago.editor.test FAIL) ffi-grovel, CFFI-GROVEL:GROVEL-ERROR : External process exited with code 1. Command was: "cc" "-m32" "-I/home/testgrid/cl-test-grid/work-dir/agent/quicklisp/dists/quicklisp/software/cffi_0.16.1/" "-o" "/home/testgrid/cl-test-grid/work-dir/agent/test-runs/20151222104841-ccl-1.11-r16635-f96-linux-x86/fasl/ql/dists/quicklisp/software/cl-charms-20151218-git/src/low-level/curses-grovel" "/home/testgrid/cl-test-grid/work-dir/agent/test-runs/20151222104841-ccl-1.11-r16635-f96-linux-x86/fasl/ql/dists/quicklisp/software/cl-charms-20151218-git/src/low-level/curses-grovel.c" Output was: /home/testgrid/cl-test-grid/work-dir/agent/test-runs/20151222104841-ccl-1.11-r16635-f96-linux-x86/fasl/ql/dists/quicklisp/software/cl-charms-20151218-git/src/low-level/curses-grovel.c:6:21: fatal error: ncurses.h: No such file or directory compilation terminated.
(LOAD com.informatimago.editor FAIL) ffi-grovel, CFFI-GROVEL:GROVEL-ERROR : External process exited with code 1. Command was: "cc" "-m32" "-I/home/testgrid/cl-test-grid/work-dir/agent/quicklisp/dists/quicklisp/software/cffi_0.16.1/" "-o" "/home/testgrid/cl-test-grid/work-dir/agent/test-runs/20151222104841-ccl-1.11-r16635-f96-linux-x86/fasl/ql/dists/quicklisp/software/cl-charms-20151218-git/src/low-level/curses-grovel" "/home/testgrid/cl-test-grid/work-dir/agent/test-runs/20151222104841-ccl-1.11-r16635-f96-linux-x86/fasl/ql/dists/quicklisp/software/cl-charms-20151218-git/src/low-level/curses-grovel.c" Output was: /home/testgrid/cl-test-grid/work-dir/agent/test-runs/20151222104841-ccl-1.11-r16635-f96-linux-x86/fasl/ql/dists/quicklisp/software/cl-charms-20151218-git/src/low-level/curses-grovel.c:6:21: fatal error: ncurses.h: No such file or directory compilation terminated.
(LOAD com.informatimago FAIL) ffi-grovel, CFFI-GROVEL:GROVEL-ERROR : External process exited with code 1. Command was: "cc" "-m32" "-I/home/testgrid/cl-test-grid/work-dir/agent/quicklisp/dists/quicklisp/software/cffi_0.16.1/" "-o" "/home/testgrid/cl-test-grid/work-dir/agent/test-runs/20151222104841-ccl-1.11-r16635-f96-linux-x86/fasl/ql/dists/quicklisp/software/cl-charms-20151218-git/src/low-level/curses-grovel" "/home/testgrid/cl-test-grid/work-dir/agent/test-runs/20151222104841-ccl-1.11-r16635-f96-linux-x86/fasl/ql/dists/quicklisp/software/cl-charms-20151218-git/src/low-level/curses-grovel.c" Output was: /home/testgrid/cl-test-grid/work-dir/agent/test-runs/20151222104841-ccl-1.11-r16635-f96-linux-x86/fasl/ql/dists/quicklisp/software/cl-charms-20151218-git/src/low-level/curses-grovel.c:6:21: fatal error: ncurses.h: No such file or directory compilation terminated.
(LOAD com.informatimago.editor.test FAIL) ffi-grovel, CFFI-GROVEL:GROVEL-ERROR : External process exited with code 1. Command was: "cc" "-m32" "-I/home/testgrid/cl-test-grid/work-dir/agent/quicklisp/dists/quicklisp/software/cffi_0.16.1/" "-o" "/home/testgrid/cl-test-grid/work-dir/agent/test-runs/20151107022851-ccl-1.11-r16635-f96-linux-x86/fasl/ql/dists/quicklisp/software/cl-charms-20151031-git/src/low-level/curses-grovel" "/home/testgrid/cl-test-grid/work-dir/agent/test-runs/20151107022851-ccl-1.11-r16635-f96-linux-x86/fasl/ql/dists/quicklisp/software/cl-charms-20151031-git/src/low-level/curses-grovel.c" Output was: /home/testgrid/cl-test-grid/work-dir/agent/test-runs/20151107022851-ccl-1.11-r16635-f96-linux-x86/fasl/ql/dists/quicklisp/software/cl-charms-20151031-git/src/low-level/curses-grovel.c:6:21: fatal error: ncurses.h: No such file or directory compilation terminated.
(LOAD com.informatimago.editor FAIL) ffi-grovel, CFFI-GROVEL:GROVEL-ERROR : External process exited with code 1. Command was: "cc" "-m32" "-I/home/testgrid/cl-test-grid/work-dir/agent/quicklisp/dists/quicklisp/software/cffi_0.16.1/" "-o" "/home/testgrid/cl-test-grid/work-dir/agent/test-runs/20151107022851-ccl-1.11-r16635-f96-linux-x86/fasl/ql/dists/quicklisp/software/cl-charms-20151031-git/src/low-level/curses-grovel" "/home/testgrid/cl-test-grid/work-dir/agent/test-runs/20151107022851-ccl-1.11-r16635-f96-linux-x86/fasl/ql/dists/quicklisp/software/cl-charms-20151031-git/src/low-level/curses-grovel.c" Output was: /home/testgrid/cl-test-grid/work-dir/agent/test-runs/20151107022851-ccl-1.11-r16635-f96-linux-x86/fasl/ql/dists/quicklisp/software/cl-charms-20151031-git/src/low-level/curses-grovel.c:6:21: fatal error: ncurses.h: No such file or directory compilation terminated.
ccl-1.11-rc1-r16536-f101-linux-arm
(LOAD com.informatimago.tools.try-systems FAIL) COM.INFORMATIMAGO.COMMON-LISP.CESARUM.CHARACTER-SETS:CHARACTER-SET-ERROR : There is no character-set named "NIL"
(LOAD com.informatimago.tools.test FAIL) COM.INFORMATIMAGO.COMMON-LISP.CESARUM.CHARACTER-SETS:CHARACTER-SET-ERROR : There is no character-set named "NIL"
(LOAD com.informatimago.tools.summary.test FAIL) COM.INFORMATIMAGO.COMMON-LISP.CESARUM.CHARACTER-SETS:CHARACTER-SET-ERROR : There is no character-set named "NIL"
(LOAD com.informatimago.tools.summary FAIL) COM.INFORMATIMAGO.COMMON-LISP.CESARUM.CHARACTER-SETS:CHARACTER-SET-ERROR : There is no character-set named "NIL"
(LOAD com.informatimago.tools.source.test FAIL) COM.INFORMATIMAGO.COMMON-LISP.CESARUM.CHARACTER-SETS:CHARACTER-SET-ERROR : There is no character-set named "NIL"
(LOAD com.informatimago.tools.source FAIL) COM.INFORMATIMAGO.COMMON-LISP.CESARUM.CHARACTER-SETS:CHARACTER-SET-ERROR : There is no character-set named "NIL"
(LOAD com.informatimago.tools.make-depends.test FAIL) COM.INFORMATIMAGO.COMMON-LISP.CESARUM.CHARACTER-SETS:CHARACTER-SET-ERROR : There is no character-set named "NIL"
(LOAD com.informatimago.tools.make-depends FAIL) COM.INFORMATIMAGO.COMMON-LISP.CESARUM.CHARACTER-SETS:CHARACTER-SET-ERROR : There is no character-set named "NIL"
(LOAD com.informatimago.tools.check-asdf.test FAIL) COM.INFORMATIMAGO.COMMON-LISP.CESARUM.CHARACTER-SETS:CHARACTER-SET-ERROR : There is no character-set named "NIL"
(LOAD com.informatimago.tools.check-asdf FAIL) COM.INFORMATIMAGO.COMMON-LISP.CESARUM.CHARACTER-SETS:CHARACTER-SET-ERROR : There is no character-set named "NIL"
(LOAD com.informatimago.tools FAIL) COM.INFORMATIMAGO.COMMON-LISP.CESARUM.CHARACTER-SETS:CHARACTER-SET-ERROR : There is no character-set named "NIL"
(LOAD com.informatimago.test FAIL) COM.INFORMATIMAGO.COMMON-LISP.CESARUM.CHARACTER-SETS:CHARACTER-SET-ERROR : There is no character-set named "NIL"
(LOAD com.informatimago.editor.test FAIL) ffi-grovel, CFFI-GROVEL:GROVEL-ERROR : External process exited with code 1. Command was: "cc" "-marm" "-I/home/testgrid/cl-test-grid/work-dir/agent/quicklisp/dists/quicklisp/software/cffi_0.16.1/" "-o" "/home/testgrid/cl-test-grid/work-dir/agent/test-runs/20151224090851-ccl-1.11-rc1-r16536-f101-linux-arm/fasl/ql/dists/quicklisp/software/cl-charms-20151218-git/src/low-level/curses-grovel" "/home/testgrid/cl-test-grid/work-dir/agent/test-runs/20151224090851-ccl-1.11-rc1-r16536-f101-linux-arm/fasl/ql/dists/quicklisp/software/cl-charms-20151218-git/src/low-level/curses-grovel.c" Output was: /home/testgrid/cl-test-grid/work-dir/agent/test-runs/20151224090851-ccl-1.11-rc1-r16536-f101-linux-arm/fasl/ql/dists/quicklisp/software/cl-charms-20151218-git/src/low-level/curses-grovel.c:6:21: fatal error: ncurses.h: No such file or directory #include <ncurses.h> ^ compilation terminated.
(LOAD com.informatimago.editor FAIL) ffi-grovel, CFFI-GROVEL:GROVEL-ERROR : External process exited with code 1. Command was: "cc" "-marm" "-I/home/testgrid/cl-test-grid/work-dir/agent/quicklisp/dists/quicklisp/software/cffi_0.16.1/" "-o" "/home/testgrid/cl-test-grid/work-dir/agent/test-runs/20151224090851-ccl-1.11-rc1-r16536-f101-linux-arm/fasl/ql/dists/quicklisp/software/cl-charms-20151218-git/src/low-level/curses-grovel" "/home/testgrid/cl-test-grid/work-dir/agent/test-runs/20151224090851-ccl-1.11-rc1-r16536-f101-linux-arm/fasl/ql/dists/quicklisp/software/cl-charms-20151218-git/src/low-level/curses-grovel.c" Output was: /home/testgrid/cl-test-grid/work-dir/agent/test-runs/20151224090851-ccl-1.11-rc1-r16536-f101-linux-arm/fasl/ql/dists/quicklisp/software/cl-charms-20151218-git/src/low-level/curses-grovel.c:6:21: fatal error: ncurses.h: No such file or directory #include <ncurses.h> ^ compilation terminated.
(LOAD com.informatimago FAIL) COM.INFORMATIMAGO.COMMON-LISP.CESARUM.CHARACTER-SETS:CHARACTER-SET-ERROR : There is no character-set named "NIL"
(LOAD com.informatimago.editor.test FAIL) ffi-grovel, CFFI-GROVEL:GROVEL-ERROR : External process exited with code 1. Command was: "cc" "-marm" "-I/home/testgrid/cl-test-grid/work-dir/agent/quicklisp/dists/quicklisp/software/cffi_0.16.1/" "-o" "/home/testgrid/cl-test-grid/work-dir/agent/test-runs/20151105151907-ccl-1.11-rc1-r16536-f101-linux-arm/fasl/ql/dists/quicklisp/software/cl-charms-20151031-git/src/low-level/curses-grovel" "/home/testgrid/cl-test-grid/work-dir/agent/test-runs/20151105151907-ccl-1.11-rc1-r16536-f101-linux-arm/fasl/ql/dists/quicklisp/software/cl-charms-20151031-git/src/low-level/curses-grovel.c" Output was: /home/testgrid/cl-test-grid/work-dir/agent/test-runs/20151105151907-ccl-1.11-rc1-r16536-f101-linux-arm/fasl/ql/dists/quicklisp/software/cl-charms-20151031-git/src/low-level/curses-grovel.c:6:21: fatal error: ncurses.h: No such file or directory #include <ncurses.h> ^ compilation terminated.
(LOAD com.informatimago.editor FAIL) ffi-grovel, CFFI-GROVEL:GROVEL-ERROR : External process exited with code 1. Command was: "cc" "-marm" "-I/home/testgrid/cl-test-grid/work-dir/agent/quicklisp/dists/quicklisp/software/cffi_0.16.1/" "-o" "/home/testgrid/cl-test-grid/work-dir/agent/test-runs/20151105151907-ccl-1.11-rc1-r16536-f101-linux-arm/fasl/ql/dists/quicklisp/software/cl-charms-20151031-git/src/low-level/curses-grovel" "/home/testgrid/cl-test-grid/work-dir/agent/test-runs/20151105151907-ccl-1.11-rc1-r16536-f101-linux-arm/fasl/ql/dists/quicklisp/software/cl-charms-20151031-git/src/low-level/curses-grovel.c" Output was: /home/testgrid/cl-test-grid/work-dir/agent/test-runs/20151105151907-ccl-1.11-rc1-r16536-f101-linux-arm/fasl/ql/dists/quicklisp/software/cl-charms-20151031-git/src/low-level/curses-grovel.c:6:21: fatal error: ncurses.h: No such file or directory #include <ncurses.h> ^ compilation terminated.
ccl-1.11-rc1-r16536-f96-linux-x86
(LOAD com.informatimago.test FAIL) ffi-grovel, CFFI-GROVEL:GROVEL-ERROR : External process exited with code 1. Command was: "cc" "-m32" "-I/home/testgrid/cl-test-grid/work-dir/agent/quicklisp/dists/quicklisp/software/cffi_0.16.1/" "-o" "/home/testgrid/cl-test-grid/work-dir/agent/test-runs/20151222184035-ccl-1.11-rc1-r16536-f96-linux-x86/fasl/ql/dists/quicklisp/software/cl-charms-20151218-git/src/low-level/curses-grovel" "/home/testgrid/cl-test-grid/work-dir/agent/test-runs/20151222184035-ccl-1.11-rc1-r16536-f96-linux-x86/fasl/ql/dists/quicklisp/software/cl-charms-20151218-git/src/low-level/curses-grovel.c" Output was: /home/testgrid/cl-test-grid/work-dir/agent/test-runs/20151222184035-ccl-1.11-rc1-r16536-f96-linux-x86/fasl/ql/dists/quicklisp/software/cl-charms-20151218-git/src/low-level/curses-grovel.c:6:21: fatal error: ncurses.h: No such file or directory compilation terminated.
(LOAD com.informatimago.editor.test FAIL) ffi-grovel, CFFI-GROVEL:GROVEL-ERROR : External process exited with code 1. Command was: "cc" "-m32" "-I/home/testgrid/cl-test-grid/work-dir/agent/quicklisp/dists/quicklisp/software/cffi_0.16.1/" "-o" "/home/testgrid/cl-test-grid/work-dir/agent/test-runs/20151222184035-ccl-1.11-rc1-r16536-f96-linux-x86/fasl/ql/dists/quicklisp/software/cl-charms-20151218-git/src/low-level/curses-grovel" "/home/testgrid/cl-test-grid/work-dir/agent/test-runs/20151222184035-ccl-1.11-rc1-r16536-f96-linux-x86/fasl/ql/dists/quicklisp/software/cl-charms-20151218-git/src/low-level/curses-grovel.c" Output was: /home/testgrid/cl-test-grid/work-dir/agent/test-runs/20151222184035-ccl-1.11-rc1-r16536-f96-linux-x86/fasl/ql/dists/quicklisp/software/cl-charms-20151218-git/src/low-level/curses-grovel.c:6:21: fatal error: ncurses.h: No such file or directory compilation terminated.
(LOAD com.informatimago.editor FAIL) ffi-grovel, CFFI-GROVEL:GROVEL-ERROR : External process exited with code 1. Command was: "cc" "-m32" "-I/home/testgrid/cl-test-grid/work-dir/agent/quicklisp/dists/quicklisp/software/cffi_0.16.1/" "-o" "/home/testgrid/cl-test-grid/work-dir/agent/test-runs/20151222184035-ccl-1.11-rc1-r16536-f96-linux-x86/fasl/ql/dists/quicklisp/software/cl-charms-20151218-git/src/low-level/curses-grovel" "/home/testgrid/cl-test-grid/work-dir/agent/test-runs/20151222184035-ccl-1.11-rc1-r16536-f96-linux-x86/fasl/ql/dists/quicklisp/software/cl-charms-20151218-git/src/low-level/curses-grovel.c" Output was: /home/testgrid/cl-test-grid/work-dir/agent/test-runs/20151222184035-ccl-1.11-rc1-r16536-f96-linux-x86/fasl/ql/dists/quicklisp/software/cl-charms-20151218-git/src/low-level/curses-grovel.c:6:21: fatal error: ncurses.h: No such file or directory compilation terminated.
(LOAD com.informatimago FAIL) ffi-grovel, CFFI-GROVEL:GROVEL-ERROR : External process exited with code 1. Command was: "cc" "-m32" "-I/home/testgrid/cl-test-grid/work-dir/agent/quicklisp/dists/quicklisp/software/cffi_0.16.1/" "-o" "/home/testgrid/cl-test-grid/work-dir/agent/test-runs/20151222184035-ccl-1.11-rc1-r16536-f96-linux-x86/fasl/ql/dists/quicklisp/software/cl-charms-20151218-git/src/low-level/curses-grovel" "/home/testgrid/cl-test-grid/work-dir/agent/test-runs/20151222184035-ccl-1.11-rc1-r16536-f96-linux-x86/fasl/ql/dists/quicklisp/software/cl-charms-20151218-git/src/low-level/curses-grovel.c" Output was: /home/testgrid/cl-test-grid/work-dir/agent/test-runs/20151222184035-ccl-1.11-rc1-r16536-f96-linux-x86/fasl/ql/dists/quicklisp/software/cl-charms-20151218-git/src/low-level/curses-grovel.c:6:21: fatal error: ncurses.h: No such file or directory compilation terminated.
(LOAD com.informatimago.editor.test FAIL) ffi-grovel, CFFI-GROVEL:GROVEL-ERROR : External process exited with code 1. Command was: "cc" "-m32" "-I/home/testgrid/cl-test-grid/work-dir/agent/quicklisp/dists/quicklisp/software/cffi_0.16.1/" "-o" "/home/testgrid/cl-test-grid/work-dir/agent/test-runs/20151103040957-ccl-1.11-rc1-r16536-f96-linux-x86/fasl/ql/dists/quicklisp/software/cl-charms-20151031-git/src/low-level/curses-grovel" "/home/testgrid/cl-test-grid/work-dir/agent/test-runs/20151103040957-ccl-1.11-rc1-r16536-f96-linux-x86/fasl/ql/dists/quicklisp/software/cl-charms-20151031-git/src/low-level/curses-grovel.c" Output was: /home/testgrid/cl-test-grid/work-dir/agent/test-runs/20151103040957-ccl-1.11-rc1-r16536-f96-linux-x86/fasl/ql/dists/quicklisp/software/cl-charms-20151031-git/src/low-level/curses-grovel.c:6:21: fatal error: ncurses.h: No such file or directory compilation terminated.
(LOAD com.informatimago.editor FAIL) ffi-grovel, CFFI-GROVEL:GROVEL-ERROR : External process exited with code 1. Command was: "cc" "-m32" "-I/home/testgrid/cl-test-grid/work-dir/agent/quicklisp/dists/quicklisp/software/cffi_0.16.1/" "-o" "/home/testgrid/cl-test-grid/work-dir/agent/test-runs/20151103040957-ccl-1.11-rc1-r16536-f96-linux-x86/fasl/ql/dists/quicklisp/software/cl-charms-20151031-git/src/low-level/curses-grovel" "/home/testgrid/cl-test-grid/work-dir/agent/test-runs/20151103040957-ccl-1.11-rc1-r16536-f96-linux-x86/fasl/ql/dists/quicklisp/software/cl-charms-20151031-git/src/low-level/curses-grovel.c" Output was: /home/testgrid/cl-test-grid/work-dir/agent/test-runs/20151103040957-ccl-1.11-rc1-r16536-f96-linux-x86/fasl/ql/dists/quicklisp/software/cl-charms-20151031-git/src/low-level/curses-grovel.c:6:21: fatal error: ncurses.h: No such file or directory compilation terminated.
ccl-1.11-rc1-r16536-f96-macosx-x86
(LOAD com.ogamita.swig.test FAIL) ASDF/FIND-COMPONENT:MISSING-DEPENDENCY : Component "packages" not found, required by #<CL-SOURCE-FILE "com.ogamita.swig" "coregraphics">
(LOAD com.ogamita.swig FAIL) ASDF/FIND-COMPONENT:MISSING-DEPENDENCY : Component "packages" not found, required by #<CL-SOURCE-FILE "com.ogamita.swig" "coregraphics">
(LOAD com.informatimago.objcl.test FAIL) COMMON-LISP:FILE-ERROR : Can't create directory "/usr/local/src/ccl-1.11/temp bundle32.app/".
(LOAD com.informatimago.objcl FAIL) COMMON-LISP:FILE-ERROR : Can't create directory "/usr/local/src/ccl-1.11/temp bundle32.app/".
ccl-1.11-rc1-r16540-f96-macosx-x64
(LOAD com.ogamita.swig.test FAIL) ASDF/FIND-COMPONENT:MISSING-DEPENDENCY : Component "packages" not found, required by #<CL-SOURCE-FILE "com.ogamita.swig" "coregraphics">
(LOAD com.ogamita.swig FAIL) ASDF/FIND-COMPONENT:MISSING-DEPENDENCY : Component "packages" not found, required by #<CL-SOURCE-FILE "com.ogamita.swig" "coregraphics">
(LOAD com.informatimago.test FAIL) COMMON-LISP:FILE-ERROR : Can't create directory "/usr/local/src/ccl-1.11/temp bundle64.app/".
(LOAD com.informatimago.objcl.test FAIL) COMMON-LISP:FILE-ERROR : Can't create directory "/usr/local/src/ccl-1.11/temp bundle64.app/".
(LOAD com.informatimago.objcl FAIL) COMMON-LISP:FILE-ERROR : Can't create directory "/usr/local/src/ccl-1.11/temp bundle64.app/".
(LOAD com.informatimago.lispdoc.test FAIL) COMMON-LISP:FILE-ERROR : Can't create directory "/usr/local/src/ccl-1.11/temp bundle64.app/".
(LOAD com.informatimago.lispdoc FAIL) COMMON-LISP:FILE-ERROR : Can't create directory "/usr/local/src/ccl-1.11/temp bundle64.app/".
(LOAD com.informatimago FAIL) COMMON-LISP:FILE-ERROR : Can't create directory "/usr/local/src/ccl-1.11/temp bundle64.app/".
(LOAD com.ogamita.swig.test FAIL) ASDF/FIND-COMPONENT:MISSING-DEPENDENCY : Component "packages" not found, required by #<CL-SOURCE-FILE "com.ogamita.swig" "coregraphics">
(LOAD com.ogamita.swig FAIL) ASDF/FIND-COMPONENT:MISSING-DEPENDENCY : Component "packages" not found, required by #<CL-SOURCE-FILE "com.ogamita.swig" "coregraphics">
(LOAD com.informatimago.test FAIL) COMMON-LISP:FILE-ERROR : Can't create directory "/usr/local/src/ccl-1.11/temp bundle64.app/".
(LOAD com.informatimago.objcl.test FAIL) COMMON-LISP:FILE-ERROR : Can't create directory "/usr/local/src/ccl-1.11/temp bundle64.app/".
(LOAD com.informatimago.objcl FAIL) COMMON-LISP:FILE-ERROR : Can't create directory "/usr/local/src/ccl-1.11/temp bundle64.app/".
(LOAD com.informatimago.lispdoc.test FAIL) COMMON-LISP:FILE-ERROR : Can't create directory "/usr/local/src/ccl-1.11/temp bundle64.app/".
(LOAD com.informatimago.lispdoc FAIL) COMMON-LISP:FILE-ERROR : Can't create directory "/usr/local/src/ccl-1.11/temp bundle64.app/".
(LOAD com.informatimago FAIL) COMMON-LISP:FILE-ERROR : Can't create directory "/usr/local/src/ccl-1.11/temp bundle64.app/".
(LOAD com.ogamita.swig.test FAIL) ASDF/FIND-COMPONENT:MISSING-DEPENDENCY : Component "packages" not found, required by #<CL-SOURCE-FILE "com.ogamita.swig" "coregraphics">
(LOAD com.ogamita.swig FAIL) ASDF/FIND-COMPONENT:MISSING-DEPENDENCY : Component "packages" not found, required by #<CL-SOURCE-FILE "com.ogamita.swig" "coregraphics">
(LOAD com.informatimago.objcl.test FAIL) COMMON-LISP:FILE-ERROR : Can't create directory "/usr/local/src/ccl-1.11/temp bundle64.app/".
(LOAD com.informatimago.objcl FAIL) COMMON-LISP:FILE-ERROR : Can't create directory "/usr/local/src/ccl-1.11/temp bundle64.app/".
ccl-1.11-rc1-r16542m-f101-linux-arm
(LOAD com.informatimago.tools.try-systems FAIL) COM.INFORMATIMAGO.COMMON-LISP.CESARUM.CHARACTER-SETS:CHARACTER-SET-ERROR : There is no character-set named "NIL"
(LOAD com.informatimago.tools.test FAIL) COM.INFORMATIMAGO.COMMON-LISP.CESARUM.CHARACTER-SETS:CHARACTER-SET-ERROR : There is no character-set named "NIL"
(LOAD com.informatimago.tools.summary.test FAIL) COM.INFORMATIMAGO.COMMON-LISP.CESARUM.CHARACTER-SETS:CHARACTER-SET-ERROR : There is no character-set named "NIL"
(LOAD com.informatimago.tools.summary FAIL) COM.INFORMATIMAGO.COMMON-LISP.CESARUM.CHARACTER-SETS:CHARACTER-SET-ERROR : There is no character-set named "NIL"
(LOAD com.informatimago.tools.source.test FAIL) COM.INFORMATIMAGO.COMMON-LISP.CESARUM.CHARACTER-SETS:CHARACTER-SET-ERROR : There is no character-set named "NIL"
(LOAD com.informatimago.tools.source FAIL) COM.INFORMATIMAGO.COMMON-LISP.CESARUM.CHARACTER-SETS:CHARACTER-SET-ERROR : There is no character-set named "NIL"
(LOAD com.informatimago.tools.make-depends.test FAIL) COM.INFORMATIMAGO.COMMON-LISP.CESARUM.CHARACTER-SETS:CHARACTER-SET-ERROR : There is no character-set named "NIL"
(LOAD com.informatimago.tools.make-depends FAIL) COM.INFORMATIMAGO.COMMON-LISP.CESARUM.CHARACTER-SETS:CHARACTER-SET-ERROR : There is no character-set named "NIL"
(LOAD com.informatimago.tools.check-asdf.test FAIL) COM.INFORMATIMAGO.COMMON-LISP.CESARUM.CHARACTER-SETS:CHARACTER-SET-ERROR : There is no character-set named "NIL"
(LOAD com.informatimago.tools.check-asdf FAIL) COM.INFORMATIMAGO.COMMON-LISP.CESARUM.CHARACTER-SETS:CHARACTER-SET-ERROR : There is no character-set named "NIL"
(LOAD com.informatimago.tools FAIL) COM.INFORMATIMAGO.COMMON-LISP.CESARUM.CHARACTER-SETS:CHARACTER-SET-ERROR : There is no character-set named "NIL"
(LOAD com.informatimago.test FAIL) COM.INFORMATIMAGO.COMMON-LISP.CESARUM.CHARACTER-SETS:CHARACTER-SET-ERROR : There is no character-set named "NIL"
(LOAD com.informatimago.editor.test FAIL) ffi-grovel, CFFI-GROVEL:GROVEL-ERROR : External process exited with code 1. Command was: "cc" "-marm" "-I/home/testgrid/cl-test-grid/work-dir/agent/quicklisp/dists/quicklisp/software/cffi_0.16.1/" "-o" "/home/testgrid/cl-test-grid/work-dir/agent/test-runs/20151229150230-ccl-1.11-rc1-r16542m-f101-linux-arm/fasl/ql/dists/quicklisp/software/cl-charms-20151218-git/src/low-level/curses-grovel" "/home/testgrid/cl-test-grid/work-dir/agent/test-runs/20151229150230-ccl-1.11-rc1-r16542m-f101-linux-arm/fasl/ql/dists/quicklisp/software/cl-charms-20151218-git/src/low-level/curses-grovel.c" Output was: /home/testgrid/cl-test-grid/work-dir/agent/test-runs/20151229150230-ccl-1.11-rc1-r16542m-f101-linux-arm/fasl/ql/dists/quicklisp/software/cl-charms-20151218-git/src/low-level/curses-grovel.c:6:21: fatal error: ncurses.h: No such file or directory compilation terminated.
(LOAD com.informatimago.editor FAIL) ffi-grovel, CFFI-GROVEL:GROVEL-ERROR : External process exited with code 1. Command was: "cc" "-marm" "-I/home/testgrid/cl-test-grid/work-dir/agent/quicklisp/dists/quicklisp/software/cffi_0.16.1/" "-o" "/home/testgrid/cl-test-grid/work-dir/agent/test-runs/20151229150230-ccl-1.11-rc1-r16542m-f101-linux-arm/fasl/ql/dists/quicklisp/software/cl-charms-20151218-git/src/low-level/curses-grovel" "/home/testgrid/cl-test-grid/work-dir/agent/test-runs/20151229150230-ccl-1.11-rc1-r16542m-f101-linux-arm/fasl/ql/dists/quicklisp/software/cl-charms-20151218-git/src/low-level/curses-grovel.c" Output was: /home/testgrid/cl-test-grid/work-dir/agent/test-runs/20151229150230-ccl-1.11-rc1-r16542m-f101-linux-arm/fasl/ql/dists/quicklisp/software/cl-charms-20151218-git/src/low-level/curses-grovel.c:6:21: fatal error: ncurses.h: No such file or directory compilation terminated.
(LOAD com.informatimago FAIL) COM.INFORMATIMAGO.COMMON-LISP.CESARUM.CHARACTER-SETS:CHARACTER-SET-ERROR : There is no character-set named "NIL"
(LOAD com.informatimago.editor.test FAIL) ffi-grovel, CFFI-GROVEL:GROVEL-ERROR : External process exited with code 1. Command was: "cc" "-marm" "-I/home/testgrid/cl-test-grid/work-dir/agent/quicklisp/dists/quicklisp/software/cffi_0.16.1/" "-o" "/home/testgrid/cl-test-grid/work-dir/agent/test-runs/20151102175618-ccl-1.11-rc1-r16542m-f101-linux-arm/fasl/ql/dists/quicklisp/software/cl-charms-20151031-git/src/low-level/curses-grovel" "/home/testgrid/cl-test-grid/work-dir/agent/test-runs/20151102175618-ccl-1.11-rc1-r16542m-f101-linux-arm/fasl/ql/dists/quicklisp/software/cl-charms-20151031-git/src/low-level/curses-grovel.c" Output was: /home/testgrid/cl-test-grid/work-dir/agent/test-runs/20151102175618-ccl-1.11-rc1-r16542m-f101-linux-arm/fasl/ql/dists/quicklisp/software/cl-charms-20151031-git/src/low-level/curses-grovel.c:6:21: fatal error: ncurses.h: No such file or directory compilation terminated.
(LOAD com.informatimago.editor FAIL) ffi-grovel, CFFI-GROVEL:GROVEL-ERROR : External process exited with code 1. Command was: "cc" "-marm" "-I/home/testgrid/cl-test-grid/work-dir/agent/quicklisp/dists/quicklisp/software/cffi_0.16.1/" "-o" "/home/testgrid/cl-test-grid/work-dir/agent/test-runs/20151102175618-ccl-1.11-rc1-r16542m-f101-linux-arm/fasl/ql/dists/quicklisp/software/cl-charms-20151031-git/src/low-level/curses-grovel" "/home/testgrid/cl-test-grid/work-dir/agent/test-runs/20151102175618-ccl-1.11-rc1-r16542m-f101-linux-arm/fasl/ql/dists/quicklisp/software/cl-charms-20151031-git/src/low-level/curses-grovel.c" Output was: /home/testgrid/cl-test-grid/work-dir/agent/test-runs/20151102175618-ccl-1.11-rc1-r16542m-f101-linux-arm/fasl/ql/dists/quicklisp/software/cl-charms-20151031-git/src/low-level/curses-grovel.c:6:21: fatal error: ncurses.h: No such file or directory compilation terminated.
ccl-1.8-r15286m-f95-linux-x86
(LOAD com.informatimago.tools.try-systems FAIL) ASDF:LOAD-SYSTEM-DEFINITION-ERROR : Error while trying to load definition for system bordeaux-threads from pathname /home/testgrid/cl-test-grid/work-dir/agent/quicklisp/dists/quicklisp/software/bordeaux-threads-v0.8.4-git/bordeaux-threads.asd: There is no package named "UIOP" .
(LOAD com.informatimago.tools.thread FAIL) ASDF:LOAD-SYSTEM-DEFINITION-ERROR : Error while trying to load definition for system bordeaux-threads from pathname /home/testgrid/cl-test-grid/work-dir/agent/quicklisp/dists/quicklisp/software/bordeaux-threads-v0.8.4-git/bordeaux-threads.asd: There is no package named "UIOP" .
(LOAD com.informatimago.tools.test FAIL) ASDF:LOAD-SYSTEM-DEFINITION-ERROR : Error while trying to load definition for system bordeaux-threads from pathname /home/testgrid/cl-test-grid/work-dir/agent/quicklisp/dists/quicklisp/software/bordeaux-threads-v0.8.4-git/bordeaux-threads.asd: There is no package named "UIOP" .
(LOAD com.informatimago.tools.summary.test FAIL) ASDF:LOAD-SYSTEM-DEFINITION-ERROR : Error while trying to load definition for system bordeaux-threads from pathname /home/testgrid/cl-test-grid/work-dir/agent/quicklisp/dists/quicklisp/software/bordeaux-threads-v0.8.4-git/bordeaux-threads.asd: There is no package named "UIOP" .
(LOAD com.informatimago.tools.summary FAIL) ASDF:LOAD-SYSTEM-DEFINITION-ERROR : Error while trying to load definition for system bordeaux-threads from pathname /home/testgrid/cl-test-grid/work-dir/agent/quicklisp/dists/quicklisp/software/bordeaux-threads-v0.8.4-git/bordeaux-threads.asd: There is no package named "UIOP" .
(LOAD com.informatimago.tools.source.test FAIL) ASDF:LOAD-SYSTEM-DEFINITION-ERROR : Error while trying to load definition for system bordeaux-threads from pathname /home/testgrid/cl-test-grid/work-dir/agent/quicklisp/dists/quicklisp/software/bordeaux-threads-v0.8.4-git/bordeaux-threads.asd: There is no package named "UIOP" .
(LOAD com.informatimago.tools.source FAIL) ASDF:LOAD-SYSTEM-DEFINITION-ERROR : Error while trying to load definition for system bordeaux-threads from pathname /home/testgrid/cl-test-grid/work-dir/agent/quicklisp/dists/quicklisp/software/bordeaux-threads-v0.8.4-git/bordeaux-threads.asd: There is no package named "UIOP" .
(LOAD com.informatimago.tools.make-depends.test FAIL) ASDF:LOAD-SYSTEM-DEFINITION-ERROR : Error while trying to load definition for system bordeaux-threads from pathname /home/testgrid/cl-test-grid/work-dir/agent/quicklisp/dists/quicklisp/software/bordeaux-threads-v0.8.4-git/bordeaux-threads.asd: There is no package named "UIOP" .
(LOAD com.informatimago.tools.make-depends FAIL) ASDF:LOAD-SYSTEM-DEFINITION-ERROR : Error while trying to load definition for system bordeaux-threads from pathname /home/testgrid/cl-test-grid/work-dir/agent/quicklisp/dists/quicklisp/software/bordeaux-threads-v0.8.4-git/bordeaux-threads.asd: There is no package named "UIOP" .
(LOAD com.informatimago.tools.check-asdf.test FAIL) ASDF:LOAD-SYSTEM-DEFINITION-ERROR : Error while trying to load definition for system bordeaux-threads from pathname /home/testgrid/cl-test-grid/work-dir/agent/quicklisp/dists/quicklisp/software/bordeaux-threads-v0.8.4-git/bordeaux-threads.asd: There is no package named "UIOP" .
(LOAD com.informatimago.tools.check-asdf FAIL) ASDF:LOAD-SYSTEM-DEFINITION-ERROR : Error while trying to load definition for system bordeaux-threads from pathname /home/testgrid/cl-test-grid/work-dir/agent/quicklisp/dists/quicklisp/software/bordeaux-threads-v0.8.4-git/bordeaux-threads.asd: There is no package named "UIOP" .
(LOAD com.informatimago.tools FAIL) ASDF:LOAD-SYSTEM-DEFINITION-ERROR : Error while trying to load definition for system bordeaux-threads from pathname /home/testgrid/cl-test-grid/work-dir/agent/quicklisp/dists/quicklisp/software/bordeaux-threads-v0.8.4-git/bordeaux-threads.asd: There is no package named "UIOP" .
(LOAD com.informatimago.test FAIL) ffi-grovel, CFFI-GROVEL:GROVEL-ERROR : External process exited with code 1. Command was: "cc" "-m32" "-I/home/testgrid/cl-test-grid/work-dir/agent/quicklisp/dists/quicklisp/software/cffi_0.16.1/" "-o" "/home/testgrid/cl-test-grid/work-dir/agent/test-runs/20151223053056-ccl-1.8-r15286m-f95-linux-x86/fasl/ql/dists/quicklisp/software/cl-charms-20151218-git/src/low-level/curses-grovel" "/home/testgrid/cl-test-grid/work-dir/agent/test-runs/20151223053056-ccl-1.8-r15286m-f95-linux-x86/fasl/ql/dists/quicklisp/software/cl-charms-20151218-git/src/low-level/curses-grovel.c" Output was: /home/testgrid/cl-test-grid/work-dir/agent/test-runs/20151223053056-ccl-1.8-r15286m-f95-linux-x86/fasl/ql/dists/quicklisp/software/cl-charms-20151218-git/src/low-level/curses-grovel.c:6:21: fatal error: ncurses.h: No such file or directory compilation terminated.
(LOAD com.informatimago.small-cl-pgms.botihn FAIL) ASDF:LOAD-SYSTEM-DEFINITION-ERROR : Error while trying to load definition for system drakma from pathname /home/testgrid/cl-test-grid/work-dir/agent/quicklisp/dists/quicklisp/software/drakma-2.0.2/drakma.asd: While compiling (PERFORM (T T)) : In the form ((LOAD-SYSTEM TEST-OP) (:DRAKMA-TEST (EQL #<SYSTEM "drakma">))), (LOAD-SYSTEM TEST-OP) is not a symbol or lambda expression.
(LOAD com.informatimago.lispdoc.test FAIL) ASDF:LOAD-SYSTEM-DEFINITION-ERROR : Error while trying to load definition for system bordeaux-threads from pathname /home/testgrid/cl-test-grid/work-dir/agent/quicklisp/dists/quicklisp/software/bordeaux-threads-v0.8.4-git/bordeaux-threads.asd: There is no package named "UIOP" .
(LOAD com.informatimago.lispdoc FAIL) ASDF:LOAD-SYSTEM-DEFINITION-ERROR : Error while trying to load definition for system bordeaux-threads from pathname /home/testgrid/cl-test-grid/work-dir/agent/quicklisp/dists/quicklisp/software/bordeaux-threads-v0.8.4-git/bordeaux-threads.asd: There is no package named "UIOP" .
(LOAD com.informatimago.editor.test FAIL) ffi-grovel, CFFI-GROVEL:GROVEL-ERROR : External process exited with code 1. Command was: "cc" "-m32" "-I/home/testgrid/cl-test-grid/work-dir/agent/quicklisp/dists/quicklisp/software/cffi_0.16.1/" "-o" "/home/testgrid/cl-test-grid/work-dir/agent/test-runs/20151223053056-ccl-1.8-r15286m-f95-linux-x86/fasl/ql/dists/quicklisp/software/cl-charms-20151218-git/src/low-level/curses-grovel" "/home/testgrid/cl-test-grid/work-dir/agent/test-runs/20151223053056-ccl-1.8-r15286m-f95-linux-x86/fasl/ql/dists/quicklisp/software/cl-charms-20151218-git/src/low-level/curses-grovel.c" Output was: /home/testgrid/cl-test-grid/work-dir/agent/test-runs/20151223053056-ccl-1.8-r15286m-f95-linux-x86/fasl/ql/dists/quicklisp/software/cl-charms-20151218-git/src/low-level/curses-grovel.c:6:21: fatal error: ncurses.h: No such file or directory compilation terminated.
(LOAD com.informatimago.editor FAIL) ffi-grovel, CFFI-GROVEL:GROVEL-ERROR : External process exited with code 1. Command was: "cc" "-m32" "-I/home/testgrid/cl-test-grid/work-dir/agent/quicklisp/dists/quicklisp/software/cffi_0.16.1/" "-o" "/home/testgrid/cl-test-grid/work-dir/agent/test-runs/20151223053056-ccl-1.8-r15286m-f95-linux-x86/fasl/ql/dists/quicklisp/software/cl-charms-20151218-git/src/low-level/curses-grovel" "/home/testgrid/cl-test-grid/work-dir/agent/test-runs/20151223053056-ccl-1.8-r15286m-f95-linux-x86/fasl/ql/dists/quicklisp/software/cl-charms-20151218-git/src/low-level/curses-grovel.c" Output was: /home/testgrid/cl-test-grid/work-dir/agent/test-runs/20151223053056-ccl-1.8-r15286m-f95-linux-x86/fasl/ql/dists/quicklisp/software/cl-charms-20151218-git/src/low-level/curses-grovel.c:6:21: fatal error: ncurses.h: No such file or directory compilation terminated.
(LOAD com.informatimago.clext.test FAIL) ASDF:LOAD-SYSTEM-DEFINITION-ERROR : Error while trying to load definition for system bordeaux-threads from pathname /home/testgrid/cl-test-grid/work-dir/agent/quicklisp/dists/quicklisp/software/bordeaux-threads-v0.8.4-git/bordeaux-threads.asd: There is no package named "UIOP" .
(LOAD com.informatimago.clext.pipe.test FAIL) ASDF:LOAD-SYSTEM-DEFINITION-ERROR : Error while trying to load definition for system bordeaux-threads from pathname /home/testgrid/cl-test-grid/work-dir/agent/quicklisp/dists/quicklisp/software/bordeaux-threads-v0.8.4-git/bordeaux-threads.asd: There is no package named "UIOP" .
(LOAD com.informatimago.clext.pipe FAIL) ASDF:LOAD-SYSTEM-DEFINITION-ERROR : Error while trying to load definition for system bordeaux-threads from pathname /home/testgrid/cl-test-grid/work-dir/agent/quicklisp/dists/quicklisp/software/bordeaux-threads-v0.8.4-git/bordeaux-threads.asd: There is no package named "UIOP" .
(LOAD com.informatimago.clext FAIL) ASDF:LOAD-SYSTEM-DEFINITION-ERROR : Error while trying to load definition for system bordeaux-threads from pathname /home/testgrid/cl-test-grid/work-dir/agent/quicklisp/dists/quicklisp/software/bordeaux-threads-v0.8.4-git/bordeaux-threads.asd: There is no package named "UIOP" .
(LOAD com.informatimago FAIL) ffi-grovel, CFFI-GROVEL:GROVEL-ERROR : External process exited with code 1. Command was: "cc" "-m32" "-I/home/testgrid/cl-test-grid/work-dir/agent/quicklisp/dists/quicklisp/software/cffi_0.16.1/" "-o" "/home/testgrid/cl-test-grid/work-dir/agent/test-runs/20151223053056-ccl-1.8-r15286m-f95-linux-x86/fasl/ql/dists/quicklisp/software/cl-charms-20151218-git/src/low-level/curses-grovel" "/home/testgrid/cl-test-grid/work-dir/agent/test-runs/20151223053056-ccl-1.8-r15286m-f95-linux-x86/fasl/ql/dists/quicklisp/software/cl-charms-20151218-git/src/low-level/curses-grovel.c" Output was: /home/testgrid/cl-test-grid/work-dir/agent/test-runs/20151223053056-ccl-1.8-r15286m-f95-linux-x86/fasl/ql/dists/quicklisp/software/cl-charms-20151218-git/src/low-level/curses-grovel.c:6:21: fatal error: ncurses.h: No such file or directory compilation terminated.
(LOAD com.informatimago.small-cl-pgms.botihn FAIL) ASDF:LOAD-SYSTEM-DEFINITION-ERROR : Error while trying to load definition for system drakma from pathname /home/testgrid/cl-test-grid/work-dir/agent/quicklisp/dists/quicklisp/software/drakma-2.0.2/drakma.asd: While compiling (PERFORM (T T)) : In the form ((LOAD-SYSTEM TEST-OP) (:DRAKMA-TEST (EQL #<SYSTEM "drakma">))), (LOAD-SYSTEM TEST-OP) is not a symbol or lambda expression.
(LOAD com.informatimago.editor.test FAIL) ffi-grovel, CFFI-GROVEL:GROVEL-ERROR : External process exited with code 1. Command was: "cc" "-m32" "-I/home/testgrid/cl-test-grid/work-dir/agent/quicklisp/dists/quicklisp/software/cffi_0.16.1/" "-o" "/home/testgrid/cl-test-grid/work-dir/agent/test-runs/20151103152514-ccl-1.8-r15286m-f95-linux-x86/fasl/ql/dists/quicklisp/software/cl-charms-20151031-git/src/low-level/curses-grovel" "/home/testgrid/cl-test-grid/work-dir/agent/test-runs/20151103152514-ccl-1.8-r15286m-f95-linux-x86/fasl/ql/dists/quicklisp/software/cl-charms-20151031-git/src/low-level/curses-grovel.c" Output was: /home/testgrid/cl-test-grid/work-dir/agent/test-runs/20151103152514-ccl-1.8-r15286m-f95-linux-x86/fasl/ql/dists/quicklisp/software/cl-charms-20151031-git/src/low-level/curses-grovel.c:6:21: fatal error: ncurses.h: No such file or directory compilation terminated.
(LOAD com.informatimago.editor FAIL) ffi-grovel, CFFI-GROVEL:GROVEL-ERROR : External process exited with code 1. Command was: "cc" "-m32" "-I/home/testgrid/cl-test-grid/work-dir/agent/quicklisp/dists/quicklisp/software/cffi_0.16.1/" "-o" "/home/testgrid/cl-test-grid/work-dir/agent/test-runs/20151103152514-ccl-1.8-r15286m-f95-linux-x86/fasl/ql/dists/quicklisp/software/cl-charms-20151031-git/src/low-level/curses-grovel" "/home/testgrid/cl-test-grid/work-dir/agent/test-runs/20151103152514-ccl-1.8-r15286m-f95-linux-x86/fasl/ql/dists/quicklisp/software/cl-charms-20151031-git/src/low-level/curses-grovel.c" Output was: /home/testgrid/cl-test-grid/work-dir/agent/test-runs/20151103152514-ccl-1.8-r15286m-f95-linux-x86/fasl/ql/dists/quicklisp/software/cl-charms-20151031-git/src/low-level/curses-grovel.c:6:21: fatal error: ncurses.h: No such file or directory compilation terminated.
ccl-1.8-r15286m-f97-linux-arm
(LOAD com.informatimago.tools.try-systems FAIL) ASDF:LOAD-SYSTEM-DEFINITION-ERROR : Error while trying to load definition for system bordeaux-threads from pathname /home/testgrid/cl-test-grid/work-dir/agent/quicklisp/dists/quicklisp/software/bordeaux-threads-v0.8.4-git/bordeaux-threads.asd: There is no package named "UIOP" .
(LOAD com.informatimago.tools.thread FAIL) ASDF:LOAD-SYSTEM-DEFINITION-ERROR : Error while trying to load definition for system bordeaux-threads from pathname /home/testgrid/cl-test-grid/work-dir/agent/quicklisp/dists/quicklisp/software/bordeaux-threads-v0.8.4-git/bordeaux-threads.asd: There is no package named "UIOP" .
(LOAD com.informatimago.tools.test FAIL) ASDF:LOAD-SYSTEM-DEFINITION-ERROR : Error while trying to load definition for system bordeaux-threads from pathname /home/testgrid/cl-test-grid/work-dir/agent/quicklisp/dists/quicklisp/software/bordeaux-threads-v0.8.4-git/bordeaux-threads.asd: There is no package named "UIOP" .
(LOAD com.informatimago.tools.summary.test FAIL) ASDF:LOAD-SYSTEM-DEFINITION-ERROR : Error while trying to load definition for system bordeaux-threads from pathname /home/testgrid/cl-test-grid/work-dir/agent/quicklisp/dists/quicklisp/software/bordeaux-threads-v0.8.4-git/bordeaux-threads.asd: There is no package named "UIOP" .
(LOAD com.informatimago.tools.summary FAIL) ASDF:LOAD-SYSTEM-DEFINITION-ERROR : Error while trying to load definition for system bordeaux-threads from pathname /home/testgrid/cl-test-grid/work-dir/agent/quicklisp/dists/quicklisp/software/bordeaux-threads-v0.8.4-git/bordeaux-threads.asd: There is no package named "UIOP" .
(LOAD com.informatimago.tools.source.test FAIL) ASDF:LOAD-SYSTEM-DEFINITION-ERROR : Error while trying to load definition for system bordeaux-threads from pathname /home/testgrid/cl-test-grid/work-dir/agent/quicklisp/dists/quicklisp/software/bordeaux-threads-v0.8.4-git/bordeaux-threads.asd: There is no package named "UIOP" .
(LOAD com.informatimago.tools.source FAIL) ASDF:LOAD-SYSTEM-DEFINITION-ERROR : Error while trying to load definition for system bordeaux-threads from pathname /home/testgrid/cl-test-grid/work-dir/agent/quicklisp/dists/quicklisp/software/bordeaux-threads-v0.8.4-git/bordeaux-threads.asd: There is no package named "UIOP" .
(LOAD com.informatimago.tools.make-depends.test FAIL) ASDF:LOAD-SYSTEM-DEFINITION-ERROR : Error while trying to load definition for system bordeaux-threads from pathname /home/testgrid/cl-test-grid/work-dir/agent/quicklisp/dists/quicklisp/software/bordeaux-threads-v0.8.4-git/bordeaux-threads.asd: There is no package named "UIOP" .
(LOAD com.informatimago.tools.make-depends FAIL) ASDF:LOAD-SYSTEM-DEFINITION-ERROR : Error while trying to load definition for system bordeaux-threads from pathname /home/testgrid/cl-test-grid/work-dir/agent/quicklisp/dists/quicklisp/software/bordeaux-threads-v0.8.4-git/bordeaux-threads.asd: There is no package named "UIOP" .
(LOAD com.informatimago.tools.check-asdf.test FAIL) ASDF:LOAD-SYSTEM-DEFINITION-ERROR : Error while trying to load definition for system bordeaux-threads from pathname /home/testgrid/cl-test-grid/work-dir/agent/quicklisp/dists/quicklisp/software/bordeaux-threads-v0.8.4-git/bordeaux-threads.asd: There is no package named "UIOP" .
(LOAD com.informatimago.tools.check-asdf FAIL) ASDF:LOAD-SYSTEM-DEFINITION-ERROR : Error while trying to load definition for system bordeaux-threads from pathname /home/testgrid/cl-test-grid/work-dir/agent/quicklisp/dists/quicklisp/software/bordeaux-threads-v0.8.4-git/bordeaux-threads.asd: There is no package named "UIOP" .
(LOAD com.informatimago.tools FAIL) ASDF:LOAD-SYSTEM-DEFINITION-ERROR : Error while trying to load definition for system bordeaux-threads from pathname /home/testgrid/cl-test-grid/work-dir/agent/quicklisp/dists/quicklisp/software/bordeaux-threads-v0.8.4-git/bordeaux-threads.asd: There is no package named "UIOP" .
(LOAD com.informatimago.test FAIL) ffi-grovel, CFFI-GROVEL:GROVEL-ERROR : External process exited with code 1. Command was: "cc" "-marm" "-I/home/testgrid/cl-test-grid/work-dir/agent/quicklisp/dists/quicklisp/software/cffi_0.16.1/" "-o" "/home/testgrid/cl-test-grid/work-dir/agent/test-runs/20151224014118-ccl-1.8-r15286m-f97-linux-arm/fasl/ql/dists/quicklisp/software/cl-charms-20151218-git/src/low-level/curses-grovel" "/home/testgrid/cl-test-grid/work-dir/agent/test-runs/20151224014118-ccl-1.8-r15286m-f97-linux-arm/fasl/ql/dists/quicklisp/software/cl-charms-20151218-git/src/low-level/curses-grovel.c" Output was: /home/testgrid/cl-test-grid/work-dir/agent/test-runs/20151224014118-ccl-1.8-r15286m-f97-linux-arm/fasl/ql/dists/quicklisp/software/cl-charms-20151218-git/src/low-level/curses-grovel.c:6:21: fatal error: ncurses.h: No such file or directory #include <ncurses.h> ^ compilation terminated.
(LOAD com.informatimago.small-cl-pgms.botihn FAIL) ASDF:LOAD-SYSTEM-DEFINITION-ERROR : Error while trying to load definition for system drakma from pathname /home/testgrid/cl-test-grid/work-dir/agent/quicklisp/dists/quicklisp/software/drakma-2.0.2/drakma.asd: While compiling (PERFORM (T T)) : In the form ((LOAD-SYSTEM TEST-OP) (:DRAKMA-TEST (EQL #<SYSTEM "drakma">))), (LOAD-SYSTEM TEST-OP) is not a symbol or lambda expression.
(LOAD com.informatimago.lispdoc.test FAIL) ASDF:LOAD-SYSTEM-DEFINITION-ERROR : Error while trying to load definition for system bordeaux-threads from pathname /home/testgrid/cl-test-grid/work-dir/agent/quicklisp/dists/quicklisp/software/bordeaux-threads-v0.8.4-git/bordeaux-threads.asd: There is no package named "UIOP" .
(LOAD com.informatimago.lispdoc FAIL) ASDF:LOAD-SYSTEM-DEFINITION-ERROR : Error while trying to load definition for system bordeaux-threads from pathname /home/testgrid/cl-test-grid/work-dir/agent/quicklisp/dists/quicklisp/software/bordeaux-threads-v0.8.4-git/bordeaux-threads.asd: There is no package named "UIOP" .
(LOAD com.informatimago.editor.test FAIL) ffi-grovel, CFFI-GROVEL:GROVEL-ERROR : External process exited with code 1. Command was: "cc" "-marm" "-I/home/testgrid/cl-test-grid/work-dir/agent/quicklisp/dists/quicklisp/software/cffi_0.16.1/" "-o" "/home/testgrid/cl-test-grid/work-dir/agent/test-runs/20151224014118-ccl-1.8-r15286m-f97-linux-arm/fasl/ql/dists/quicklisp/software/cl-charms-20151218-git/src/low-level/curses-grovel" "/home/testgrid/cl-test-grid/work-dir/agent/test-runs/20151224014118-ccl-1.8-r15286m-f97-linux-arm/fasl/ql/dists/quicklisp/software/cl-charms-20151218-git/src/low-level/curses-grovel.c" Output was: /home/testgrid/cl-test-grid/work-dir/agent/test-runs/20151224014118-ccl-1.8-r15286m-f97-linux-arm/fasl/ql/dists/quicklisp/software/cl-charms-20151218-git/src/low-level/curses-grovel.c:6:21: fatal error: ncurses.h: No such file or directory #include <ncurses.h> ^ compilation terminated.
(LOAD com.informatimago.editor FAIL) ffi-grovel, CFFI-GROVEL:GROVEL-ERROR : External process exited with code 1. Command was: "cc" "-marm" "-I/home/testgrid/cl-test-grid/work-dir/agent/quicklisp/dists/quicklisp/software/cffi_0.16.1/" "-o" "/home/testgrid/cl-test-grid/work-dir/agent/test-runs/20151224014118-ccl-1.8-r15286m-f97-linux-arm/fasl/ql/dists/quicklisp/software/cl-charms-20151218-git/src/low-level/curses-grovel" "/home/testgrid/cl-test-grid/work-dir/agent/test-runs/20151224014118-ccl-1.8-r15286m-f97-linux-arm/fasl/ql/dists/quicklisp/software/cl-charms-20151218-git/src/low-level/curses-grovel.c" Output was: /home/testgrid/cl-test-grid/work-dir/agent/test-runs/20151224014118-ccl-1.8-r15286m-f97-linux-arm/fasl/ql/dists/quicklisp/software/cl-charms-20151218-git/src/low-level/curses-grovel.c:6:21: fatal error: ncurses.h: No such file or directory #include <ncurses.h> ^ compilation terminated.
(LOAD com.informatimago.clext.test FAIL) ASDF:LOAD-SYSTEM-DEFINITION-ERROR : Error while trying to load definition for system bordeaux-threads from pathname /home/testgrid/cl-test-grid/work-dir/agent/quicklisp/dists/quicklisp/software/bordeaux-threads-v0.8.4-git/bordeaux-threads.asd: There is no package named "UIOP" .
(LOAD com.informatimago.clext.pipe.test FAIL) ASDF:LOAD-SYSTEM-DEFINITION-ERROR : Error while trying to load definition for system bordeaux-threads from pathname /home/testgrid/cl-test-grid/work-dir/agent/quicklisp/dists/quicklisp/software/bordeaux-threads-v0.8.4-git/bordeaux-threads.asd: There is no package named "UIOP" .
(LOAD com.informatimago.clext.pipe FAIL) ASDF:LOAD-SYSTEM-DEFINITION-ERROR : Error while trying to load definition for system bordeaux-threads from pathname /home/testgrid/cl-test-grid/work-dir/agent/quicklisp/dists/quicklisp/software/bordeaux-threads-v0.8.4-git/bordeaux-threads.asd: There is no package named "UIOP" .
(LOAD com.informatimago.clext FAIL) ASDF:LOAD-SYSTEM-DEFINITION-ERROR : Error while trying to load definition for system bordeaux-threads from pathname /home/testgrid/cl-test-grid/work-dir/agent/quicklisp/dists/quicklisp/software/bordeaux-threads-v0.8.4-git/bordeaux-threads.asd: There is no package named "UIOP" .
(LOAD com.informatimago FAIL) ffi-grovel, CFFI-GROVEL:GROVEL-ERROR : External process exited with code 1. Command was: "cc" "-marm" "-I/home/testgrid/cl-test-grid/work-dir/agent/quicklisp/dists/quicklisp/software/cffi_0.16.1/" "-o" "/home/testgrid/cl-test-grid/work-dir/agent/test-runs/20151224014118-ccl-1.8-r15286m-f97-linux-arm/fasl/ql/dists/quicklisp/software/cl-charms-20151218-git/src/low-level/curses-grovel" "/home/testgrid/cl-test-grid/work-dir/agent/test-runs/20151224014118-ccl-1.8-r15286m-f97-linux-arm/fasl/ql/dists/quicklisp/software/cl-charms-20151218-git/src/low-level/curses-grovel.c" Output was: /home/testgrid/cl-test-grid/work-dir/agent/test-runs/20151224014118-ccl-1.8-r15286m-f97-linux-arm/fasl/ql/dists/quicklisp/software/cl-charms-20151218-git/src/low-level/curses-grovel.c:6:21: fatal error: ncurses.h: No such file or directory #include <ncurses.h> ^ compilation terminated.
(LOAD com.informatimago.tools.try-systems FAIL) ASDF:LOAD-SYSTEM-DEFINITION-ERROR : Error while trying to load definition for system bordeaux-threads from pathname /home/testgrid/cl-test-grid/work-dir/agent/quicklisp/dists/quicklisp/software/bordeaux-threads-v0.8.4-git/bordeaux-threads.asd: There is no package named "UIOP" .
(LOAD com.informatimago.tools.thread FAIL) ASDF:LOAD-SYSTEM-DEFINITION-ERROR : Error while trying to load definition for system bordeaux-threads from pathname /home/testgrid/cl-test-grid/work-dir/agent/quicklisp/dists/quicklisp/software/bordeaux-threads-v0.8.4-git/bordeaux-threads.asd: There is no package named "UIOP" .
(LOAD com.informatimago.tools.test FAIL) ASDF:LOAD-SYSTEM-DEFINITION-ERROR : Error while trying to load definition for system bordeaux-threads from pathname /home/testgrid/cl-test-grid/work-dir/agent/quicklisp/dists/quicklisp/software/bordeaux-threads-v0.8.4-git/bordeaux-threads.asd: There is no package named "UIOP" .
(LOAD com.informatimago.tools.summary.test FAIL) ASDF:LOAD-SYSTEM-DEFINITION-ERROR : Error while trying to load definition for system bordeaux-threads from pathname /home/testgrid/cl-test-grid/work-dir/agent/quicklisp/dists/quicklisp/software/bordeaux-threads-v0.8.4-git/bordeaux-threads.asd: There is no package named "UIOP" .
(LOAD com.informatimago.tools.summary FAIL) ASDF:LOAD-SYSTEM-DEFINITION-ERROR : Error while trying to load definition for system bordeaux-threads from pathname /home/testgrid/cl-test-grid/work-dir/agent/quicklisp/dists/quicklisp/software/bordeaux-threads-v0.8.4-git/bordeaux-threads.asd: There is no package named "UIOP" .
(LOAD com.informatimago.tools.source.test FAIL) ASDF:LOAD-SYSTEM-DEFINITION-ERROR : Error while trying to load definition for system bordeaux-threads from pathname /home/testgrid/cl-test-grid/work-dir/agent/quicklisp/dists/quicklisp/software/bordeaux-threads-v0.8.4-git/bordeaux-threads.asd: There is no package named "UIOP" .
(LOAD com.informatimago.tools.source FAIL) ASDF:LOAD-SYSTEM-DEFINITION-ERROR : Error while trying to load definition for system bordeaux-threads from pathname /home/testgrid/cl-test-grid/work-dir/agent/quicklisp/dists/quicklisp/software/bordeaux-threads-v0.8.4-git/bordeaux-threads.asd: There is no package named "UIOP" .
(LOAD com.informatimago.tools.make-depends.test FAIL) ASDF:LOAD-SYSTEM-DEFINITION-ERROR : Error while trying to load definition for system bordeaux-threads from pathname /home/testgrid/cl-test-grid/work-dir/agent/quicklisp/dists/quicklisp/software/bordeaux-threads-v0.8.4-git/bordeaux-threads.asd: There is no package named "UIOP" .
(LOAD com.informatimago.tools.make-depends FAIL) ASDF:LOAD-SYSTEM-DEFINITION-ERROR : Error while trying to load definition for system bordeaux-threads from pathname /home/testgrid/cl-test-grid/work-dir/agent/quicklisp/dists/quicklisp/software/bordeaux-threads-v0.8.4-git/bordeaux-threads.asd: There is no package named "UIOP" .
(LOAD com.informatimago.tools.check-asdf.test FAIL) ASDF:LOAD-SYSTEM-DEFINITION-ERROR : Error while trying to load definition for system bordeaux-threads from pathname /home/testgrid/cl-test-grid/work-dir/agent/quicklisp/dists/quicklisp/software/bordeaux-threads-v0.8.4-git/bordeaux-threads.asd: There is no package named "UIOP" .
(LOAD com.informatimago.tools.check-asdf FAIL) ASDF:LOAD-SYSTEM-DEFINITION-ERROR : Error while trying to load definition for system bordeaux-threads from pathname /home/testgrid/cl-test-grid/work-dir/agent/quicklisp/dists/quicklisp/software/bordeaux-threads-v0.8.4-git/bordeaux-threads.asd: There is no package named "UIOP" .
(LOAD com.informatimago.tools FAIL) ASDF:LOAD-SYSTEM-DEFINITION-ERROR : Error while trying to load definition for system bordeaux-threads from pathname /home/testgrid/cl-test-grid/work-dir/agent/quicklisp/dists/quicklisp/software/bordeaux-threads-v0.8.4-git/bordeaux-threads.asd: There is no package named "UIOP" .
(LOAD com.informatimago.test FAIL) ffi-grovel, CFFI-GROVEL:GROVEL-ERROR : External process exited with code 1. Command was: "cc" "-marm" "-I/home/testgrid/cl-test-grid/work-dir/agent/quicklisp/dists/quicklisp/software/cffi_0.16.1/" "-o" "/home/testgrid/cl-test-grid/work-dir/agent/test-runs/20151223021134-ccl-1.8-r15286m-f97-linux-arm/fasl/ql/dists/quicklisp/software/cl-charms-20151218-git/src/low-level/curses-grovel" "/home/testgrid/cl-test-grid/work-dir/agent/test-runs/20151223021134-ccl-1.8-r15286m-f97-linux-arm/fasl/ql/dists/quicklisp/software/cl-charms-20151218-git/src/low-level/curses-grovel.c" Output was: /home/testgrid/cl-test-grid/work-dir/agent/test-runs/20151223021134-ccl-1.8-r15286m-f97-linux-arm/fasl/ql/dists/quicklisp/software/cl-charms-20151218-git/src/low-level/curses-grovel.c:6:21: fatal error: ncurses.h: No such file or directory #include <ncurses.h> ^ compilation terminated.
(LOAD com.informatimago.small-cl-pgms.botihn FAIL) ASDF:LOAD-SYSTEM-DEFINITION-ERROR : Error while trying to load definition for system drakma from pathname /home/testgrid/cl-test-grid/work-dir/agent/quicklisp/dists/quicklisp/software/drakma-2.0.2/drakma.asd: While compiling (PERFORM (T T)) : In the form ((LOAD-SYSTEM TEST-OP) (:DRAKMA-TEST (EQL #<SYSTEM "drakma">))), (LOAD-SYSTEM TEST-OP) is not a symbol or lambda expression.
(LOAD com.informatimago.lispdoc.test FAIL) ASDF:LOAD-SYSTEM-DEFINITION-ERROR : Error while trying to load definition for system bordeaux-threads from pathname /home/testgrid/cl-test-grid/work-dir/agent/quicklisp/dists/quicklisp/software/bordeaux-threads-v0.8.4-git/bordeaux-threads.asd: There is no package named "UIOP" .
(LOAD com.informatimago.lispdoc FAIL) ASDF:LOAD-SYSTEM-DEFINITION-ERROR : Error while trying to load definition for system bordeaux-threads from pathname /home/testgrid/cl-test-grid/work-dir/agent/quicklisp/dists/quicklisp/software/bordeaux-threads-v0.8.4-git/bordeaux-threads.asd: There is no package named "UIOP" .
(LOAD com.informatimago.editor.test FAIL) ffi-grovel, CFFI-GROVEL:GROVEL-ERROR : External process exited with code 1. Command was: "cc" "-marm" "-I/home/testgrid/cl-test-grid/work-dir/agent/quicklisp/dists/quicklisp/software/cffi_0.16.1/" "-o" "/home/testgrid/cl-test-grid/work-dir/agent/test-runs/20151223021134-ccl-1.8-r15286m-f97-linux-arm/fasl/ql/dists/quicklisp/software/cl-charms-20151218-git/src/low-level/curses-grovel" "/home/testgrid/cl-test-grid/work-dir/agent/test-runs/20151223021134-ccl-1.8-r15286m-f97-linux-arm/fasl/ql/dists/quicklisp/software/cl-charms-20151218-git/src/low-level/curses-grovel.c" Output was: /home/testgrid/cl-test-grid/work-dir/agent/test-runs/20151223021134-ccl-1.8-r15286m-f97-linux-arm/fasl/ql/dists/quicklisp/software/cl-charms-20151218-git/src/low-level/curses-grovel.c:6:21: fatal error: ncurses.h: No such file or directory #include <ncurses.h> ^ compilation terminated.
(LOAD com.informatimago.editor FAIL) ffi-grovel, CFFI-GROVEL:GROVEL-ERROR : External process exited with code 1. Command was: "cc" "-marm" "-I/home/testgrid/cl-test-grid/work-dir/agent/quicklisp/dists/quicklisp/software/cffi_0.16.1/" "-o" "/home/testgrid/cl-test-grid/work-dir/agent/test-runs/20151223021134-ccl-1.8-r15286m-f97-linux-arm/fasl/ql/dists/quicklisp/software/cl-charms-20151218-git/src/low-level/curses-grovel" "/home/testgrid/cl-test-grid/work-dir/agent/test-runs/20151223021134-ccl-1.8-r15286m-f97-linux-arm/fasl/ql/dists/quicklisp/software/cl-charms-20151218-git/src/low-level/curses-grovel.c" Output was: /home/testgrid/cl-test-grid/work-dir/agent/test-runs/20151223021134-ccl-1.8-r15286m-f97-linux-arm/fasl/ql/dists/quicklisp/software/cl-charms-20151218-git/src/low-level/curses-grovel.c:6:21: fatal error: ncurses.h: No such file or directory #include <ncurses.h> ^ compilation terminated.
(LOAD com.informatimago.clext.test FAIL) ASDF:LOAD-SYSTEM-DEFINITION-ERROR : Error while trying to load definition for system bordeaux-threads from pathname /home/testgrid/cl-test-grid/work-dir/agent/quicklisp/dists/quicklisp/software/bordeaux-threads-v0.8.4-git/bordeaux-threads.asd: There is no package named "UIOP" .
(LOAD com.informatimago.clext.pipe.test FAIL) ASDF:LOAD-SYSTEM-DEFINITION-ERROR : Error while trying to load definition for system bordeaux-threads from pathname /home/testgrid/cl-test-grid/work-dir/agent/quicklisp/dists/quicklisp/software/bordeaux-threads-v0.8.4-git/bordeaux-threads.asd: There is no package named "UIOP" .
(LOAD com.informatimago.clext.pipe FAIL) ASDF:LOAD-SYSTEM-DEFINITION-ERROR : Error while trying to load definition for system bordeaux-threads from pathname /home/testgrid/cl-test-grid/work-dir/agent/quicklisp/dists/quicklisp/software/bordeaux-threads-v0.8.4-git/bordeaux-threads.asd: There is no package named "UIOP" .
(LOAD com.informatimago.clext FAIL) ASDF:LOAD-SYSTEM-DEFINITION-ERROR : Error while trying to load definition for system bordeaux-threads from pathname /home/testgrid/cl-test-grid/work-dir/agent/quicklisp/dists/quicklisp/software/bordeaux-threads-v0.8.4-git/bordeaux-threads.asd: There is no package named "UIOP" .
(LOAD com.informatimago FAIL) ffi-grovel, CFFI-GROVEL:GROVEL-ERROR : External process exited with code 1. Command was: "cc" "-marm" "-I/home/testgrid/cl-test-grid/work-dir/agent/quicklisp/dists/quicklisp/software/cffi_0.16.1/" "-o" "/home/testgrid/cl-test-grid/work-dir/agent/test-runs/20151223021134-ccl-1.8-r15286m-f97-linux-arm/fasl/ql/dists/quicklisp/software/cl-charms-20151218-git/src/low-level/curses-grovel" "/home/testgrid/cl-test-grid/work-dir/agent/test-runs/20151223021134-ccl-1.8-r15286m-f97-linux-arm/fasl/ql/dists/quicklisp/software/cl-charms-20151218-git/src/low-level/curses-grovel.c" Output was: /home/testgrid/cl-test-grid/work-dir/agent/test-runs/20151223021134-ccl-1.8-r15286m-f97-linux-arm/fasl/ql/dists/quicklisp/software/cl-charms-20151218-git/src/low-level/curses-grovel.c:6:21: fatal error: ncurses.h: No such file or directory #include <ncurses.h> ^ compilation terminated.
(LOAD com.informatimago.tools.try-systems FAIL) ASDF:LOAD-SYSTEM-DEFINITION-ERROR : Error while trying to load definition for system bordeaux-threads from pathname /home/testgrid/cl-test-grid/work-dir/agent/quicklisp/dists/quicklisp/software/bordeaux-threads-v0.8.4-git/bordeaux-threads.asd: There is no package named "UIOP" .
(LOAD com.informatimago.tools.thread FAIL) ASDF:LOAD-SYSTEM-DEFINITION-ERROR : Error while trying to load definition for system bordeaux-threads from pathname /home/testgrid/cl-test-grid/work-dir/agent/quicklisp/dists/quicklisp/software/bordeaux-threads-v0.8.4-git/bordeaux-threads.asd: There is no package named "UIOP" .
(LOAD com.informatimago.tools.test FAIL) ASDF:LOAD-SYSTEM-DEFINITION-ERROR : Error while trying to load definition for system bordeaux-threads from pathname /home/testgrid/cl-test-grid/work-dir/agent/quicklisp/dists/quicklisp/software/bordeaux-threads-v0.8.4-git/bordeaux-threads.asd: There is no package named "UIOP" .
(LOAD com.informatimago.tools.summary.test FAIL) ASDF:LOAD-SYSTEM-DEFINITION-ERROR : Error while trying to load definition for system bordeaux-threads from pathname /home/testgrid/cl-test-grid/work-dir/agent/quicklisp/dists/quicklisp/software/bordeaux-threads-v0.8.4-git/bordeaux-threads.asd: There is no package named "UIOP" .
(LOAD com.informatimago.tools.summary FAIL) ASDF:LOAD-SYSTEM-DEFINITION-ERROR : Error while trying to load definition for system bordeaux-threads from pathname /home/testgrid/cl-test-grid/work-dir/agent/quicklisp/dists/quicklisp/software/bordeaux-threads-v0.8.4-git/bordeaux-threads.asd: There is no package named "UIOP" .
(LOAD com.informatimago.tools.source.test FAIL) ASDF:LOAD-SYSTEM-DEFINITION-ERROR : Error while trying to load definition for system bordeaux-threads from pathname /home/testgrid/cl-test-grid/work-dir/agent/quicklisp/dists/quicklisp/software/bordeaux-threads-v0.8.4-git/bordeaux-threads.asd: There is no package named "UIOP" .
(LOAD com.informatimago.tools.source FAIL) ASDF:LOAD-SYSTEM-DEFINITION-ERROR : Error while trying to load definition for system bordeaux-threads from pathname /home/testgrid/cl-test-grid/work-dir/agent/quicklisp/dists/quicklisp/software/bordeaux-threads-v0.8.4-git/bordeaux-threads.asd: There is no package named "UIOP" .
(LOAD com.informatimago.tools.make-depends.test FAIL) ASDF:LOAD-SYSTEM-DEFINITION-ERROR : Error while trying to load definition for system bordeaux-threads from pathname /home/testgrid/cl-test-grid/work-dir/agent/quicklisp/dists/quicklisp/software/bordeaux-threads-v0.8.4-git/bordeaux-threads.asd: There is no package named "UIOP" .
(LOAD com.informatimago.tools.make-depends FAIL) ASDF:LOAD-SYSTEM-DEFINITION-ERROR : Error while trying to load definition for system bordeaux-threads from pathname /home/testgrid/cl-test-grid/work-dir/agent/quicklisp/dists/quicklisp/software/bordeaux-threads-v0.8.4-git/bordeaux-threads.asd: There is no package named "UIOP" .
(LOAD com.informatimago.tools.check-asdf.test FAIL) ASDF:LOAD-SYSTEM-DEFINITION-ERROR : Error while trying to load definition for system bordeaux-threads from pathname /home/testgrid/cl-test-grid/work-dir/agent/quicklisp/dists/quicklisp/software/bordeaux-threads-v0.8.4-git/bordeaux-threads.asd: There is no package named "UIOP" .
(LOAD com.informatimago.tools.check-asdf FAIL) ASDF:LOAD-SYSTEM-DEFINITION-ERROR : Error while trying to load definition for system bordeaux-threads from pathname /home/testgrid/cl-test-grid/work-dir/agent/quicklisp/dists/quicklisp/software/bordeaux-threads-v0.8.4-git/bordeaux-threads.asd: There is no package named "UIOP" .
(LOAD com.informatimago.tools FAIL) ASDF:LOAD-SYSTEM-DEFINITION-ERROR : Error while trying to load definition for system bordeaux-threads from pathname /home/testgrid/cl-test-grid/work-dir/agent/quicklisp/dists/quicklisp/software/bordeaux-threads-v0.8.4-git/bordeaux-threads.asd: There is no package named "UIOP" .
(LOAD com.informatimago.test FAIL) ffi-grovel, CFFI-GROVEL:GROVEL-ERROR : External process exited with code 1. Command was: "cc" "-marm" "-I/home/testgrid/cl-test-grid/work-dir/agent/quicklisp/dists/quicklisp/software/cffi_0.16.1/" "-o" "/home/testgrid/cl-test-grid/work-dir/agent/test-runs/20151223021134-ccl-1.8-r15286m-f97-linux-arm/fasl/ql/dists/quicklisp/software/cl-charms-20151218-git/src/low-level/curses-grovel" "/home/testgrid/cl-test-grid/work-dir/agent/test-runs/20151223021134-ccl-1.8-r15286m-f97-linux-arm/fasl/ql/dists/quicklisp/software/cl-charms-20151218-git/src/low-level/curses-grovel.c" Output was: /home/testgrid/cl-test-grid/work-dir/agent/test-runs/20151223021134-ccl-1.8-r15286m-f97-linux-arm/fasl/ql/dists/quicklisp/software/cl-charms-20151218-git/src/low-level/curses-grovel.c:6:21: fatal error: ncurses.h: No such file or directory #include <ncurses.h> ^ compilation terminated.
(LOAD com.informatimago.small-cl-pgms.botihn FAIL) ASDF:LOAD-SYSTEM-DEFINITION-ERROR : Error while trying to load definition for system drakma from pathname /home/testgrid/cl-test-grid/work-dir/agent/quicklisp/dists/quicklisp/software/drakma-2.0.2/drakma.asd: While compiling (PERFORM (T T)) : In the form ((LOAD-SYSTEM TEST-OP) (:DRAKMA-TEST (EQL #<SYSTEM "drakma">))), (LOAD-SYSTEM TEST-OP) is not a symbol or lambda expression.
(LOAD com.informatimago.lispdoc.test FAIL) ASDF:LOAD-SYSTEM-DEFINITION-ERROR : Error while trying to load definition for system bordeaux-threads from pathname /home/testgrid/cl-test-grid/work-dir/agent/quicklisp/dists/quicklisp/software/bordeaux-threads-v0.8.4-git/bordeaux-threads.asd: There is no package named "UIOP" .
(LOAD com.informatimago.lispdoc FAIL) ASDF:LOAD-SYSTEM-DEFINITION-ERROR : Error while trying to load definition for system bordeaux-threads from pathname /home/testgrid/cl-test-grid/work-dir/agent/quicklisp/dists/quicklisp/software/bordeaux-threads-v0.8.4-git/bordeaux-threads.asd: There is no package named "UIOP" .
(LOAD com.informatimago.editor.test FAIL) ffi-grovel, CFFI-GROVEL:GROVEL-ERROR : External process exited with code 1. Command was: "cc" "-marm" "-I/home/testgrid/cl-test-grid/work-dir/agent/quicklisp/dists/quicklisp/software/cffi_0.16.1/" "-o" "/home/testgrid/cl-test-grid/work-dir/agent/test-runs/20151223021134-ccl-1.8-r15286m-f97-linux-arm/fasl/ql/dists/quicklisp/software/cl-charms-20151218-git/src/low-level/curses-grovel" "/home/testgrid/cl-test-grid/work-dir/agent/test-runs/20151223021134-ccl-1.8-r15286m-f97-linux-arm/fasl/ql/dists/quicklisp/software/cl-charms-20151218-git/src/low-level/curses-grovel.c" Output was: /home/testgrid/cl-test-grid/work-dir/agent/test-runs/20151223021134-ccl-1.8-r15286m-f97-linux-arm/fasl/ql/dists/quicklisp/software/cl-charms-20151218-git/src/low-level/curses-grovel.c:6:21: fatal error: ncurses.h: No such file or directory #include <ncurses.h> ^ compilation terminated.
(LOAD com.informatimago.editor FAIL) ffi-grovel, CFFI-GROVEL:GROVEL-ERROR : External process exited with code 1. Command was: "cc" "-marm" "-I/home/testgrid/cl-test-grid/work-dir/agent/quicklisp/dists/quicklisp/software/cffi_0.16.1/" "-o" "/home/testgrid/cl-test-grid/work-dir/agent/test-runs/20151223021134-ccl-1.8-r15286m-f97-linux-arm/fasl/ql/dists/quicklisp/software/cl-charms-20151218-git/src/low-level/curses-grovel" "/home/testgrid/cl-test-grid/work-dir/agent/test-runs/20151223021134-ccl-1.8-r15286m-f97-linux-arm/fasl/ql/dists/quicklisp/software/cl-charms-20151218-git/src/low-level/curses-grovel.c" Output was: /home/testgrid/cl-test-grid/work-dir/agent/test-runs/20151223021134-ccl-1.8-r15286m-f97-linux-arm/fasl/ql/dists/quicklisp/software/cl-charms-20151218-git/src/low-level/curses-grovel.c:6:21: fatal error: ncurses.h: No such file or directory #include <ncurses.h> ^ compilation terminated.
(LOAD com.informatimago.clext.test FAIL) ASDF:LOAD-SYSTEM-DEFINITION-ERROR : Error while trying to load definition for system bordeaux-threads from pathname /home/testgrid/cl-test-grid/work-dir/agent/quicklisp/dists/quicklisp/software/bordeaux-threads-v0.8.4-git/bordeaux-threads.asd: There is no package named "UIOP" .
(LOAD com.informatimago.clext.pipe.test FAIL) ASDF:LOAD-SYSTEM-DEFINITION-ERROR : Error while trying to load definition for system bordeaux-threads from pathname /home/testgrid/cl-test-grid/work-dir/agent/quicklisp/dists/quicklisp/software/bordeaux-threads-v0.8.4-git/bordeaux-threads.asd: There is no package named "UIOP" .
(LOAD com.informatimago.clext.pipe FAIL) ASDF:LOAD-SYSTEM-DEFINITION-ERROR : Error while trying to load definition for system bordeaux-threads from pathname /home/testgrid/cl-test-grid/work-dir/agent/quicklisp/dists/quicklisp/software/bordeaux-threads-v0.8.4-git/bordeaux-threads.asd: There is no package named "UIOP" .
(LOAD com.informatimago.clext FAIL) ASDF:LOAD-SYSTEM-DEFINITION-ERROR : Error while trying to load definition for system bordeaux-threads from pathname /home/testgrid/cl-test-grid/work-dir/agent/quicklisp/dists/quicklisp/software/bordeaux-threads-v0.8.4-git/bordeaux-threads.asd: There is no package named "UIOP" .
(LOAD com.informatimago FAIL) ffi-grovel, CFFI-GROVEL:GROVEL-ERROR : External process exited with code 1. Command was: "cc" "-marm" "-I/home/testgrid/cl-test-grid/work-dir/agent/quicklisp/dists/quicklisp/software/cffi_0.16.1/" "-o" "/home/testgrid/cl-test-grid/work-dir/agent/test-runs/20151223021134-ccl-1.8-r15286m-f97-linux-arm/fasl/ql/dists/quicklisp/software/cl-charms-20151218-git/src/low-level/curses-grovel" "/home/testgrid/cl-test-grid/work-dir/agent/test-runs/20151223021134-ccl-1.8-r15286m-f97-linux-arm/fasl/ql/dists/quicklisp/software/cl-charms-20151218-git/src/low-level/curses-grovel.c" Output was: /home/testgrid/cl-test-grid/work-dir/agent/test-runs/20151223021134-ccl-1.8-r15286m-f97-linux-arm/fasl/ql/dists/quicklisp/software/cl-charms-20151218-git/src/low-level/curses-grovel.c:6:21: fatal error: ncurses.h: No such file or directory #include <ncurses.h> ^ compilation terminated.
(LOAD com.informatimago.small-cl-pgms.botihn FAIL) ASDF:LOAD-SYSTEM-DEFINITION-ERROR : Error while trying to load definition for system drakma from pathname /home/testgrid/cl-test-grid/work-dir/agent/quicklisp/dists/quicklisp/software/drakma-2.0.2/drakma.asd: While compiling (PERFORM (T T)) : In the form ((LOAD-SYSTEM TEST-OP) (:DRAKMA-TEST (EQL #<SYSTEM "drakma">))), (LOAD-SYSTEM TEST-OP) is not a symbol or lambda expression.
(LOAD com.informatimago.editor.test FAIL) ffi-grovel, CFFI-GROVEL:GROVEL-ERROR : External process exited with code 1. Command was: "cc" "-marm" "-I/home/testgrid/cl-test-grid/work-dir/agent/quicklisp/dists/quicklisp/software/cffi_0.16.1/" "-o" "/home/testgrid/cl-test-grid/work-dir/agent/test-runs/20151105072100-ccl-1.8-r15286m-f97-linux-arm/fasl/ql/dists/quicklisp/software/cl-charms-20151031-git/src/low-level/curses-grovel" "/home/testgrid/cl-test-grid/work-dir/agent/test-runs/20151105072100-ccl-1.8-r15286m-f97-linux-arm/fasl/ql/dists/quicklisp/software/cl-charms-20151031-git/src/low-level/curses-grovel.c" Output was: /home/testgrid/cl-test-grid/work-dir/agent/test-runs/20151105072100-ccl-1.8-r15286m-f97-linux-arm/fasl/ql/dists/quicklisp/software/cl-charms-20151031-git/src/low-level/curses-grovel.c:6:21: fatal error: ncurses.h: No such file or directory #include <ncurses.h> ^ compilation terminated.
(LOAD com.informatimago.editor FAIL) ffi-grovel, CFFI-GROVEL:GROVEL-ERROR : External process exited with code 1. Command was: "cc" "-marm" "-I/home/testgrid/cl-test-grid/work-dir/agent/quicklisp/dists/quicklisp/software/cffi_0.16.1/" "-o" "/home/testgrid/cl-test-grid/work-dir/agent/test-runs/20151105072100-ccl-1.8-r15286m-f97-linux-arm/fasl/ql/dists/quicklisp/software/cl-charms-20151031-git/src/low-level/curses-grovel" "/home/testgrid/cl-test-grid/work-dir/agent/test-runs/20151105072100-ccl-1.8-r15286m-f97-linux-arm/fasl/ql/dists/quicklisp/software/cl-charms-20151031-git/src/low-level/curses-grovel.c" Output was: /home/testgrid/cl-test-grid/work-dir/agent/test-runs/20151105072100-ccl-1.8-r15286m-f97-linux-arm/fasl/ql/dists/quicklisp/software/cl-charms-20151031-git/src/low-level/curses-grovel.c:6:21: fatal error: ncurses.h: No such file or directory #include <ncurses.h> ^ compilation terminated.
ccl-1.9-r15756-f96-linux-x86
(LOAD com.informatimago.test FAIL) ffi-grovel, CFFI-GROVEL:GROVEL-ERROR : External process exited with code 1. Command was: "cc" "-m32" "-I/home/testgrid/cl-test-grid/work-dir/agent/quicklisp/dists/quicklisp/software/cffi_0.16.1/" "-o" "/home/testgrid/cl-test-grid/work-dir/agent/test-runs/20151222145627-ccl-1.9-r15756-f96-linux-x86/fasl/ql/dists/quicklisp/software/cl-charms-20151218-git/src/low-level/curses-grovel" "/home/testgrid/cl-test-grid/work-dir/agent/test-runs/20151222145627-ccl-1.9-r15756-f96-linux-x86/fasl/ql/dists/quicklisp/software/cl-charms-20151218-git/src/low-level/curses-grovel.c" Output was: /home/testgrid/cl-test-grid/work-dir/agent/test-runs/20151222145627-ccl-1.9-r15756-f96-linux-x86/fasl/ql/dists/quicklisp/software/cl-charms-20151218-git/src/low-level/curses-grovel.c:6:21: fatal error: ncurses.h: No such file or directory compilation terminated.
(LOAD com.informatimago.editor.test FAIL) ffi-grovel, CFFI-GROVEL:GROVEL-ERROR : External process exited with code 1. Command was: "cc" "-m32" "-I/home/testgrid/cl-test-grid/work-dir/agent/quicklisp/dists/quicklisp/software/cffi_0.16.1/" "-o" "/home/testgrid/cl-test-grid/work-dir/agent/test-runs/20151222145627-ccl-1.9-r15756-f96-linux-x86/fasl/ql/dists/quicklisp/software/cl-charms-20151218-git/src/low-level/curses-grovel" "/home/testgrid/cl-test-grid/work-dir/agent/test-runs/20151222145627-ccl-1.9-r15756-f96-linux-x86/fasl/ql/dists/quicklisp/software/cl-charms-20151218-git/src/low-level/curses-grovel.c" Output was: /home/testgrid/cl-test-grid/work-dir/agent/test-runs/20151222145627-ccl-1.9-r15756-f96-linux-x86/fasl/ql/dists/quicklisp/software/cl-charms-20151218-git/src/low-level/curses-grovel.c:6:21: fatal error: ncurses.h: No such file or directory compilation terminated.
(LOAD com.informatimago.editor FAIL) ffi-grovel, CFFI-GROVEL:GROVEL-ERROR : External process exited with code 1. Command was: "cc" "-m32" "-I/home/testgrid/cl-test-grid/work-dir/agent/quicklisp/dists/quicklisp/software/cffi_0.16.1/" "-o" "/home/testgrid/cl-test-grid/work-dir/agent/test-runs/20151222145627-ccl-1.9-r15756-f96-linux-x86/fasl/ql/dists/quicklisp/software/cl-charms-20151218-git/src/low-level/curses-grovel" "/home/testgrid/cl-test-grid/work-dir/agent/test-runs/20151222145627-ccl-1.9-r15756-f96-linux-x86/fasl/ql/dists/quicklisp/software/cl-charms-20151218-git/src/low-level/curses-grovel.c" Output was: /home/testgrid/cl-test-grid/work-dir/agent/test-runs/20151222145627-ccl-1.9-r15756-f96-linux-x86/fasl/ql/dists/quicklisp/software/cl-charms-20151218-git/src/low-level/curses-grovel.c:6:21: fatal error: ncurses.h: No such file or directory compilation terminated.
(LOAD com.informatimago FAIL) ffi-grovel, CFFI-GROVEL:GROVEL-ERROR : External process exited with code 1. Command was: "cc" "-m32" "-I/home/testgrid/cl-test-grid/work-dir/agent/quicklisp/dists/quicklisp/software/cffi_0.16.1/" "-o" "/home/testgrid/cl-test-grid/work-dir/agent/test-runs/20151222145627-ccl-1.9-r15756-f96-linux-x86/fasl/ql/dists/quicklisp/software/cl-charms-20151218-git/src/low-level/curses-grovel" "/home/testgrid/cl-test-grid/work-dir/agent/test-runs/20151222145627-ccl-1.9-r15756-f96-linux-x86/fasl/ql/dists/quicklisp/software/cl-charms-20151218-git/src/low-level/curses-grovel.c" Output was: /home/testgrid/cl-test-grid/work-dir/agent/test-runs/20151222145627-ccl-1.9-r15756-f96-linux-x86/fasl/ql/dists/quicklisp/software/cl-charms-20151218-git/src/low-level/curses-grovel.c:6:21: fatal error: ncurses.h: No such file or directory compilation terminated.
(LOAD com.informatimago.editor.test FAIL) ffi-grovel, CFFI-GROVEL:GROVEL-ERROR : External process exited with code 1. Command was: "cc" "-m32" "-I/home/testgrid/cl-test-grid/work-dir/agent/quicklisp/dists/quicklisp/software/cffi_0.16.1/" "-o" "/home/testgrid/cl-test-grid/work-dir/agent/test-runs/20151103001055-ccl-1.9-r15756-f96-linux-x86/fasl/ql/dists/quicklisp/software/cl-charms-20151031-git/src/low-level/curses-grovel" "/home/testgrid/cl-test-grid/work-dir/agent/test-runs/20151103001055-ccl-1.9-r15756-f96-linux-x86/fasl/ql/dists/quicklisp/software/cl-charms-20151031-git/src/low-level/curses-grovel.c" Output was: /home/testgrid/cl-test-grid/work-dir/agent/test-runs/20151103001055-ccl-1.9-r15756-f96-linux-x86/fasl/ql/dists/quicklisp/software/cl-charms-20151031-git/src/low-level/curses-grovel.c:6:21: fatal error: ncurses.h: No such file or directory compilation terminated.
(LOAD com.informatimago.editor FAIL) ffi-grovel, CFFI-GROVEL:GROVEL-ERROR : External process exited with code 1. Command was: "cc" "-m32" "-I/home/testgrid/cl-test-grid/work-dir/agent/quicklisp/dists/quicklisp/software/cffi_0.16.1/" "-o" "/home/testgrid/cl-test-grid/work-dir/agent/test-runs/20151103001055-ccl-1.9-r15756-f96-linux-x86/fasl/ql/dists/quicklisp/software/cl-charms-20151031-git/src/low-level/curses-grovel" "/home/testgrid/cl-test-grid/work-dir/agent/test-runs/20151103001055-ccl-1.9-r15756-f96-linux-x86/fasl/ql/dists/quicklisp/software/cl-charms-20151031-git/src/low-level/curses-grovel.c" Output was: /home/testgrid/cl-test-grid/work-dir/agent/test-runs/20151103001055-ccl-1.9-r15756-f96-linux-x86/fasl/ql/dists/quicklisp/software/cl-charms-20151031-git/src/low-level/curses-grovel.c:6:21: fatal error: ncurses.h: No such file or directory compilation terminated.
ccl-1.9-r15767-f99-linux-arm
(LOAD com.informatimago.tools.try-systems FAIL) COM.INFORMATIMAGO.COMMON-LISP.CESARUM.CHARACTER-SETS:CHARACTER-SET-ERROR : There is no character-set named "NIL"
(LOAD com.informatimago.tools.test FAIL) COM.INFORMATIMAGO.COMMON-LISP.CESARUM.CHARACTER-SETS:CHARACTER-SET-ERROR : There is no character-set named "NIL"
(LOAD com.informatimago.tools.summary.test FAIL) COM.INFORMATIMAGO.COMMON-LISP.CESARUM.CHARACTER-SETS:CHARACTER-SET-ERROR : There is no character-set named "NIL"
(LOAD com.informatimago.tools.summary FAIL) COM.INFORMATIMAGO.COMMON-LISP.CESARUM.CHARACTER-SETS:CHARACTER-SET-ERROR : There is no character-set named "NIL"
(LOAD com.informatimago.tools.source.test FAIL) COM.INFORMATIMAGO.COMMON-LISP.CESARUM.CHARACTER-SETS:CHARACTER-SET-ERROR : There is no character-set named "NIL"
(LOAD com.informatimago.tools.source FAIL) COM.INFORMATIMAGO.COMMON-LISP.CESARUM.CHARACTER-SETS:CHARACTER-SET-ERROR : There is no character-set named "NIL"
(LOAD com.informatimago.tools.make-depends.test FAIL) COM.INFORMATIMAGO.COMMON-LISP.CESARUM.CHARACTER-SETS:CHARACTER-SET-ERROR : There is no character-set named "NIL"
(LOAD com.informatimago.tools.make-depends FAIL) COM.INFORMATIMAGO.COMMON-LISP.CESARUM.CHARACTER-SETS:CHARACTER-SET-ERROR : There is no character-set named "NIL"
(LOAD com.informatimago.tools.check-asdf.test FAIL) COM.INFORMATIMAGO.COMMON-LISP.CESARUM.CHARACTER-SETS:CHARACTER-SET-ERROR : There is no character-set named "NIL"
(LOAD com.informatimago.tools.check-asdf FAIL) COM.INFORMATIMAGO.COMMON-LISP.CESARUM.CHARACTER-SETS:CHARACTER-SET-ERROR : There is no character-set named "NIL"
(LOAD com.informatimago.tools FAIL) COM.INFORMATIMAGO.COMMON-LISP.CESARUM.CHARACTER-SETS:CHARACTER-SET-ERROR : There is no character-set named "NIL"
(LOAD com.informatimago.test FAIL) COM.INFORMATIMAGO.COMMON-LISP.CESARUM.CHARACTER-SETS:CHARACTER-SET-ERROR : There is no character-set named "NIL"
(LOAD com.informatimago.editor.test FAIL) ffi-grovel, CFFI-GROVEL:GROVEL-ERROR : External process exited with code 1. Command was: "cc" "-marm" "-I/home/testgrid/cl-test-grid/work-dir/agent/quicklisp/dists/quicklisp/software/cffi_0.16.1/" "-o" "/home/testgrid/cl-test-grid/work-dir/agent/test-runs/20151222132702-ccl-1.9-r15767-f99-linux-arm/fasl/ql/dists/quicklisp/software/cl-charms-20151218-git/src/low-level/curses-grovel" "/home/testgrid/cl-test-grid/work-dir/agent/test-runs/20151222132702-ccl-1.9-r15767-f99-linux-arm/fasl/ql/dists/quicklisp/software/cl-charms-20151218-git/src/low-level/curses-grovel.c" Output was: /home/testgrid/cl-test-grid/work-dir/agent/test-runs/20151222132702-ccl-1.9-r15767-f99-linux-arm/fasl/ql/dists/quicklisp/software/cl-charms-20151218-git/src/low-level/curses-grovel.c:6:21: fatal error: ncurses.h: No such file or directory #include <ncurses.h> ^ compilation terminated.
(LOAD com.informatimago.editor FAIL) ffi-grovel, CFFI-GROVEL:GROVEL-ERROR : External process exited with code 1. Command was: "cc" "-marm" "-I/home/testgrid/cl-test-grid/work-dir/agent/quicklisp/dists/quicklisp/software/cffi_0.16.1/" "-o" "/home/testgrid/cl-test-grid/work-dir/agent/test-runs/20151222132702-ccl-1.9-r15767-f99-linux-arm/fasl/ql/dists/quicklisp/software/cl-charms-20151218-git/src/low-level/curses-grovel" "/home/testgrid/cl-test-grid/work-dir/agent/test-runs/20151222132702-ccl-1.9-r15767-f99-linux-arm/fasl/ql/dists/quicklisp/software/cl-charms-20151218-git/src/low-level/curses-grovel.c" Output was: /home/testgrid/cl-test-grid/work-dir/agent/test-runs/20151222132702-ccl-1.9-r15767-f99-linux-arm/fasl/ql/dists/quicklisp/software/cl-charms-20151218-git/src/low-level/curses-grovel.c:6:21: fatal error: ncurses.h: No such file or directory #include <ncurses.h> ^ compilation terminated.
(LOAD com.informatimago FAIL) COM.INFORMATIMAGO.COMMON-LISP.CESARUM.CHARACTER-SETS:CHARACTER-SET-ERROR : There is no character-set named "NIL"
(LOAD com.informatimago.editor.test FAIL) ffi-grovel, CFFI-GROVEL:GROVEL-ERROR : External process exited with code 1. Command was: "cc" "-marm" "-I/home/testgrid/cl-test-grid/work-dir/agent/quicklisp/dists/quicklisp/software/cffi_0.16.1/" "-o" "/home/testgrid/cl-test-grid/work-dir/agent/test-runs/20151104185430-ccl-1.9-r15767-f99-linux-arm/fasl/ql/dists/quicklisp/software/cl-charms-20151031-git/src/low-level/curses-grovel" "/home/testgrid/cl-test-grid/work-dir/agent/test-runs/20151104185430-ccl-1.9-r15767-f99-linux-arm/fasl/ql/dists/quicklisp/software/cl-charms-20151031-git/src/low-level/curses-grovel.c" Output was: /home/testgrid/cl-test-grid/work-dir/agent/test-runs/20151104185430-ccl-1.9-r15767-f99-linux-arm/fasl/ql/dists/quicklisp/software/cl-charms-20151031-git/src/low-level/curses-grovel.c:6:21: fatal error: ncurses.h: No such file or directory #include <ncurses.h> ^ compilation terminated.
(LOAD com.informatimago.editor FAIL) ffi-grovel, CFFI-GROVEL:GROVEL-ERROR : External process exited with code 1. Command was: "cc" "-marm" "-I/home/testgrid/cl-test-grid/work-dir/agent/quicklisp/dists/quicklisp/software/cffi_0.16.1/" "-o" "/home/testgrid/cl-test-grid/work-dir/agent/test-runs/20151104185430-ccl-1.9-r15767-f99-linux-arm/fasl/ql/dists/quicklisp/software/cl-charms-20151031-git/src/low-level/curses-grovel" "/home/testgrid/cl-test-grid/work-dir/agent/test-runs/20151104185430-ccl-1.9-r15767-f99-linux-arm/fasl/ql/dists/quicklisp/software/cl-charms-20151031-git/src/low-level/curses-grovel.c" Output was: /home/testgrid/cl-test-grid/work-dir/agent/test-runs/20151104185430-ccl-1.9-r15767-f99-linux-arm/fasl/ql/dists/quicklisp/software/cl-charms-20151031-git/src/low-level/curses-grovel.c:6:21: fatal error: ncurses.h: No such file or directory #include <ncurses.h> ^ compilation terminated.
clisp-2.49-unix-armv7l
(LOAD com.ogamita.swig.test FAIL) ASDF:LOAD-SYSTEM-DEFINITION-ERROR : Error while trying to load definition for system com.informatimago.common-lisp.cesarum from pathname /home/testgrid/cl-test-grid/work-dir/agent/quicklisp/dists/quicklisp/software/com.informatimago-quicklisp-b192e5b8-git/common-lisp/cesarum/com.informatimago.common-lisp.cesarum.asd: Closing '/' is missing Current point in control string: "System ~A: clisp should be used with -ansi or (setf custom:*ansi* t) in ~/.clisprc" |
(LOAD com.informatimago.xcode.test FAIL) ASDF:LOAD-SYSTEM-DEFINITION-ERROR : Error while trying to load definition for system com.informatimago.common-lisp.cesarum from pathname /home/testgrid/cl-test-grid/work-dir/agent/quicklisp/dists/quicklisp/software/com.informatimago-quicklisp-b192e5b8-git/common-lisp/cesarum/com.informatimago.common-lisp.cesarum.asd: Closing '/' is missing Current point in control string: "System ~A: clisp should be used with -ansi or (setf custom:*ansi* t) in ~/.clisprc" |
(LOAD com.informatimago.xcode FAIL) ASDF:LOAD-SYSTEM-DEFINITION-ERROR : Error while trying to load definition for system com.informatimago.common-lisp.cesarum from pathname /home/testgrid/cl-test-grid/work-dir/agent/quicklisp/dists/quicklisp/software/com.informatimago-quicklisp-b192e5b8-git/common-lisp/cesarum/com.informatimago.common-lisp.cesarum.asd: Closing '/' is missing Current point in control string: "System ~A: clisp should be used with -ansi or (setf custom:*ansi* t) in ~/.clisprc" |
(LOAD com.informatimago.tools.undefmethod.test FAIL) ASDF:LOAD-SYSTEM-DEFINITION-ERROR : Error while trying to load definition for system com.informatimago.common-lisp.cesarum from pathname /home/testgrid/cl-test-grid/work-dir/agent/quicklisp/dists/quicklisp/software/com.informatimago-quicklisp-b192e5b8-git/common-lisp/cesarum/com.informatimago.common-lisp.cesarum.asd: Closing '/' is missing Current point in control string: "System ~A: clisp should be used with -ansi or (setf custom:*ansi* t) in ~/.clisprc" |
(LOAD com.informatimago.tools.try-systems FAIL) ASDF:LOAD-SYSTEM-DEFINITION-ERROR : Error while trying to load definition for system bordeaux-threads from pathname /home/testgrid/cl-test-grid/work-dir/agent/quicklisp/dists/quicklisp/software/bordeaux-threads-v0.8.4-git/bordeaux-threads.asd: READ from #<INPUT BUFFERED FILE-STREAM CHARACTER #P"/home/testgrid/cl-test-grid/work-dir/agent/quicklisp/dists/quicklisp/software/bordeaux-threads-v0.8.4-git/bordeaux-threads.asd" @68>: there is no package with name "UIOP"
(LOAD com.informatimago.tools.thread FAIL) ASDF:LOAD-SYSTEM-DEFINITION-ERROR : Error while trying to load definition for system bordeaux-threads from pathname /home/testgrid/cl-test-grid/work-dir/agent/quicklisp/dists/quicklisp/software/bordeaux-threads-v0.8.4-git/bordeaux-threads.asd: READ from #<INPUT BUFFERED FILE-STREAM CHARACTER #P"/home/testgrid/cl-test-grid/work-dir/agent/quicklisp/dists/quicklisp/software/bordeaux-threads-v0.8.4-git/bordeaux-threads.asd" @68>: there is no package with name "UIOP"
(LOAD com.informatimago.tools.test FAIL) ASDF:LOAD-SYSTEM-DEFINITION-ERROR : Error while trying to load definition for system com.informatimago.common-lisp.cesarum from pathname /home/testgrid/cl-test-grid/work-dir/agent/quicklisp/dists/quicklisp/software/com.informatimago-quicklisp-b192e5b8-git/common-lisp/cesarum/com.informatimago.common-lisp.cesarum.asd: Closing '/' is missing Current point in control string: "System ~A: clisp should be used with -ansi or (setf custom:*ansi* t) in ~/.clisprc" |
(LOAD com.informatimago.tools.symbol.test FAIL) ASDF:LOAD-SYSTEM-DEFINITION-ERROR : Error while trying to load definition for system com.informatimago.common-lisp.cesarum from pathname /home/testgrid/cl-test-grid/work-dir/agent/quicklisp/dists/quicklisp/software/com.informatimago-quicklisp-b192e5b8-git/common-lisp/cesarum/com.informatimago.common-lisp.cesarum.asd: Closing '/' is missing Current point in control string: "System ~A: clisp should be used with -ansi or (setf custom:*ansi* t) in ~/.clisprc" |
(LOAD com.informatimago.tools.symbol FAIL) ASDF:LOAD-SYSTEM-DEFINITION-ERROR : Error while trying to load definition for system com.informatimago.common-lisp.cesarum from pathname /home/testgrid/cl-test-grid/work-dir/agent/quicklisp/dists/quicklisp/software/com.informatimago-quicklisp-b192e5b8-git/common-lisp/cesarum/com.informatimago.common-lisp.cesarum.asd: Closing '/' is missing Current point in control string: "System ~A: clisp should be used with -ansi or (setf custom:*ansi* t) in ~/.clisprc" |
(LOAD com.informatimago.tools.summary.test FAIL) ASDF:LOAD-SYSTEM-DEFINITION-ERROR : Error while trying to load definition for system bordeaux-threads from pathname /home/testgrid/cl-test-grid/work-dir/agent/quicklisp/dists/quicklisp/software/bordeaux-threads-v0.8.4-git/bordeaux-threads.asd: READ from #<INPUT BUFFERED FILE-STREAM CHARACTER #P"/home/testgrid/cl-test-grid/work-dir/agent/quicklisp/dists/quicklisp/software/bordeaux-threads-v0.8.4-git/bordeaux-threads.asd" @68>: there is no package with name "UIOP"
(LOAD com.informatimago.tools.summary FAIL) ASDF:LOAD-SYSTEM-DEFINITION-ERROR : Error while trying to load definition for system bordeaux-threads from pathname /home/testgrid/cl-test-grid/work-dir/agent/quicklisp/dists/quicklisp/software/bordeaux-threads-v0.8.4-git/bordeaux-threads.asd: READ from #<INPUT BUFFERED FILE-STREAM CHARACTER #P"/home/testgrid/cl-test-grid/work-dir/agent/quicklisp/dists/quicklisp/software/bordeaux-threads-v0.8.4-git/bordeaux-threads.asd" @68>: there is no package with name "UIOP"
(LOAD com.informatimago.tools.source.test FAIL) ASDF:LOAD-SYSTEM-DEFINITION-ERROR : Error while trying to load definition for system bordeaux-threads from pathname /home/testgrid/cl-test-grid/work-dir/agent/quicklisp/dists/quicklisp/software/bordeaux-threads-v0.8.4-git/bordeaux-threads.asd: READ from #<INPUT BUFFERED FILE-STREAM CHARACTER #P"/home/testgrid/cl-test-grid/work-dir/agent/quicklisp/dists/quicklisp/software/bordeaux-threads-v0.8.4-git/bordeaux-threads.asd" @68>: there is no package with name "UIOP"
(LOAD com.informatimago.tools.source FAIL) ASDF:LOAD-SYSTEM-DEFINITION-ERROR : Error while trying to load definition for system bordeaux-threads from pathname /home/testgrid/cl-test-grid/work-dir/agent/quicklisp/dists/quicklisp/software/bordeaux-threads-v0.8.4-git/bordeaux-threads.asd: READ from #<INPUT BUFFERED FILE-STREAM CHARACTER #P"/home/testgrid/cl-test-grid/work-dir/agent/quicklisp/dists/quicklisp/software/bordeaux-threads-v0.8.4-git/bordeaux-threads.asd" @68>: there is no package with name "UIOP"
(LOAD com.informatimago.tools.script.test FAIL) ASDF:LOAD-SYSTEM-DEFINITION-ERROR : Error while trying to load definition for system com.informatimago.common-lisp.cesarum from pathname /home/testgrid/cl-test-grid/work-dir/agent/quicklisp/dists/quicklisp/software/com.informatimago-quicklisp-b192e5b8-git/common-lisp/cesarum/com.informatimago.common-lisp.cesarum.asd: Closing '/' is missing Current point in control string: "System ~A: clisp should be used with -ansi or (setf custom:*ansi* t) in ~/.clisprc" |
(LOAD com.informatimago.tools.quicklisp.test FAIL) ASDF:LOAD-SYSTEM-DEFINITION-ERROR : Error while trying to load definition for system com.informatimago.common-lisp.cesarum from pathname /home/testgrid/cl-test-grid/work-dir/agent/quicklisp/dists/quicklisp/software/com.informatimago-quicklisp-b192e5b8-git/common-lisp/cesarum/com.informatimago.common-lisp.cesarum.asd: Closing '/' is missing Current point in control string: "System ~A: clisp should be used with -ansi or (setf custom:*ansi* t) in ~/.clisprc" |
(LOAD com.informatimago.tools.pathname.test FAIL) ASDF:LOAD-SYSTEM-DEFINITION-ERROR : Error while trying to load definition for system com.informatimago.common-lisp.cesarum from pathname /home/testgrid/cl-test-grid/work-dir/agent/quicklisp/dists/quicklisp/software/com.informatimago-quicklisp-b192e5b8-git/common-lisp/cesarum/com.informatimago.common-lisp.cesarum.asd: Closing '/' is missing Current point in control string: "System ~A: clisp should be used with -ansi or (setf custom:*ansi* t) in ~/.clisprc" |
(LOAD com.informatimago.tools.manifest.test FAIL) ASDF:LOAD-SYSTEM-DEFINITION-ERROR : Error while trying to load definition for system com.informatimago.common-lisp.cesarum from pathname /home/testgrid/cl-test-grid/work-dir/agent/quicklisp/dists/quicklisp/software/com.informatimago-quicklisp-b192e5b8-git/common-lisp/cesarum/com.informatimago.common-lisp.cesarum.asd: Closing '/' is missing Current point in control string: "System ~A: clisp should be used with -ansi or (setf custom:*ansi* t) in ~/.clisprc" |
(LOAD com.informatimago.tools.manifest FAIL) ASDF:LOAD-SYSTEM-DEFINITION-ERROR : Error while trying to load definition for system com.informatimago.common-lisp.cesarum from pathname /home/testgrid/cl-test-grid/work-dir/agent/quicklisp/dists/quicklisp/software/com.informatimago-quicklisp-b192e5b8-git/common-lisp/cesarum/com.informatimago.common-lisp.cesarum.asd: Closing '/' is missing Current point in control string: "System ~A: clisp should be used with -ansi or (setf custom:*ansi* t) in ~/.clisprc" |
(LOAD com.informatimago.tools.make-depends.test FAIL) ASDF:LOAD-SYSTEM-DEFINITION-ERROR : Error while trying to load definition for system bordeaux-threads from pathname /home/testgrid/cl-test-grid/work-dir/agent/quicklisp/dists/quicklisp/software/bordeaux-threads-v0.8.4-git/bordeaux-threads.asd: READ from #<INPUT BUFFERED FILE-STREAM CHARACTER #P"/home/testgrid/cl-test-grid/work-dir/agent/quicklisp/dists/quicklisp/software/bordeaux-threads-v0.8.4-git/bordeaux-threads.asd" @68>: there is no package with name "UIOP"
(LOAD com.informatimago.tools.make-depends FAIL) ASDF:LOAD-SYSTEM-DEFINITION-ERROR : Error while trying to load definition for system bordeaux-threads from pathname /home/testgrid/cl-test-grid/work-dir/agent/quicklisp/dists/quicklisp/software/bordeaux-threads-v0.8.4-git/bordeaux-threads.asd: READ from #<INPUT BUFFERED FILE-STREAM CHARACTER #P"/home/testgrid/cl-test-grid/work-dir/agent/quicklisp/dists/quicklisp/software/bordeaux-threads-v0.8.4-git/bordeaux-threads.asd" @68>: there is no package with name "UIOP"
(LOAD com.informatimago.tools.check-asdf.test FAIL) ASDF:LOAD-SYSTEM-DEFINITION-ERROR : Error while trying to load definition for system bordeaux-threads from pathname /home/testgrid/cl-test-grid/work-dir/agent/quicklisp/dists/quicklisp/software/bordeaux-threads-v0.8.4-git/bordeaux-threads.asd: READ from #<INPUT BUFFERED FILE-STREAM CHARACTER #P"/home/testgrid/cl-test-grid/work-dir/agent/quicklisp/dists/quicklisp/software/bordeaux-threads-v0.8.4-git/bordeaux-threads.asd" @68>: there is no package with name "UIOP"
(LOAD com.informatimago.tools.check-asdf FAIL) ASDF:LOAD-SYSTEM-DEFINITION-ERROR : Error while trying to load definition for system bordeaux-threads from pathname /home/testgrid/cl-test-grid/work-dir/agent/quicklisp/dists/quicklisp/software/bordeaux-threads-v0.8.4-git/bordeaux-threads.asd: READ from #<INPUT BUFFERED FILE-STREAM CHARACTER #P"/home/testgrid/cl-test-grid/work-dir/agent/quicklisp/dists/quicklisp/software/bordeaux-threads-v0.8.4-git/bordeaux-threads.asd" @68>: there is no package with name "UIOP"
(LOAD com.informatimago.tools FAIL) ASDF:LOAD-SYSTEM-DEFINITION-ERROR : Error while trying to load definition for system bordeaux-threads from pathname /home/testgrid/cl-test-grid/work-dir/agent/quicklisp/dists/quicklisp/software/bordeaux-threads-v0.8.4-git/bordeaux-threads.asd: READ from #<INPUT BUFFERED FILE-STREAM CHARACTER #P"/home/testgrid/cl-test-grid/work-dir/agent/quicklisp/dists/quicklisp/software/bordeaux-threads-v0.8.4-git/bordeaux-threads.asd" @68>: there is no package with name "UIOP"
(LOAD com.informatimago.test FAIL) ASDF:LOAD-SYSTEM-DEFINITION-ERROR : Error while trying to load definition for system com.informatimago.common-lisp.cesarum from pathname /home/testgrid/cl-test-grid/work-dir/agent/quicklisp/dists/quicklisp/software/com.informatimago-quicklisp-b192e5b8-git/common-lisp/cesarum/com.informatimago.common-lisp.cesarum.asd: Closing '/' is missing Current point in control string: "System ~A: clisp should be used with -ansi or (setf custom:*ansi* t) in ~/.clisprc" |
(LOAD com.informatimago.susv3.test FAIL) ASDF:LOAD-SYSTEM-DEFINITION-ERROR : Error while trying to load definition for system com.informatimago.common-lisp.cesarum from pathname /home/testgrid/cl-test-grid/work-dir/agent/quicklisp/dists/quicklisp/software/com.informatimago-quicklisp-b192e5b8-git/common-lisp/cesarum/com.informatimago.common-lisp.cesarum.asd: Closing '/' is missing Current point in control string: "System ~A: clisp should be used with -ansi or (setf custom:*ansi* t) in ~/.clisprc" |
(LOAD com.informatimago.susv3 FAIL) ASDF:LOAD-SYSTEM-DEFINITION-ERROR : Error while trying to load definition for system com.informatimago.common-lisp.cesarum from pathname /home/testgrid/cl-test-grid/work-dir/agent/quicklisp/dists/quicklisp/software/com.informatimago-quicklisp-b192e5b8-git/common-lisp/cesarum/com.informatimago.common-lisp.cesarum.asd: Closing '/' is missing Current point in control string: "System ~A: clisp should be used with -ansi or (setf custom:*ansi* t) in ~/.clisprc" |
(LOAD com.informatimago.small-cl-pgms.what-implementation.test FAIL) ASDF:LOAD-SYSTEM-DEFINITION-ERROR : Error while trying to load definition for system com.informatimago.common-lisp.cesarum from pathname /home/testgrid/cl-test-grid/work-dir/agent/quicklisp/dists/quicklisp/software/com.informatimago-quicklisp-b192e5b8-git/common-lisp/cesarum/com.informatimago.common-lisp.cesarum.asd: Closing '/' is missing Current point in control string: "System ~A: clisp should be used with -ansi or (setf custom:*ansi* t) in ~/.clisprc" |
(LOAD com.informatimago.small-cl-pgms.test FAIL) ASDF:LOAD-SYSTEM-DEFINITION-ERROR : Error while trying to load definition for system com.informatimago.common-lisp.cesarum from pathname /home/testgrid/cl-test-grid/work-dir/agent/quicklisp/dists/quicklisp/software/com.informatimago-quicklisp-b192e5b8-git/common-lisp/cesarum/com.informatimago.common-lisp.cesarum.asd: Closing '/' is missing Current point in control string: "System ~A: clisp should be used with -ansi or (setf custom:*ansi* t) in ~/.clisprc" |
(LOAD com.informatimago.small-cl-pgms.quine.test FAIL) ASDF:LOAD-SYSTEM-DEFINITION-ERROR : Error while trying to load definition for system com.informatimago.common-lisp.cesarum from pathname /home/testgrid/cl-test-grid/work-dir/agent/quicklisp/dists/quicklisp/software/com.informatimago-quicklisp-b192e5b8-git/common-lisp/cesarum/com.informatimago.common-lisp.cesarum.asd: Closing '/' is missing Current point in control string: "System ~A: clisp should be used with -ansi or (setf custom:*ansi* t) in ~/.clisprc" |
(LOAD com.informatimago.small-cl-pgms.life.test FAIL) ASDF:LOAD-SYSTEM-DEFINITION-ERROR : Error while trying to load definition for system com.informatimago.common-lisp.cesarum from pathname /home/testgrid/cl-test-grid/work-dir/agent/quicklisp/dists/quicklisp/software/com.informatimago-quicklisp-b192e5b8-git/common-lisp/cesarum/com.informatimago.common-lisp.cesarum.asd: Closing '/' is missing Current point in control string: "System ~A: clisp should be used with -ansi or (setf custom:*ansi* t) in ~/.clisprc" |
(LOAD com.informatimago.small-cl-pgms.brainfuck.test FAIL) ASDF:LOAD-SYSTEM-DEFINITION-ERROR : Error while trying to load definition for system com.informatimago.common-lisp.cesarum from pathname /home/testgrid/cl-test-grid/work-dir/agent/quicklisp/dists/quicklisp/software/com.informatimago-quicklisp-b192e5b8-git/common-lisp/cesarum/com.informatimago.common-lisp.cesarum.asd: Closing '/' is missing Current point in control string: "System ~A: clisp should be used with -ansi or (setf custom:*ansi* t) in ~/.clisprc" |
(LOAD com.informatimago.small-cl-pgms.botihn FAIL) ASDF:LOAD-SYSTEM-DEFINITION-ERROR : Error while trying to load definition for system drakma from pathname /home/testgrid/cl-test-grid/work-dir/agent/quicklisp/dists/quicklisp/software/drakma-2.0.2/drakma.asd: SYSTEM::%EXPAND-FORM: (LOAD-SYSTEM TEST-OP) should be a lambda expression
(LOAD com.informatimago.rdp.test FAIL) ASDF:LOAD-SYSTEM-DEFINITION-ERROR : Error while trying to load definition for system com.informatimago.common-lisp.cesarum from pathname /home/testgrid/cl-test-grid/work-dir/agent/quicklisp/dists/quicklisp/software/com.informatimago-quicklisp-b192e5b8-git/common-lisp/cesarum/com.informatimago.common-lisp.cesarum.asd: Closing '/' is missing Current point in control string: "System ~A: clisp should be used with -ansi or (setf custom:*ansi* t) in ~/.clisprc" |
(LOAD com.informatimago.rdp.example.test FAIL) ASDF:LOAD-SYSTEM-DEFINITION-ERROR : Error while trying to load definition for system com.informatimago.common-lisp.cesarum from pathname /home/testgrid/cl-test-grid/work-dir/agent/quicklisp/dists/quicklisp/software/com.informatimago-quicklisp-b192e5b8-git/common-lisp/cesarum/com.informatimago.common-lisp.cesarum.asd: Closing '/' is missing Current point in control string: "System ~A: clisp should be used with -ansi or (setf custom:*ansi* t) in ~/.clisprc" |
(LOAD com.informatimago.rdp.example FAIL) ASDF:LOAD-SYSTEM-DEFINITION-ERROR : Error while trying to load definition for system com.informatimago.common-lisp.cesarum from pathname /home/testgrid/cl-test-grid/work-dir/agent/quicklisp/dists/quicklisp/software/com.informatimago-quicklisp-b192e5b8-git/common-lisp/cesarum/com.informatimago.common-lisp.cesarum.asd: Closing '/' is missing Current point in control string: "System ~A: clisp should be used with -ansi or (setf custom:*ansi* t) in ~/.clisprc" |
(LOAD com.informatimago.rdp.basic.test FAIL) ASDF:LOAD-SYSTEM-DEFINITION-ERROR : Error while trying to load definition for system com.informatimago.common-lisp.cesarum from pathname /home/testgrid/cl-test-grid/work-dir/agent/quicklisp/dists/quicklisp/software/com.informatimago-quicklisp-b192e5b8-git/common-lisp/cesarum/com.informatimago.common-lisp.cesarum.asd: Closing '/' is missing Current point in control string: "System ~A: clisp should be used with -ansi or (setf custom:*ansi* t) in ~/.clisprc" |
(LOAD com.informatimago.rdp.basic.example.test FAIL) ASDF:LOAD-SYSTEM-DEFINITION-ERROR : Error while trying to load definition for system com.informatimago.common-lisp.cesarum from pathname /home/testgrid/cl-test-grid/work-dir/agent/quicklisp/dists/quicklisp/software/com.informatimago-quicklisp-b192e5b8-git/common-lisp/cesarum/com.informatimago.common-lisp.cesarum.asd: Closing '/' is missing Current point in control string: "System ~A: clisp should be used with -ansi or (setf custom:*ansi* t) in ~/.clisprc" |
(LOAD com.informatimago.rdp.basic.example FAIL) ASDF:LOAD-SYSTEM-DEFINITION-ERROR : Error while trying to load definition for system com.informatimago.common-lisp.cesarum from pathname /home/testgrid/cl-test-grid/work-dir/agent/quicklisp/dists/quicklisp/software/com.informatimago-quicklisp-b192e5b8-git/common-lisp/cesarum/com.informatimago.common-lisp.cesarum.asd: Closing '/' is missing Current point in control string: "System ~A: clisp should be used with -ansi or (setf custom:*ansi* t) in ~/.clisprc" |
(LOAD com.informatimago.rdp.basic FAIL) ASDF:LOAD-SYSTEM-DEFINITION-ERROR : Error while trying to load definition for system com.informatimago.common-lisp.cesarum from pathname /home/testgrid/cl-test-grid/work-dir/agent/quicklisp/dists/quicklisp/software/com.informatimago-quicklisp-b192e5b8-git/common-lisp/cesarum/com.informatimago.common-lisp.cesarum.asd: Closing '/' is missing Current point in control string: "System ~A: clisp should be used with -ansi or (setf custom:*ansi* t) in ~/.clisprc" |
(LOAD com.informatimago.rdp FAIL) ASDF:LOAD-SYSTEM-DEFINITION-ERROR : Error while trying to load definition for system com.informatimago.common-lisp.cesarum from pathname /home/testgrid/cl-test-grid/work-dir/agent/quicklisp/dists/quicklisp/software/com.informatimago-quicklisp-b192e5b8-git/common-lisp/cesarum/com.informatimago.common-lisp.cesarum.asd: Closing '/' is missing Current point in control string: "System ~A: clisp should be used with -ansi or (setf custom:*ansi* t) in ~/.clisprc" |
(LOAD com.informatimago.objcl.test FAIL) ASDF:LOAD-SYSTEM-DEFINITION-ERROR : Error while trying to load definition for system com.informatimago.common-lisp.cesarum from pathname /home/testgrid/cl-test-grid/work-dir/agent/quicklisp/dists/quicklisp/software/com.informatimago-quicklisp-b192e5b8-git/common-lisp/cesarum/com.informatimago.common-lisp.cesarum.asd: Closing '/' is missing Current point in control string: "System ~A: clisp should be used with -ansi or (setf custom:*ansi* t) in ~/.clisprc" |
(LOAD com.informatimago.objcl FAIL) ASDF:LOAD-SYSTEM-DEFINITION-ERROR : Error while trying to load definition for system com.informatimago.common-lisp.cesarum from pathname /home/testgrid/cl-test-grid/work-dir/agent/quicklisp/dists/quicklisp/software/com.informatimago-quicklisp-b192e5b8-git/common-lisp/cesarum/com.informatimago.common-lisp.cesarum.asd: Closing '/' is missing Current point in control string: "System ~A: clisp should be used with -ansi or (setf custom:*ansi* t) in ~/.clisprc" |
(LOAD com.informatimago.lispdoc.test FAIL) ASDF:LOAD-SYSTEM-DEFINITION-ERROR : Error while trying to load definition for system com.informatimago.common-lisp.cesarum from pathname /home/testgrid/cl-test-grid/work-dir/agent/quicklisp/dists/quicklisp/software/com.informatimago-quicklisp-b192e5b8-git/common-lisp/cesarum/com.informatimago.common-lisp.cesarum.asd: Closing '/' is missing Current point in control string: "System ~A: clisp should be used with -ansi or (setf custom:*ansi* t) in ~/.clisprc" |
(LOAD com.informatimago.lispdoc FAIL) ASDF:LOAD-SYSTEM-DEFINITION-ERROR : Error while trying to load definition for system com.informatimago.common-lisp.cesarum from pathname /home/testgrid/cl-test-grid/work-dir/agent/quicklisp/dists/quicklisp/software/com.informatimago-quicklisp-b192e5b8-git/common-lisp/cesarum/com.informatimago.common-lisp.cesarum.asd: Closing '/' is missing Current point in control string: "System ~A: clisp should be used with -ansi or (setf custom:*ansi* t) in ~/.clisprc" |
(LOAD com.informatimago.languages.lua.test FAIL) ASDF:LOAD-SYSTEM-DEFINITION-ERROR : Error while trying to load definition for system com.informatimago.common-lisp.cesarum from pathname /home/testgrid/cl-test-grid/work-dir/agent/quicklisp/dists/quicklisp/software/com.informatimago-quicklisp-b192e5b8-git/common-lisp/cesarum/com.informatimago.common-lisp.cesarum.asd: Closing '/' is missing Current point in control string: "System ~A: clisp should be used with -ansi or (setf custom:*ansi* t) in ~/.clisprc" |
(LOAD com.informatimago.languages.lua FAIL) ASDF:LOAD-SYSTEM-DEFINITION-ERROR : Error while trying to load definition for system com.informatimago.common-lisp.cesarum from pathname /home/testgrid/cl-test-grid/work-dir/agent/quicklisp/dists/quicklisp/software/com.informatimago-quicklisp-b192e5b8-git/common-lisp/cesarum/com.informatimago.common-lisp.cesarum.asd: Closing '/' is missing Current point in control string: "System ~A: clisp should be used with -ansi or (setf custom:*ansi* t) in ~/.clisprc" |
(LOAD com.informatimago.languages.linc.test FAIL) ASDF:LOAD-SYSTEM-DEFINITION-ERROR : Error while trying to load definition for system com.informatimago.common-lisp.cesarum from pathname /home/testgrid/cl-test-grid/work-dir/agent/quicklisp/dists/quicklisp/software/com.informatimago-quicklisp-b192e5b8-git/common-lisp/cesarum/com.informatimago.common-lisp.cesarum.asd: Closing '/' is missing Current point in control string: "System ~A: clisp should be used with -ansi or (setf custom:*ansi* t) in ~/.clisprc" |
(LOAD com.informatimago.languages.linc FAIL) ASDF:LOAD-SYSTEM-DEFINITION-ERROR : Error while trying to load definition for system com.informatimago.common-lisp.cesarum from pathname /home/testgrid/cl-test-grid/work-dir/agent/quicklisp/dists/quicklisp/software/com.informatimago-quicklisp-b192e5b8-git/common-lisp/cesarum/com.informatimago.common-lisp.cesarum.asd: Closing '/' is missing Current point in control string: "System ~A: clisp should be used with -ansi or (setf custom:*ansi* t) in ~/.clisprc" |
(LOAD com.informatimago.languages.cxx.test FAIL) ASDF:LOAD-SYSTEM-DEFINITION-ERROR : Error while trying to load definition for system com.informatimago.common-lisp.cesarum from pathname /home/testgrid/cl-test-grid/work-dir/agent/quicklisp/dists/quicklisp/software/com.informatimago-quicklisp-b192e5b8-git/common-lisp/cesarum/com.informatimago.common-lisp.cesarum.asd: Closing '/' is missing Current point in control string: "System ~A: clisp should be used with -ansi or (setf custom:*ansi* t) in ~/.clisprc" |
(LOAD com.informatimago.languages.cxx FAIL) ASDF:LOAD-SYSTEM-DEFINITION-ERROR : Error while trying to load definition for system com.informatimago.common-lisp.cesarum from pathname /home/testgrid/cl-test-grid/work-dir/agent/quicklisp/dists/quicklisp/software/com.informatimago-quicklisp-b192e5b8-git/common-lisp/cesarum/com.informatimago.common-lisp.cesarum.asd: Closing '/' is missing Current point in control string: "System ~A: clisp should be used with -ansi or (setf custom:*ansi* t) in ~/.clisprc" |
(LOAD com.informatimago.languages.cpp.test FAIL) ASDF:LOAD-SYSTEM-DEFINITION-ERROR : Error while trying to load definition for system com.informatimago.common-lisp.cesarum from pathname /home/testgrid/cl-test-grid/work-dir/agent/quicklisp/dists/quicklisp/software/com.informatimago-quicklisp-b192e5b8-git/common-lisp/cesarum/com.informatimago.common-lisp.cesarum.asd: Closing '/' is missing Current point in control string: "System ~A: clisp should be used with -ansi or (setf custom:*ansi* t) in ~/.clisprc" |
(LOAD com.informatimago.languages.cpp FAIL) ASDF:LOAD-SYSTEM-DEFINITION-ERROR : Error while trying to load definition for system com.informatimago.common-lisp.cesarum from pathname /home/testgrid/cl-test-grid/work-dir/agent/quicklisp/dists/quicklisp/software/com.informatimago-quicklisp-b192e5b8-git/common-lisp/cesarum/com.informatimago.common-lisp.cesarum.asd: Closing '/' is missing Current point in control string: "System ~A: clisp should be used with -ansi or (setf custom:*ansi* t) in ~/.clisprc" |
(LOAD com.informatimago.languages.c11 FAIL) ASDF:LOAD-SYSTEM-DEFINITION-ERROR : Error while trying to load definition for system com.informatimago.common-lisp.cesarum from pathname /home/testgrid/cl-test-grid/work-dir/agent/quicklisp/dists/quicklisp/software/com.informatimago-quicklisp-b192e5b8-git/common-lisp/cesarum/com.informatimago.common-lisp.cesarum.asd: Closing '/' is missing Current point in control string: "System ~A: clisp should be used with -ansi or (setf custom:*ansi* t) in ~/.clisprc" |
(LOAD com.informatimago.languages FAIL) ASDF:LOAD-SYSTEM-DEFINITION-ERROR : Error while trying to load definition for system com.informatimago.common-lisp.cesarum from pathname /home/testgrid/cl-test-grid/work-dir/agent/quicklisp/dists/quicklisp/software/com.informatimago-quicklisp-b192e5b8-git/common-lisp/cesarum/com.informatimago.common-lisp.cesarum.asd: Closing '/' is missing Current point in control string: "System ~A: clisp should be used with -ansi or (setf custom:*ansi* t) in ~/.clisprc" |
(LOAD com.informatimago.future.test FAIL) ASDF:LOAD-SYSTEM-DEFINITION-ERROR : Error while trying to load definition for system com.informatimago.common-lisp.cesarum from pathname /home/testgrid/cl-test-grid/work-dir/agent/quicklisp/dists/quicklisp/software/com.informatimago-quicklisp-b192e5b8-git/common-lisp/cesarum/com.informatimago.common-lisp.cesarum.asd: Closing '/' is missing Current point in control string: "System ~A: clisp should be used with -ansi or (setf custom:*ansi* t) in ~/.clisprc" |
(LOAD com.informatimago.future.empty.test FAIL) ASDF:LOAD-SYSTEM-DEFINITION-ERROR : Error while trying to load definition for system com.informatimago.common-lisp.cesarum from pathname /home/testgrid/cl-test-grid/work-dir/agent/quicklisp/dists/quicklisp/software/com.informatimago-quicklisp-b192e5b8-git/common-lisp/cesarum/com.informatimago.common-lisp.cesarum.asd: Closing '/' is missing Current point in control string: "System ~A: clisp should be used with -ansi or (setf custom:*ansi* t) in ~/.clisprc" |
(LOAD com.informatimago.editor.test FAIL) ASDF:LOAD-SYSTEM-DEFINITION-ERROR : Error while trying to load definition for system com.informatimago.common-lisp.cesarum from pathname /home/testgrid/cl-test-grid/work-dir/agent/quicklisp/dists/quicklisp/software/com.informatimago-quicklisp-b192e5b8-git/common-lisp/cesarum/com.informatimago.common-lisp.cesarum.asd: Closing '/' is missing Current point in control string: "System ~A: clisp should be used with -ansi or (setf custom:*ansi* t) in ~/.clisprc" |
(LOAD com.informatimago.editor FAIL) ASDF:LOAD-SYSTEM-DEFINITION-ERROR : Error while trying to load definition for system com.informatimago.common-lisp.cesarum from pathname /home/testgrid/cl-test-grid/work-dir/agent/quicklisp/dists/quicklisp/software/com.informatimago-quicklisp-b192e5b8-git/common-lisp/cesarum/com.informatimago.common-lisp.cesarum.asd: Closing '/' is missing Current point in control string: "System ~A: clisp should be used with -ansi or (setf custom:*ansi* t) in ~/.clisprc" |
(LOAD com.informatimago.common-lisp.virtual-file-system FAIL) ASDF:LOAD-SYSTEM-DEFINITION-ERROR : Error while trying to load definition for system com.informatimago.common-lisp.cesarum from pathname /home/testgrid/cl-test-grid/work-dir/agent/quicklisp/dists/quicklisp/software/com.informatimago-quicklisp-b192e5b8-git/common-lisp/cesarum/com.informatimago.common-lisp.cesarum.asd: Closing '/' is missing Current point in control string: "System ~A: clisp should be used with -ansi or (setf custom:*ansi* t) in ~/.clisprc" |
(LOAD com.informatimago.common-lisp.unix.test FAIL) ASDF:LOAD-SYSTEM-DEFINITION-ERROR : Error while trying to load definition for system com.informatimago.common-lisp.cesarum from pathname /home/testgrid/cl-test-grid/work-dir/agent/quicklisp/dists/quicklisp/software/com.informatimago-quicklisp-b192e5b8-git/common-lisp/cesarum/com.informatimago.common-lisp.cesarum.asd: Closing '/' is missing Current point in control string: "System ~A: clisp should be used with -ansi or (setf custom:*ansi* t) in ~/.clisprc" |
(LOAD com.informatimago.common-lisp.unix FAIL) ASDF:LOAD-SYSTEM-DEFINITION-ERROR : Error while trying to load definition for system com.informatimago.common-lisp.cesarum from pathname /home/testgrid/cl-test-grid/work-dir/agent/quicklisp/dists/quicklisp/software/com.informatimago-quicklisp-b192e5b8-git/common-lisp/cesarum/com.informatimago.common-lisp.cesarum.asd: Closing '/' is missing Current point in control string: "System ~A: clisp should be used with -ansi or (setf custom:*ansi* t) in ~/.clisprc" |
(LOAD com.informatimago.common-lisp.test FAIL) ASDF:LOAD-SYSTEM-DEFINITION-ERROR : Error while trying to load definition for system com.informatimago.common-lisp.cesarum from pathname /home/testgrid/cl-test-grid/work-dir/agent/quicklisp/dists/quicklisp/software/com.informatimago-quicklisp-b192e5b8-git/common-lisp/cesarum/com.informatimago.common-lisp.cesarum.asd: Closing '/' is missing Current point in control string: "System ~A: clisp should be used with -ansi or (setf custom:*ansi* t) in ~/.clisprc" |
(LOAD com.informatimago.common-lisp.telnet.test FAIL) ASDF:LOAD-SYSTEM-DEFINITION-ERROR : Error while trying to load definition for system com.informatimago.common-lisp.cesarum from pathname /home/testgrid/cl-test-grid/work-dir/agent/quicklisp/dists/quicklisp/software/com.informatimago-quicklisp-b192e5b8-git/common-lisp/cesarum/com.informatimago.common-lisp.cesarum.asd: Closing '/' is missing Current point in control string: "System ~A: clisp should be used with -ansi or (setf custom:*ansi* t) in ~/.clisprc" |
(LOAD com.informatimago.common-lisp.telnet FAIL) ASDF:LOAD-SYSTEM-DEFINITION-ERROR : Error while trying to load definition for system com.informatimago.common-lisp.cesarum from pathname /home/testgrid/cl-test-grid/work-dir/agent/quicklisp/dists/quicklisp/software/com.informatimago-quicklisp-b192e5b8-git/common-lisp/cesarum/com.informatimago.common-lisp.cesarum.asd: Closing '/' is missing Current point in control string: "System ~A: clisp should be used with -ansi or (setf custom:*ansi* t) in ~/.clisprc" |
(LOAD com.informatimago.common-lisp.scanner.test FAIL) ASDF:LOAD-SYSTEM-DEFINITION-ERROR : Error while trying to load definition for system com.informatimago.common-lisp.cesarum from pathname /home/testgrid/cl-test-grid/work-dir/agent/quicklisp/dists/quicklisp/software/com.informatimago-quicklisp-b192e5b8-git/common-lisp/cesarum/com.informatimago.common-lisp.cesarum.asd: Closing '/' is missing Current point in control string: "System ~A: clisp should be used with -ansi or (setf custom:*ansi* t) in ~/.clisprc" |
(LOAD com.informatimago.common-lisp.scanner FAIL) ASDF:LOAD-SYSTEM-DEFINITION-ERROR : Error while trying to load definition for system com.informatimago.common-lisp.cesarum from pathname /home/testgrid/cl-test-grid/work-dir/agent/quicklisp/dists/quicklisp/software/com.informatimago-quicklisp-b192e5b8-git/common-lisp/cesarum/com.informatimago.common-lisp.cesarum.asd: Closing '/' is missing Current point in control string: "System ~A: clisp should be used with -ansi or (setf custom:*ansi* t) in ~/.clisprc" |
(LOAD com.informatimago.common-lisp.rfc3548.test FAIL) ASDF:LOAD-SYSTEM-DEFINITION-ERROR : Error while trying to load definition for system com.informatimago.common-lisp.cesarum from pathname /home/testgrid/cl-test-grid/work-dir/agent/quicklisp/dists/quicklisp/software/com.informatimago-quicklisp-b192e5b8-git/common-lisp/cesarum/com.informatimago.common-lisp.cesarum.asd: Closing '/' is missing Current point in control string: "System ~A: clisp should be used with -ansi or (setf custom:*ansi* t) in ~/.clisprc" |
(LOAD com.informatimago.common-lisp.rfc3548 FAIL) ASDF:LOAD-SYSTEM-DEFINITION-ERROR : Error while trying to load definition for system com.informatimago.common-lisp.cesarum from pathname /home/testgrid/cl-test-grid/work-dir/agent/quicklisp/dists/quicklisp/software/com.informatimago-quicklisp-b192e5b8-git/common-lisp/cesarum/com.informatimago.common-lisp.cesarum.asd: Closing '/' is missing Current point in control string: "System ~A: clisp should be used with -ansi or (setf custom:*ansi* t) in ~/.clisprc" |
(LOAD com.informatimago.common-lisp.rfc2822.test FAIL) ASDF:LOAD-SYSTEM-DEFINITION-ERROR : Error while trying to load definition for system com.informatimago.common-lisp.cesarum from pathname /home/testgrid/cl-test-grid/work-dir/agent/quicklisp/dists/quicklisp/software/com.informatimago-quicklisp-b192e5b8-git/common-lisp/cesarum/com.informatimago.common-lisp.cesarum.asd: Closing '/' is missing Current point in control string: "System ~A: clisp should be used with -ansi or (setf custom:*ansi* t) in ~/.clisprc" |
(LOAD com.informatimago.common-lisp.rfc2822 FAIL) ASDF:LOAD-SYSTEM-DEFINITION-ERROR : Error while trying to load definition for system com.informatimago.common-lisp.cesarum from pathname /home/testgrid/cl-test-grid/work-dir/agent/quicklisp/dists/quicklisp/software/com.informatimago-quicklisp-b192e5b8-git/common-lisp/cesarum/com.informatimago.common-lisp.cesarum.asd: Closing '/' is missing Current point in control string: "System ~A: clisp should be used with -ansi or (setf custom:*ansi* t) in ~/.clisprc" |
(LOAD com.informatimago.common-lisp.regexp.test FAIL) ASDF:LOAD-SYSTEM-DEFINITION-ERROR : Error while trying to load definition for system com.informatimago.common-lisp.cesarum from pathname /home/testgrid/cl-test-grid/work-dir/agent/quicklisp/dists/quicklisp/software/com.informatimago-quicklisp-b192e5b8-git/common-lisp/cesarum/com.informatimago.common-lisp.cesarum.asd: Closing '/' is missing Current point in control string: "System ~A: clisp should be used with -ansi or (setf custom:*ansi* t) in ~/.clisprc" |
(LOAD com.informatimago.common-lisp.regexp FAIL) ASDF:LOAD-SYSTEM-DEFINITION-ERROR : Error while trying to load definition for system com.informatimago.common-lisp.cesarum from pathname /home/testgrid/cl-test-grid/work-dir/agent/quicklisp/dists/quicklisp/software/com.informatimago-quicklisp-b192e5b8-git/common-lisp/cesarum/com.informatimago.common-lisp.cesarum.asd: Closing '/' is missing Current point in control string: "System ~A: clisp should be used with -ansi or (setf custom:*ansi* t) in ~/.clisprc" |
(LOAD com.informatimago.common-lisp.picture.test FAIL) ASDF:LOAD-SYSTEM-DEFINITION-ERROR : Error while trying to load definition for system com.informatimago.common-lisp.cesarum from pathname /home/testgrid/cl-test-grid/work-dir/agent/quicklisp/dists/quicklisp/software/com.informatimago-quicklisp-b192e5b8-git/common-lisp/cesarum/com.informatimago.common-lisp.cesarum.asd: Closing '/' is missing Current point in control string: "System ~A: clisp should be used with -ansi or (setf custom:*ansi* t) in ~/.clisprc" |
(LOAD com.informatimago.common-lisp.picture FAIL) ASDF:LOAD-SYSTEM-DEFINITION-ERROR : Error while trying to load definition for system com.informatimago.common-lisp.cesarum from pathname /home/testgrid/cl-test-grid/work-dir/agent/quicklisp/dists/quicklisp/software/com.informatimago-quicklisp-b192e5b8-git/common-lisp/cesarum/com.informatimago.common-lisp.cesarum.asd: Closing '/' is missing Current point in control string: "System ~A: clisp should be used with -ansi or (setf custom:*ansi* t) in ~/.clisprc" |
(LOAD com.informatimago.common-lisp.parser.test FAIL) ASDF:LOAD-SYSTEM-DEFINITION-ERROR : Error while trying to load definition for system com.informatimago.common-lisp.cesarum from pathname /home/testgrid/cl-test-grid/work-dir/agent/quicklisp/dists/quicklisp/software/com.informatimago-quicklisp-b192e5b8-git/common-lisp/cesarum/com.informatimago.common-lisp.cesarum.asd: Closing '/' is missing Current point in control string: "System ~A: clisp should be used with -ansi or (setf custom:*ansi* t) in ~/.clisprc" |
(LOAD com.informatimago.common-lisp.parser FAIL) ASDF:LOAD-SYSTEM-DEFINITION-ERROR : Error while trying to load definition for system com.informatimago.common-lisp.cesarum from pathname /home/testgrid/cl-test-grid/work-dir/agent/quicklisp/dists/quicklisp/software/com.informatimago-quicklisp-b192e5b8-git/common-lisp/cesarum/com.informatimago.common-lisp.cesarum.asd: Closing '/' is missing Current point in control string: "System ~A: clisp should be used with -ansi or (setf custom:*ansi* t) in ~/.clisprc" |
(LOAD com.informatimago.common-lisp.lisp.test FAIL) ASDF:LOAD-SYSTEM-DEFINITION-ERROR : Error while trying to load definition for system com.informatimago.common-lisp.cesarum from pathname /home/testgrid/cl-test-grid/work-dir/agent/quicklisp/dists/quicklisp/software/com.informatimago-quicklisp-b192e5b8-git/common-lisp/cesarum/com.informatimago.common-lisp.cesarum.asd: Closing '/' is missing Current point in control string: "System ~A: clisp should be used with -ansi or (setf custom:*ansi* t) in ~/.clisprc" |
(LOAD com.informatimago.common-lisp.lisp.stepper.test FAIL) ASDF:LOAD-SYSTEM-DEFINITION-ERROR : Error while trying to load definition for system com.informatimago.common-lisp.cesarum from pathname /home/testgrid/cl-test-grid/work-dir/agent/quicklisp/dists/quicklisp/software/com.informatimago-quicklisp-b192e5b8-git/common-lisp/cesarum/com.informatimago.common-lisp.cesarum.asd: Closing '/' is missing Current point in control string: "System ~A: clisp should be used with -ansi or (setf custom:*ansi* t) in ~/.clisprc" |
(LOAD com.informatimago.common-lisp.lisp.stepper FAIL) ASDF:LOAD-SYSTEM-DEFINITION-ERROR : Error while trying to load definition for system com.informatimago.common-lisp.cesarum from pathname /home/testgrid/cl-test-grid/work-dir/agent/quicklisp/dists/quicklisp/software/com.informatimago-quicklisp-b192e5b8-git/common-lisp/cesarum/com.informatimago.common-lisp.cesarum.asd: Closing '/' is missing Current point in control string: "System ~A: clisp should be used with -ansi or (setf custom:*ansi* t) in ~/.clisprc" |
(LOAD com.informatimago.common-lisp.lisp.ibcl.test FAIL) ASDF:LOAD-SYSTEM-DEFINITION-ERROR : Error while trying to load definition for system com.informatimago.common-lisp.cesarum from pathname /home/testgrid/cl-test-grid/work-dir/agent/quicklisp/dists/quicklisp/software/com.informatimago-quicklisp-b192e5b8-git/common-lisp/cesarum/com.informatimago.common-lisp.cesarum.asd: Closing '/' is missing Current point in control string: "System ~A: clisp should be used with -ansi or (setf custom:*ansi* t) in ~/.clisprc" |
(LOAD com.informatimago.common-lisp.lisp-text.test FAIL) ASDF:LOAD-SYSTEM-DEFINITION-ERROR : Error while trying to load definition for system com.informatimago.common-lisp.cesarum from pathname /home/testgrid/cl-test-grid/work-dir/agent/quicklisp/dists/quicklisp/software/com.informatimago-quicklisp-b192e5b8-git/common-lisp/cesarum/com.informatimago.common-lisp.cesarum.asd: Closing '/' is missing Current point in control string: "System ~A: clisp should be used with -ansi or (setf custom:*ansi* t) in ~/.clisprc" |
(LOAD com.informatimago.common-lisp.lisp-sexp.test FAIL) ASDF:LOAD-SYSTEM-DEFINITION-ERROR : Error while trying to load definition for system com.informatimago.common-lisp.cesarum from pathname /home/testgrid/cl-test-grid/work-dir/agent/quicklisp/dists/quicklisp/software/com.informatimago-quicklisp-b192e5b8-git/common-lisp/cesarum/com.informatimago.common-lisp.cesarum.asd: Closing '/' is missing Current point in control string: "System ~A: clisp should be used with -ansi or (setf custom:*ansi* t) in ~/.clisprc" |
(LOAD com.informatimago.common-lisp.lisp-reader.test FAIL) ASDF:LOAD-SYSTEM-DEFINITION-ERROR : Error while trying to load definition for system com.informatimago.common-lisp.cesarum from pathname /home/testgrid/cl-test-grid/work-dir/agent/quicklisp/dists/quicklisp/software/com.informatimago-quicklisp-b192e5b8-git/common-lisp/cesarum/com.informatimago.common-lisp.cesarum.asd: Closing '/' is missing Current point in control string: "System ~A: clisp should be used with -ansi or (setf custom:*ansi* t) in ~/.clisprc" |
(LOAD com.informatimago.common-lisp.lisp FAIL) ASDF:LOAD-SYSTEM-DEFINITION-ERROR : Error while trying to load definition for system com.informatimago.common-lisp.cesarum from pathname /home/testgrid/cl-test-grid/work-dir/agent/quicklisp/dists/quicklisp/software/com.informatimago-quicklisp-b192e5b8-git/common-lisp/cesarum/com.informatimago.common-lisp.cesarum.asd: Closing '/' is missing Current point in control string: "System ~A: clisp should be used with -ansi or (setf custom:*ansi* t) in ~/.clisprc" |
(LOAD com.informatimago.common-lisp.invoice.test FAIL) ASDF:LOAD-SYSTEM-DEFINITION-ERROR : Error while trying to load definition for system com.informatimago.common-lisp.cesarum from pathname /home/testgrid/cl-test-grid/work-dir/agent/quicklisp/dists/quicklisp/software/com.informatimago-quicklisp-b192e5b8-git/common-lisp/cesarum/com.informatimago.common-lisp.cesarum.asd: Closing '/' is missing Current point in control string: "System ~A: clisp should be used with -ansi or (setf custom:*ansi* t) in ~/.clisprc" |
(LOAD com.informatimago.common-lisp.invoice FAIL) ASDF:LOAD-SYSTEM-DEFINITION-ERROR : Error while trying to load definition for system com.informatimago.common-lisp.cesarum from pathname /home/testgrid/cl-test-grid/work-dir/agent/quicklisp/dists/quicklisp/software/com.informatimago-quicklisp-b192e5b8-git/common-lisp/cesarum/com.informatimago.common-lisp.cesarum.asd: Closing '/' is missing Current point in control string: "System ~A: clisp should be used with -ansi or (setf custom:*ansi* t) in ~/.clisprc" |
(LOAD com.informatimago.common-lisp.interactive.test FAIL) ASDF:LOAD-SYSTEM-DEFINITION-ERROR : Error while trying to load definition for system com.informatimago.common-lisp.cesarum from pathname /home/testgrid/cl-test-grid/work-dir/agent/quicklisp/dists/quicklisp/software/com.informatimago-quicklisp-b192e5b8-git/common-lisp/cesarum/com.informatimago.common-lisp.cesarum.asd: Closing '/' is missing Current point in control string: "System ~A: clisp should be used with -ansi or (setf custom:*ansi* t) in ~/.clisprc" |
(LOAD com.informatimago.common-lisp.interactive FAIL) ASDF:LOAD-SYSTEM-DEFINITION-ERROR : Error while trying to load definition for system com.informatimago.common-lisp.cesarum from pathname /home/testgrid/cl-test-grid/work-dir/agent/quicklisp/dists/quicklisp/software/com.informatimago-quicklisp-b192e5b8-git/common-lisp/cesarum/com.informatimago.common-lisp.cesarum.asd: Closing '/' is missing Current point in control string: "System ~A: clisp should be used with -ansi or (setf custom:*ansi* t) in ~/.clisprc" |
(LOAD com.informatimago.common-lisp.http.test FAIL) ASDF:LOAD-SYSTEM-DEFINITION-ERROR : Error while trying to load definition for system com.informatimago.common-lisp.cesarum from pathname /home/testgrid/cl-test-grid/work-dir/agent/quicklisp/dists/quicklisp/software/com.informatimago-quicklisp-b192e5b8-git/common-lisp/cesarum/com.informatimago.common-lisp.cesarum.asd: Closing '/' is missing Current point in control string: "System ~A: clisp should be used with -ansi or (setf custom:*ansi* t) in ~/.clisprc" |
(LOAD com.informatimago.common-lisp.http FAIL) ASDF:LOAD-SYSTEM-DEFINITION-ERROR : Error while trying to load definition for system com.informatimago.common-lisp.cesarum from pathname /home/testgrid/cl-test-grid/work-dir/agent/quicklisp/dists/quicklisp/software/com.informatimago-quicklisp-b192e5b8-git/common-lisp/cesarum/com.informatimago.common-lisp.cesarum.asd: Closing '/' is missing Current point in control string: "System ~A: clisp should be used with -ansi or (setf custom:*ansi* t) in ~/.clisprc" |
(LOAD com.informatimago.common-lisp.html-parser.test FAIL) ASDF:LOAD-SYSTEM-DEFINITION-ERROR : Error while trying to load definition for system com.informatimago.common-lisp.cesarum from pathname /home/testgrid/cl-test-grid/work-dir/agent/quicklisp/dists/quicklisp/software/com.informatimago-quicklisp-b192e5b8-git/common-lisp/cesarum/com.informatimago.common-lisp.cesarum.asd: Closing '/' is missing Current point in control string: "System ~A: clisp should be used with -ansi or (setf custom:*ansi* t) in ~/.clisprc" |
(LOAD com.informatimago.common-lisp.html-parser FAIL) ASDF:LOAD-SYSTEM-DEFINITION-ERROR : Error while trying to load definition for system com.informatimago.common-lisp.cesarum from pathname /home/testgrid/cl-test-grid/work-dir/agent/quicklisp/dists/quicklisp/software/com.informatimago-quicklisp-b192e5b8-git/common-lisp/cesarum/com.informatimago.common-lisp.cesarum.asd: Closing '/' is missing Current point in control string: "System ~A: clisp should be used with -ansi or (setf custom:*ansi* t) in ~/.clisprc" |
(LOAD com.informatimago.common-lisp.html-generator.test FAIL) ASDF:LOAD-SYSTEM-DEFINITION-ERROR : Error while trying to load definition for system com.informatimago.common-lisp.cesarum from pathname /home/testgrid/cl-test-grid/work-dir/agent/quicklisp/dists/quicklisp/software/com.informatimago-quicklisp-b192e5b8-git/common-lisp/cesarum/com.informatimago.common-lisp.cesarum.asd: Closing '/' is missing Current point in control string: "System ~A: clisp should be used with -ansi or (setf custom:*ansi* t) in ~/.clisprc" |
(LOAD com.informatimago.common-lisp.html-generator FAIL) ASDF:LOAD-SYSTEM-DEFINITION-ERROR : Error while trying to load definition for system com.informatimago.common-lisp.cesarum from pathname /home/testgrid/cl-test-grid/work-dir/agent/quicklisp/dists/quicklisp/software/com.informatimago-quicklisp-b192e5b8-git/common-lisp/cesarum/com.informatimago.common-lisp.cesarum.asd: Closing '/' is missing Current point in control string: "System ~A: clisp should be used with -ansi or (setf custom:*ansi* t) in ~/.clisprc" |
(LOAD com.informatimago.common-lisp.html-base.test FAIL) ASDF:LOAD-SYSTEM-DEFINITION-ERROR : Error while trying to load definition for system com.informatimago.common-lisp.cesarum from pathname /home/testgrid/cl-test-grid/work-dir/agent/quicklisp/dists/quicklisp/software/com.informatimago-quicklisp-b192e5b8-git/common-lisp/cesarum/com.informatimago.common-lisp.cesarum.asd: Closing '/' is missing Current point in control string: "System ~A: clisp should be used with -ansi or (setf custom:*ansi* t) in ~/.clisprc" |
(LOAD com.informatimago.common-lisp.html-base FAIL) ASDF:LOAD-SYSTEM-DEFINITION-ERROR : Error while trying to load definition for system com.informatimago.common-lisp.cesarum from pathname /home/testgrid/cl-test-grid/work-dir/agent/quicklisp/dists/quicklisp/software/com.informatimago-quicklisp-b192e5b8-git/common-lisp/cesarum/com.informatimago.common-lisp.cesarum.asd: Closing '/' is missing Current point in control string: "System ~A: clisp should be used with -ansi or (setf custom:*ansi* t) in ~/.clisprc" |
(LOAD com.informatimago.common-lisp.heap.test FAIL) ASDF:LOAD-SYSTEM-DEFINITION-ERROR : Error while trying to load definition for system com.informatimago.common-lisp.cesarum from pathname /home/testgrid/cl-test-grid/work-dir/agent/quicklisp/dists/quicklisp/software/com.informatimago-quicklisp-b192e5b8-git/common-lisp/cesarum/com.informatimago.common-lisp.cesarum.asd: Closing '/' is missing Current point in control string: "System ~A: clisp should be used with -ansi or (setf custom:*ansi* t) in ~/.clisprc" |
(LOAD com.informatimago.common-lisp.heap FAIL) ASDF:LOAD-SYSTEM-DEFINITION-ERROR : Error while trying to load definition for system com.informatimago.common-lisp.cesarum from pathname /home/testgrid/cl-test-grid/work-dir/agent/quicklisp/dists/quicklisp/software/com.informatimago-quicklisp-b192e5b8-git/common-lisp/cesarum/com.informatimago.common-lisp.cesarum.asd: Closing '/' is missing Current point in control string: "System ~A: clisp should be used with -ansi or (setf custom:*ansi* t) in ~/.clisprc" |
(LOAD com.informatimago.common-lisp.graphviz.test FAIL) ASDF:LOAD-SYSTEM-DEFINITION-ERROR : Error while trying to load definition for system com.informatimago.common-lisp.cesarum from pathname /home/testgrid/cl-test-grid/work-dir/agent/quicklisp/dists/quicklisp/software/com.informatimago-quicklisp-b192e5b8-git/common-lisp/cesarum/com.informatimago.common-lisp.cesarum.asd: Closing '/' is missing Current point in control string: "System ~A: clisp should be used with -ansi or (setf custom:*ansi* t) in ~/.clisprc" |
(LOAD com.informatimago.common-lisp.graphviz FAIL) ASDF:LOAD-SYSTEM-DEFINITION-ERROR : Error while trying to load definition for system com.informatimago.common-lisp.cesarum from pathname /home/testgrid/cl-test-grid/work-dir/agent/quicklisp/dists/quicklisp/software/com.informatimago-quicklisp-b192e5b8-git/common-lisp/cesarum/com.informatimago.common-lisp.cesarum.asd: Closing '/' is missing Current point in control string: "System ~A: clisp should be used with -ansi or (setf custom:*ansi* t) in ~/.clisprc" |
(LOAD com.informatimago.common-lisp.ed.test FAIL) ASDF:LOAD-SYSTEM-DEFINITION-ERROR : Error while trying to load definition for system com.informatimago.common-lisp.cesarum from pathname /home/testgrid/cl-test-grid/work-dir/agent/quicklisp/dists/quicklisp/software/com.informatimago-quicklisp-b192e5b8-git/common-lisp/cesarum/com.informatimago.common-lisp.cesarum.asd: Closing '/' is missing Current point in control string: "System ~A: clisp should be used with -ansi or (setf custom:*ansi* t) in ~/.clisprc" |
(LOAD com.informatimago.common-lisp.ed FAIL) ASDF:LOAD-SYSTEM-DEFINITION-ERROR : Error while trying to load definition for system com.informatimago.common-lisp.cesarum from pathname /home/testgrid/cl-test-grid/work-dir/agent/quicklisp/dists/quicklisp/software/com.informatimago-quicklisp-b192e5b8-git/common-lisp/cesarum/com.informatimago.common-lisp.cesarum.asd: Closing '/' is missing Current point in control string: "System ~A: clisp should be used with -ansi or (setf custom:*ansi* t) in ~/.clisprc" |
(LOAD com.informatimago.common-lisp.diagram.test FAIL) ASDF:LOAD-SYSTEM-DEFINITION-ERROR : Error while trying to load definition for system com.informatimago.common-lisp.cesarum from pathname /home/testgrid/cl-test-grid/work-dir/agent/quicklisp/dists/quicklisp/software/com.informatimago-quicklisp-b192e5b8-git/common-lisp/cesarum/com.informatimago.common-lisp.cesarum.asd: Closing '/' is missing Current point in control string: "System ~A: clisp should be used with -ansi or (setf custom:*ansi* t) in ~/.clisprc" |
(LOAD com.informatimago.common-lisp.diagram FAIL) ASDF:LOAD-SYSTEM-DEFINITION-ERROR : Error while trying to load definition for system com.informatimago.common-lisp.cesarum from pathname /home/testgrid/cl-test-grid/work-dir/agent/quicklisp/dists/quicklisp/software/com.informatimago-quicklisp-b192e5b8-git/common-lisp/cesarum/com.informatimago.common-lisp.cesarum.asd: Closing '/' is missing Current point in control string: "System ~A: clisp should be used with -ansi or (setf custom:*ansi* t) in ~/.clisprc" |
(LOAD com.informatimago.common-lisp.data-encoding.test FAIL) ASDF:LOAD-SYSTEM-DEFINITION-ERROR : Error while trying to load definition for system com.informatimago.common-lisp.cesarum from pathname /home/testgrid/cl-test-grid/work-dir/agent/quicklisp/dists/quicklisp/software/com.informatimago-quicklisp-b192e5b8-git/common-lisp/cesarum/com.informatimago.common-lisp.cesarum.asd: Closing '/' is missing Current point in control string: "System ~A: clisp should be used with -ansi or (setf custom:*ansi* t) in ~/.clisprc" |
(LOAD com.informatimago.common-lisp.data-encoding FAIL) ASDF:LOAD-SYSTEM-DEFINITION-ERROR : Error while trying to load definition for system com.informatimago.common-lisp.cesarum from pathname /home/testgrid/cl-test-grid/work-dir/agent/quicklisp/dists/quicklisp/software/com.informatimago-quicklisp-b192e5b8-git/common-lisp/cesarum/com.informatimago.common-lisp.cesarum.asd: Closing '/' is missing Current point in control string: "System ~A: clisp should be used with -ansi or (setf custom:*ansi* t) in ~/.clisprc" |
(LOAD com.informatimago.common-lisp.csv.test FAIL) ASDF:LOAD-SYSTEM-DEFINITION-ERROR : Error while trying to load definition for system com.informatimago.common-lisp.cesarum from pathname /home/testgrid/cl-test-grid/work-dir/agent/quicklisp/dists/quicklisp/software/com.informatimago-quicklisp-b192e5b8-git/common-lisp/cesarum/com.informatimago.common-lisp.cesarum.asd: Closing '/' is missing Current point in control string: "System ~A: clisp should be used with -ansi or (setf custom:*ansi* t) in ~/.clisprc" |
(LOAD com.informatimago.common-lisp.csv FAIL) ASDF:LOAD-SYSTEM-DEFINITION-ERROR : Error while trying to load definition for system com.informatimago.common-lisp.cesarum from pathname /home/testgrid/cl-test-grid/work-dir/agent/quicklisp/dists/quicklisp/software/com.informatimago-quicklisp-b192e5b8-git/common-lisp/cesarum/com.informatimago.common-lisp.cesarum.asd: Closing '/' is missing Current point in control string: "System ~A: clisp should be used with -ansi or (setf custom:*ansi* t) in ~/.clisprc" |
(LOAD com.informatimago.common-lisp.cesarum.test FAIL) ASDF:LOAD-SYSTEM-DEFINITION-ERROR : Error while trying to load definition for system com.informatimago.common-lisp.cesarum.test from pathname /home/testgrid/cl-test-grid/work-dir/agent/quicklisp/dists/quicklisp/software/com.informatimago-quicklisp-b192e5b8-git/common-lisp/cesarum/com.informatimago.common-lisp.cesarum.test.asd: Closing '/' is missing Current point in control string: "System ~A: clisp should be used with -ansi or (setf custom:*ansi* t) in ~/.clisprc" |
(LOAD com.informatimago.common-lisp.cesarum FAIL) ASDF:LOAD-SYSTEM-DEFINITION-ERROR : Error while trying to load definition for system com.informatimago.common-lisp.cesarum from pathname /home/testgrid/cl-test-grid/work-dir/agent/quicklisp/dists/quicklisp/software/com.informatimago-quicklisp-b192e5b8-git/common-lisp/cesarum/com.informatimago.common-lisp.cesarum.asd: Closing '/' is missing Current point in control string: "System ~A: clisp should be used with -ansi or (setf custom:*ansi* t) in ~/.clisprc" |
(LOAD com.informatimago.common-lisp.bank.test FAIL) ASDF:LOAD-SYSTEM-DEFINITION-ERROR : Error while trying to load definition for system com.informatimago.common-lisp.cesarum from pathname /home/testgrid/cl-test-grid/work-dir/agent/quicklisp/dists/quicklisp/software/com.informatimago-quicklisp-b192e5b8-git/common-lisp/cesarum/com.informatimago.common-lisp.cesarum.asd: Closing '/' is missing Current point in control string: "System ~A: clisp should be used with -ansi or (setf custom:*ansi* t) in ~/.clisprc" |
(LOAD com.informatimago.common-lisp.bank FAIL) ASDF:LOAD-SYSTEM-DEFINITION-ERROR : Error while trying to load definition for system com.informatimago.common-lisp.cesarum from pathname /home/testgrid/cl-test-grid/work-dir/agent/quicklisp/dists/quicklisp/software/com.informatimago-quicklisp-b192e5b8-git/common-lisp/cesarum/com.informatimago.common-lisp.cesarum.asd: Closing '/' is missing Current point in control string: "System ~A: clisp should be used with -ansi or (setf custom:*ansi* t) in ~/.clisprc" |
(LOAD com.informatimago.common-lisp.arithmetic.test FAIL) ASDF:LOAD-SYSTEM-DEFINITION-ERROR : Error while trying to load definition for system com.informatimago.common-lisp.cesarum from pathname /home/testgrid/cl-test-grid/work-dir/agent/quicklisp/dists/quicklisp/software/com.informatimago-quicklisp-b192e5b8-git/common-lisp/cesarum/com.informatimago.common-lisp.cesarum.asd: Closing '/' is missing Current point in control string: "System ~A: clisp should be used with -ansi or (setf custom:*ansi* t) in ~/.clisprc" |
(LOAD com.informatimago.common-lisp.arithmetic FAIL) ASDF:LOAD-SYSTEM-DEFINITION-ERROR : Error while trying to load definition for system com.informatimago.common-lisp.cesarum from pathname /home/testgrid/cl-test-grid/work-dir/agent/quicklisp/dists/quicklisp/software/com.informatimago-quicklisp-b192e5b8-git/common-lisp/cesarum/com.informatimago.common-lisp.cesarum.asd: Closing '/' is missing Current point in control string: "System ~A: clisp should be used with -ansi or (setf custom:*ansi* t) in ~/.clisprc" |
(LOAD com.informatimago.common-lisp.apple-file.test FAIL) ASDF:LOAD-SYSTEM-DEFINITION-ERROR : Error while trying to load definition for system com.informatimago.common-lisp.cesarum from pathname /home/testgrid/cl-test-grid/work-dir/agent/quicklisp/dists/quicklisp/software/com.informatimago-quicklisp-b192e5b8-git/common-lisp/cesarum/com.informatimago.common-lisp.cesarum.asd: Closing '/' is missing Current point in control string: "System ~A: clisp should be used with -ansi or (setf custom:*ansi* t) in ~/.clisprc" |
(LOAD com.informatimago.common-lisp.apple-file FAIL) ASDF:LOAD-SYSTEM-DEFINITION-ERROR : Error while trying to load definition for system com.informatimago.common-lisp.cesarum from pathname /home/testgrid/cl-test-grid/work-dir/agent/quicklisp/dists/quicklisp/software/com.informatimago-quicklisp-b192e5b8-git/common-lisp/cesarum/com.informatimago.common-lisp.cesarum.asd: Closing '/' is missing Current point in control string: "System ~A: clisp should be used with -ansi or (setf custom:*ansi* t) in ~/.clisprc" |
(LOAD com.informatimago.common-lisp FAIL) ASDF:LOAD-SYSTEM-DEFINITION-ERROR : Error while trying to load definition for system com.informatimago.common-lisp.cesarum from pathname /home/testgrid/cl-test-grid/work-dir/agent/quicklisp/dists/quicklisp/software/com.informatimago-quicklisp-b192e5b8-git/common-lisp/cesarum/com.informatimago.common-lisp.cesarum.asd: Closing '/' is missing Current point in control string: "System ~A: clisp should be used with -ansi or (setf custom:*ansi* t) in ~/.clisprc" |
(LOAD com.informatimago.clmisc.test FAIL) ASDF:LOAD-SYSTEM-DEFINITION-ERROR : Error while trying to load definition for system com.informatimago.common-lisp.cesarum from pathname /home/testgrid/cl-test-grid/work-dir/agent/quicklisp/dists/quicklisp/software/com.informatimago-quicklisp-b192e5b8-git/common-lisp/cesarum/com.informatimago.common-lisp.cesarum.asd: Closing '/' is missing Current point in control string: "System ~A: clisp should be used with -ansi or (setf custom:*ansi* t) in ~/.clisprc" |
(LOAD com.informatimago.clisp.test FAIL) ASDF:LOAD-SYSTEM-DEFINITION-ERROR : Error while trying to load definition for system com.informatimago.common-lisp.cesarum from pathname /home/testgrid/cl-test-grid/work-dir/agent/quicklisp/dists/quicklisp/software/com.informatimago-quicklisp-b192e5b8-git/common-lisp/cesarum/com.informatimago.common-lisp.cesarum.asd: Closing '/' is missing Current point in control string: "System ~A: clisp should be used with -ansi or (setf custom:*ansi* t) in ~/.clisprc" |
(LOAD com.informatimago.clisp FAIL) ASDF:LOAD-SYSTEM-DEFINITION-ERROR : Error while trying to load definition for system com.informatimago.common-lisp.cesarum from pathname /home/testgrid/cl-test-grid/work-dir/agent/quicklisp/dists/quicklisp/software/com.informatimago-quicklisp-b192e5b8-git/common-lisp/cesarum/com.informatimago.common-lisp.cesarum.asd: Closing '/' is missing Current point in control string: "System ~A: clisp should be used with -ansi or (setf custom:*ansi* t) in ~/.clisprc" |
(LOAD com.informatimago.clext.test FAIL) ASDF:LOAD-SYSTEM-DEFINITION-ERROR : Error while trying to load definition for system bordeaux-threads from pathname /home/testgrid/cl-test-grid/work-dir/agent/quicklisp/dists/quicklisp/software/bordeaux-threads-v0.8.4-git/bordeaux-threads.asd: READ from #<INPUT BUFFERED FILE-STREAM CHARACTER #P"/home/testgrid/cl-test-grid/work-dir/agent/quicklisp/dists/quicklisp/software/bordeaux-threads-v0.8.4-git/bordeaux-threads.asd" @68>: there is no package with name "UIOP"
(LOAD com.informatimago.clext.run-program.test FAIL) ASDF:LOAD-SYSTEM-DEFINITION-ERROR : Error while trying to load definition for system com.informatimago.common-lisp.cesarum from pathname /home/testgrid/cl-test-grid/work-dir/agent/quicklisp/dists/quicklisp/software/com.informatimago-quicklisp-b192e5b8-git/common-lisp/cesarum/com.informatimago.common-lisp.cesarum.asd: Closing '/' is missing Current point in control string: "System ~A: clisp should be used with -ansi or (setf custom:*ansi* t) in ~/.clisprc" |
(LOAD com.informatimago.clext.run-program FAIL) ASDF:LOAD-SYSTEM-DEFINITION-ERROR : Error while trying to load definition for system com.informatimago.common-lisp.cesarum from pathname /home/testgrid/cl-test-grid/work-dir/agent/quicklisp/dists/quicklisp/software/com.informatimago-quicklisp-b192e5b8-git/common-lisp/cesarum/com.informatimago.common-lisp.cesarum.asd: Closing '/' is missing Current point in control string: "System ~A: clisp should be used with -ansi or (setf custom:*ansi* t) in ~/.clisprc" |
(LOAD com.informatimago.clext.pipe.test FAIL) ASDF:LOAD-SYSTEM-DEFINITION-ERROR : Error while trying to load definition for system bordeaux-threads from pathname /home/testgrid/cl-test-grid/work-dir/agent/quicklisp/dists/quicklisp/software/bordeaux-threads-v0.8.4-git/bordeaux-threads.asd: READ from #<INPUT BUFFERED FILE-STREAM CHARACTER #P"/home/testgrid/cl-test-grid/work-dir/agent/quicklisp/dists/quicklisp/software/bordeaux-threads-v0.8.4-git/bordeaux-threads.asd" @68>: there is no package with name "UIOP"
(LOAD com.informatimago.clext.pipe FAIL) ASDF:LOAD-SYSTEM-DEFINITION-ERROR : Error while trying to load definition for system bordeaux-threads from pathname /home/testgrid/cl-test-grid/work-dir/agent/quicklisp/dists/quicklisp/software/bordeaux-threads-v0.8.4-git/bordeaux-threads.asd: READ from #<INPUT BUFFERED FILE-STREAM CHARACTER #P"/home/testgrid/cl-test-grid/work-dir/agent/quicklisp/dists/quicklisp/software/bordeaux-threads-v0.8.4-git/bordeaux-threads.asd" @68>: there is no package with name "UIOP"
(LOAD com.informatimago.clext.character-sets FAIL) ASDF:LOAD-SYSTEM-DEFINITION-ERROR : Error while trying to load definition for system com.informatimago.common-lisp.cesarum from pathname /home/testgrid/cl-test-grid/work-dir/agent/quicklisp/dists/quicklisp/software/com.informatimago-quicklisp-b192e5b8-git/common-lisp/cesarum/com.informatimago.common-lisp.cesarum.asd: Closing '/' is missing Current point in control string: "System ~A: clisp should be used with -ansi or (setf custom:*ansi* t) in ~/.clisprc" |
(LOAD com.informatimago.clext.association.test FAIL) ASDF:LOAD-SYSTEM-DEFINITION-ERROR : Error while trying to load definition for system com.informatimago.common-lisp.cesarum from pathname /home/testgrid/cl-test-grid/work-dir/agent/quicklisp/dists/quicklisp/software/com.informatimago-quicklisp-b192e5b8-git/common-lisp/cesarum/com.informatimago.common-lisp.cesarum.asd: Closing '/' is missing Current point in control string: "System ~A: clisp should be used with -ansi or (setf custom:*ansi* t) in ~/.clisprc" |
(LOAD com.informatimago.clext FAIL) ASDF:LOAD-SYSTEM-DEFINITION-ERROR : Error while trying to load definition for system bordeaux-threads from pathname /home/testgrid/cl-test-grid/work-dir/agent/quicklisp/dists/quicklisp/software/bordeaux-threads-v0.8.4-git/bordeaux-threads.asd: READ from #<INPUT BUFFERED FILE-STREAM CHARACTER #P"/home/testgrid/cl-test-grid/work-dir/agent/quicklisp/dists/quicklisp/software/bordeaux-threads-v0.8.4-git/bordeaux-threads.asd" @68>: there is no package with name "UIOP"
(LOAD com.informatimago FAIL) ASDF:LOAD-SYSTEM-DEFINITION-ERROR : Error while trying to load definition for system com.informatimago.common-lisp.cesarum from pathname /home/testgrid/cl-test-grid/work-dir/agent/quicklisp/dists/quicklisp/software/com.informatimago-quicklisp-b192e5b8-git/common-lisp/cesarum/com.informatimago.common-lisp.cesarum.asd: Closing '/' is missing Current point in control string: "System ~A: clisp should be used with -ansi or (setf custom:*ansi* t) in ~/.clisprc" |
(LOAD com.ogamita.swig.test FAIL) ASDF:LOAD-SYSTEM-DEFINITION-ERROR : Error while trying to load definition for system com.informatimago.common-lisp.cesarum from pathname /home/testgrid/cl-test-grid/work-dir/agent/quicklisp/dists/quicklisp/software/com.informatimago-20150924-git/common-lisp/cesarum/com.informatimago.common-lisp.cesarum.asd: Closing '/' is missing Current point in control string: "System ~A: clisp should be used with -ansi or (setf custom:*ansi* t) in ~/.clisprc" |
(LOAD com.informatimago.tools.undefmethod.test FAIL) ASDF:LOAD-SYSTEM-DEFINITION-ERROR : Error while trying to load definition for system com.informatimago.common-lisp.cesarum from pathname /home/testgrid/cl-test-grid/work-dir/agent/quicklisp/dists/quicklisp/software/com.informatimago-20150924-git/common-lisp/cesarum/com.informatimago.common-lisp.cesarum.asd: Closing '/' is missing Current point in control string: "System ~A: clisp should be used with -ansi or (setf custom:*ansi* t) in ~/.clisprc" |
(LOAD com.informatimago.tools.symbol.test FAIL) ASDF:LOAD-SYSTEM-DEFINITION-ERROR : Error while trying to load definition for system com.informatimago.common-lisp.cesarum from pathname /home/testgrid/cl-test-grid/work-dir/agent/quicklisp/dists/quicklisp/software/com.informatimago-20150924-git/common-lisp/cesarum/com.informatimago.common-lisp.cesarum.asd: Closing '/' is missing Current point in control string: "System ~A: clisp should be used with -ansi or (setf custom:*ansi* t) in ~/.clisprc" |
(LOAD com.informatimago.tools.symbol FAIL) ASDF:LOAD-SYSTEM-DEFINITION-ERROR : Error while trying to load definition for system com.informatimago.common-lisp.cesarum from pathname /home/testgrid/cl-test-grid/work-dir/agent/quicklisp/dists/quicklisp/software/com.informatimago-20150924-git/common-lisp/cesarum/com.informatimago.common-lisp.cesarum.asd: Closing '/' is missing Current point in control string: "System ~A: clisp should be used with -ansi or (setf custom:*ansi* t) in ~/.clisprc" |
(LOAD com.informatimago.tools.script.test FAIL) ASDF:LOAD-SYSTEM-DEFINITION-ERROR : Error while trying to load definition for system com.informatimago.common-lisp.cesarum from pathname /home/testgrid/cl-test-grid/work-dir/agent/quicklisp/dists/quicklisp/software/com.informatimago-20150924-git/common-lisp/cesarum/com.informatimago.common-lisp.cesarum.asd: Closing '/' is missing Current point in control string: "System ~A: clisp should be used with -ansi or (setf custom:*ansi* t) in ~/.clisprc" |
(LOAD com.informatimago.tools.quicklisp.test FAIL) ASDF:LOAD-SYSTEM-DEFINITION-ERROR : Error while trying to load definition for system com.informatimago.common-lisp.cesarum from pathname /home/testgrid/cl-test-grid/work-dir/agent/quicklisp/dists/quicklisp/software/com.informatimago-20150924-git/common-lisp/cesarum/com.informatimago.common-lisp.cesarum.asd: Closing '/' is missing Current point in control string: "System ~A: clisp should be used with -ansi or (setf custom:*ansi* t) in ~/.clisprc" |