clavatar results collected by cl-test-grid

Results on the last two Quicklisp distributions

 quicklisp 2018-03-28quicklisp 2018-02-28
abcl-1.2.1-fasl42-linux-x86
(LOAD clavatar FAIL) needs newer ASDF, ASDF/FIND-SYSTEM:LOAD-SYSTEM-DEFINITION-ERROR : Error while trying to load definition for system iolib from pathname /home/testgrid/cl-test-grid/work-dir/agent/quicklisp/dists/quicklisp/software/iolib-v0.8.3/iolib.asd: You need ASDF >= 3.1 to load this system correctly.
abcl-1.3.0-fasl42-linux-x86
abcl-1.3.1-fasl42-linux-x86
abcl-1.3.2-fasl42-linux-x86
abcl-1.4.0-fasl42-linux-x86
(LOAD clavatar FAIL) ASDF/FIND-SYSTEM:LOAD-SYSTEM-DEFINITION-ERROR : Error while trying to load definition for system iolib from pathname /home/testgrid/cl-test-grid/work-dir/agent/quicklisp/dists/quicklisp/software/iolib-v0.8.3/iolib.asd: org.armedbear.lisp.Go
abcl-1.5.0-fasl43-linux-x86
acl-10.0-linux-x86
(LOAD clavatar FAIL) COMMON-LISP:SIMPLE-ERROR : this platform does not support :unsigned-long-long
(LOAD clavatar FAIL) COMMON-LISP:SIMPLE-ERROR : this platform does not support :unsigned-long-long
acl-10.0m-linux-x86
(LOAD clavatar FAIL) common-lisp:simple-error : this platform does not support :unsigned-long-long
(LOAD clavatar FAIL) common-lisp:simple-error : this platform does not support :unsigned-long-long
acl-10.0ms-linux-x86
(LOAD clavatar FAIL) common-lisp:simple-error : this platform does not support :unsigned-long-long
(LOAD clavatar FAIL) common-lisp:simple-error : this platform does not support :unsigned-long-long
acl-10.0s-linux-x86
(LOAD clavatar FAIL) COMMON-LISP:SIMPLE-ERROR : this platform does not support :unsigned-long-long
(LOAD clavatar FAIL) COMMON-LISP:SIMPLE-ERROR : this platform does not support :unsigned-long-long
ccl-1.10-r16196-f96-linux-x86
ccl-1.11-5-rv1.11.5-f96-linux-x86
ccl-1.11-r16635-f101-linux-arm
(LOAD clavatar FAIL) IOLIB/GROVEL::GROVEL-ERROR : External process exited with code 71. Command was: "g++" "-marm" "-Wno-write-strings" "-I/home/testgrid/cl-test-grid/work-dir/agent/quicklisp/dists/quicklisp/software/iolib-v0.8.3/src/grovel/" "-o" "/home/testgrid/cl-test-grid/work-dir/agent/test-runs/20180304070354-ccl-1.11-r16635-f101-linux-arm/fasl/ql/dists/quicklisp/software/iolib-v0.8.3/src/syscalls/ffi-types-unix" "/home/testgrid/cl-test-grid/work-dir/agent/test-runs/20180304070354-ccl-1.11-r16635-f101-linux-arm/fasl/ql/dists/quicklisp/software/iolib-v0.8.3/src/syscalls/ffi-types-unix.c" Output was: Error output was:
ccl-1.11-r16635-f96-linux-x86
ccl-1.11-r16702m-f101-linux-arm
(LOAD clavatar FAIL) IOLIB/GROVEL::GROVEL-ERROR : External process exited with code 1. Command was: "g++" "-marm" "-Wno-write-strings" "-I/home/testgrid/cl-test-grid/work-dir/agent/quicklisp/dists/quicklisp/software/iolib-v0.8.3/src/grovel/" "-o" "/home/testgrid/cl-test-grid/work-dir/agent/test-runs/20180401030522-ccl-1.11-r16702m-f101-linux-arm/fasl/ql/dists/quicklisp/software/iolib-v0.8.3/src/syscalls/ffi-types-unix" "/home/testgrid/cl-test-grid/work-dir/agent/test-runs/20180401030522-ccl-1.11-r16702m-f101-linux-arm/fasl/ql/dists/quicklisp/software/iolib-v0.8.3/src/syscalls/ffi-types-unix.c" Output was: Error output was: /home/testgrid/cl-test-grid/work-dir/agent/test-runs/20180401030522-ccl-1.11-r16702m-f101-linux-arm/fasl/ql/dists/quicklisp/software/iolib-v0.8.3/src/syscalls/ffi-types-unix.c:14:17: fatal error: lfp.h: No such file or directory compilation terminated.
ccl-1.8-r15286m-f95-linux-x86
(LOAD clavatar FAIL) ASDF:LOAD-SYSTEM-DEFINITION-ERROR : Error while trying to load definition for system drakma from pathname /home/testgrid/cl-test-grid/work-dir/agent/quicklisp/dists/quicklisp/software/drakma-v2.0.4/drakma.asd: While compiling (PERFORM (T T)) : In the form ((LOAD-SYSTEM TEST-OP) (:DRAKMA-TEST (EQL #<SYSTEM "drakma">))), (LOAD-SYSTEM TEST-OP) is not a symbol or lambda expression.
(LOAD clavatar FAIL) ASDF:LOAD-SYSTEM-DEFINITION-ERROR : Error while trying to load definition for system drakma from pathname /home/testgrid/cl-test-grid/work-dir/agent/quicklisp/dists/quicklisp/software/drakma-v2.0.4/drakma.asd: While compiling (PERFORM (T T)) : In the form ((LOAD-SYSTEM TEST-OP) (:DRAKMA-TEST (EQL #<SYSTEM "drakma">))), (LOAD-SYSTEM TEST-OP) is not a symbol or lambda expression.
ccl-1.9-r15756-f96-linux-x86
(LOAD clavatar FAIL) needs newer ASDF, ASDF/FIND-SYSTEM:LOAD-SYSTEM-DEFINITION-ERROR : Error while trying to load definition for system iolib from pathname /home/testgrid/cl-test-grid/work-dir/agent/quicklisp/dists/quicklisp/software/iolib-v0.8.3/iolib.asd: You need ASDF >= 3.1 to load this system correctly.
(LOAD clavatar FAIL) needs newer ASDF, ASDF/FIND-SYSTEM:LOAD-SYSTEM-DEFINITION-ERROR : Error while trying to load definition for system iolib from pathname /home/testgrid/cl-test-grid/work-dir/agent/quicklisp/dists/quicklisp/software/iolib-v0.8.3/iolib.asd: You need ASDF >= 3.1 to load this system correctly.
clisp-2.49-unix-x86
(LOAD clavatar FAIL) ASDF:LOAD-SYSTEM-DEFINITION-ERROR : Error while trying to load definition for system drakma from pathname /home/testgrid/cl-test-grid/work-dir/agent/quicklisp/dists/quicklisp/software/drakma-v2.0.4/drakma.asd: SYSTEM::%EXPAND-FORM: (LOAD-SYSTEM TEST-OP) should be a lambda expression
(LOAD clavatar FAIL) ASDF:LOAD-SYSTEM-DEFINITION-ERROR : Error while trying to load definition for system drakma from pathname /home/testgrid/cl-test-grid/work-dir/agent/quicklisp/dists/quicklisp/software/drakma-v2.0.4/drakma.asd: SYSTEM::%EXPAND-FORM: (LOAD-SYSTEM TEST-OP) should be a lambda expression
cmu-snapshot-2013-04__20d_unicode_-linux-x86
(LOAD clavatar FAIL) needs newer ASDF, ASDF/FIND-SYSTEM:LOAD-SYSTEM-DEFINITION-ERROR : Error while trying to load definition for system iolib from pathname /home/testgrid/cl-test-grid/work-dir/agent/quicklisp/dists/quicklisp/software/iolib-v0.8.3/iolib.asd: Error in function "Top-Level Form": You need ASDF >= 3.1 to load this system correctly.
cmu-snapshot-2014-01__20e_unicode_-linux-x86
(LOAD clavatar FAIL) needs newer ASDF, ASDF/FIND-SYSTEM:LOAD-SYSTEM-DEFINITION-ERROR : Error while trying to load definition for system iolib from pathname /home/testgrid/cl-test-grid/work-dir/agent/quicklisp/dists/quicklisp/software/iolib-v0.8.3/iolib.asd: Error in function "Top-Level Form": You need ASDF >= 3.1 to load this system correctly.
cmu-snapshot-2014-05-dirty__20e_unicode_-linux-x86
(LOAD clavatar FAIL) needs newer ASDF, ASDF/FIND-SYSTEM:LOAD-SYSTEM-DEFINITION-ERROR : Error while trying to load definition for system iolib from pathname /home/testgrid/cl-test-grid/work-dir/agent/quicklisp/dists/quicklisp/software/iolib-v0.8.3/iolib.asd: Error in function "Top-Level Form": You need ASDF >= 3.1 to load this system correctly.
(LOAD clavatar FAIL) needs newer ASDF, ASDF/FIND-SYSTEM:LOAD-SYSTEM-DEFINITION-ERROR : Error while trying to load definition for system iolib from pathname /home/testgrid/cl-test-grid/work-dir/agent/quicklisp/dists/quicklisp/software/iolib-v0.8.3/iolib.asd: Error in function "Top-Level Form": You need ASDF >= 3.1 to load this system correctly.
cmu-snapshot-2014-12___20f_unicode_-linux-x86
cmu-snapshot-2016-12__21b_unicode_-linux-x86
ecl-13.5.1-unknown-linux-i686-bytecode
(LOAD clavatar FAIL) needs newer ASDF, ASDF/FIND-SYSTEM:LOAD-SYSTEM-DEFINITION-ERROR : Error while trying to load definition for system iolib from pathname /home/testgrid/cl-test-grid/work-dir/agent/quicklisp/dists/quicklisp/software/iolib-v0.8.3/iolib.asd: You need ASDF >= 3.1 to load this system correctly.
ecl-13.5.1-unknown-linux-i686-lisp-to-c
(LOAD clavatar FAIL) needs newer ASDF, ASDF/FIND-SYSTEM:LOAD-SYSTEM-DEFINITION-ERROR : Error while trying to load definition for system iolib from pathname /home/testgrid/cl-test-grid/work-dir/agent/quicklisp/dists/quicklisp/software/iolib-v0.8.3/iolib.asd: You need ASDF >= 3.1 to load this system correctly.
ecl-16.0.0-98fc12d3-linux-i686-bytecode
(LOAD clavatar FAIL) ASDF/FIND-SYSTEM:LOAD-SYSTEM-DEFINITION-ERROR : Error while trying to load definition for system iolib from pathname /home/testgrid/cl-test-grid/work-dir/agent/quicklisp/dists/quicklisp/software/iolib-v0.8.3/iolib.asd: The variable C::*CC-FLAGS* is unbound.
ecl-16.0.0-98fc12d3-linux-i686-lisp-to-c
ecl-16.1.2-unknown-linux-x86-bytecode
(LOAD clavatar FAIL) ASDF/FIND-SYSTEM:LOAD-SYSTEM-DEFINITION-ERROR : Error while trying to load definition for system iolib from pathname /home/testgrid/cl-test-grid/work-dir/agent/quicklisp/dists/quicklisp/software/iolib-v0.8.3/iolib.asd: The variable C::*CC-FLAGS* is unbound.
(LOAD clavatar FAIL) ASDF/FIND-SYSTEM:LOAD-SYSTEM-DEFINITION-ERROR : Error while trying to load definition for system iolib from pathname /home/testgrid/cl-test-grid/work-dir/agent/quicklisp/dists/quicklisp/software/iolib-v0.8.3/iolib.asd: The variable C::*CC-FLAGS* is unbound.
ecl-16.1.2-unknown-linux-x86-lisp-to-c
sbcl-1.0.58-linux-x86
(LOAD clavatar FAIL) ASDF:LOAD-SYSTEM-DEFINITION-ERROR : Error while trying to load definition for system drakma from pathname /home/testgrid/cl-test-grid/work-dir/agent/quicklisp/dists/quicklisp/software/drakma-v2.0.4/drakma.asd: Illegal function call in method body: ((LOAD-SYSTEM TEST-OP) (:DRAKMA-TEST (EQL #<SYSTEM "drakma">)))
(LOAD clavatar FAIL) ASDF:LOAD-SYSTEM-DEFINITION-ERROR : Error while trying to load definition for system drakma from pathname /home/testgrid/cl-test-grid/work-dir/agent/quicklisp/dists/quicklisp/software/drakma-v2.0.4/drakma.asd: Illegal function call in method body: ((LOAD-SYSTEM TEST-OP) (:DRAKMA-TEST (EQL #<SYSTEM "drakma">)))
sbcl-1.1.11-linux-x86
(LOAD clavatar FAIL) needs newer ASDF, ASDF/FIND-SYSTEM:LOAD-SYSTEM-DEFINITION-ERROR : Error while trying to load definition for system iolib from pathname /home/testgrid/cl-test-grid/work-dir/agent/quicklisp/dists/quicklisp/software/iolib-v0.8.3/iolib.asd: READ error during COMPILE-FILE: You need ASDF >= 3.1 to load this system correctly.(in form starting at line: 1, column: 0, file-position: 0)
(LOAD clavatar FAIL) needs newer ASDF, ASDF/FIND-SYSTEM:LOAD-SYSTEM-DEFINITION-ERROR : Error while trying to load definition for system iolib from pathname /home/testgrid/cl-test-grid/work-dir/agent/quicklisp/dists/quicklisp/software/iolib-v0.8.3/iolib.asd: READ error during COMPILE-FILE: You need ASDF >= 3.1 to load this system correctly.(in form starting at line: 1, column: 0, file-position: 0)
sbcl-1.1.16-linux-x86
(LOAD clavatar FAIL) needs newer ASDF, ASDF/FIND-SYSTEM:LOAD-SYSTEM-DEFINITION-ERROR : Error while trying to load definition for system iolib from pathname /home/testgrid/cl-test-grid/work-dir/agent/quicklisp/dists/quicklisp/software/iolib-v0.8.3/iolib.asd: READ error during LOAD: You need ASDF >= 3.1 to load this system correctly.(in form starting at line: 1, column: 0, file-position: 0)
(LOAD clavatar FAIL) needs newer ASDF, ASDF/FIND-SYSTEM:LOAD-SYSTEM-DEFINITION-ERROR : Error while trying to load definition for system iolib from pathname /home/testgrid/cl-test-grid/work-dir/agent/quicklisp/dists/quicklisp/software/iolib-v0.8.3/iolib.asd: READ error during LOAD: You need ASDF >= 3.1 to load this system correctly.(in form starting at line: 1, column: 0, file-position: 0)
sbcl-1.2.6-linux-x86
sbcl-1.3.12-linux-arm
(LOAD clavatar FAIL) COMMON-LISP:SIMPLE-ERROR : Couldn't execute "g++": No such file or directory
(LOAD clavatar FAIL) COMMON-LISP:SIMPLE-ERROR : Couldn't execute "g++": No such file or directory
sbcl-1.3.12-linux-x86
sbcl-1.3.17-linux-x86
sbcl-1.3.2.92-4077405-dirty-linux-arm
(LOAD clavatar FAIL) IOLIB/GROVEL::GROVEL-ERROR : External process exited with code 1. Command was: "g++" "-marm" "-Wno-write-strings" "-I/home/testgrid/cl-test-grid/work-dir/agent/quicklisp/dists/quicklisp/software/iolib-v0.8.3/src/grovel/" "-o" "/home/testgrid/cl-test-grid/work-dir/agent/test-runs/20180402085142-sbcl-1.3.2.92-4077405-dirty-linux-arm/fasl/ql/dists/quicklisp/software/iolib-v0.8.3/src/syscalls/ffi-types-unix" "/home/testgrid/cl-test-grid/work-dir/agent/test-runs/20180402085142-sbcl-1.3.2.92-4077405-dirty-linux-arm/fasl/ql/dists/quicklisp/software/iolib-v0.8.3/src/syscalls/ffi-types-unix.c" Output was: Error output was: /home/testgrid/cl-test-grid/work-dir/agent/test-runs/20180402085142-sbcl-1.3.2.92-4077405-dirty-linux-arm/fasl/ql/dists/quicklisp/software/iolib-v0.8.3/src/syscalls/ffi-types-unix.c:14:17: fatal error: lfp.h: No such file or directory compilation terminated.
sbcl-1.3.20-linux-x86
sbcl-1.3.21-linux-x86
sbcl-1.4.5.openbsd-bsd-x64
(LOAD clavatar FAIL) IOLIB/GROVEL::GROVEL-ERROR : External process exited with code 1. Command was: "g++" "-m64" "-Wno-write-strings" "-I/home/tmy/src/cl-test-grid/work-dir/agent/quicklisp/dists/quicklisp/software/iolib-v0.8.3/src/grovel/" "-o" "/home/tmy/.cache/common-lisp/sbcl-1.4.5.openbsd-bsd-x64/home/tmy/src/cl-test-grid/work-dir/agent/quicklisp/dists/quicklisp/software/iolib-v0.8.3/src/syscalls/ffi-types-unix" "/home/tmy/.cache/common-lisp/sbcl-1.4.5.openbsd-bsd-x64/home/tmy/src/cl-test-grid/work-dir/agent/quicklisp/dists/quicklisp/software/iolib-v0.8.3/src/syscalls/ffi-types-unix.c" Output was: Error output was: /home/tmy/.cache/common-lisp/sbcl-1.4.5.openbsd-bsd-x64/home/tmy/src/cl-test-grid/work-dir/agent/quicklisp/dists/quicklisp/software/iolib-v0.8.3/src/syscalls/ffi-types-unix.c:6:17: error: lfp.h: No such file or directory /home/tmy/.cache/common-lisp/sbcl-1.4.5.openbsd-bsd-x64/home/tmy/src/cl-test-grid/work-dir/agent/quicklisp/dists/quicklisp/software/iolib-v0.8.3/src/syscalls/ffi-types-unix.c: In function 'int main(int, char**)': /home/tmy/.cache/common-lisp/sbcl-1.4.5.openbsd-bsd-x64/home/tmy/src/cl-test-grid/work-dir/agent/quicklisp/dists/quicklisp/software/iolib-v0.8.3/src/syscalls/ffi-types-unix.c:35: error: 'intptr_t' was not declared in this scope /home/tmy/.cache/common-lisp/sbcl-1.4.5.openbsd-bsd-x64/home/tmy/src/cl-test-grid/work-dir/agent/quicklisp/dists/quicklisp/software/iolib-v0.8.3/src/syscalls/ffi-types-unix.c:38: error: 'uintptr_t' was not declared in this scope /home/tmy/.cache/common-lisp/sbcl-1.4.5.openbsd-bsd-x64/home/tmy/src/cl-test-grid/work-dir/agent/quicklisp/dists/quicklisp/software/iolib-v0.8.3/src/syscalls/ffi-types-unix.c:93: error: 'E2BIG' was not declared in this scope /home/tmy/.cache/common-lisp/sbcl-1.4.5.openbsd-bsd-x64/home/tmy/src/cl-test-grid/work-dir/agent/quicklisp/dists/quicklisp/software/iolib-v0.8.3/src/syscalls/ffi-types-unix.c:94: error: 'EACCES' was not declared in this scope /home/tmy/.cache/common-lisp/sbcl-1.4.5.openbsd-bsd-x64/home/tmy/src/cl-test-grid/work-dir/agent/quicklisp/dists/quicklisp/software/iolib-v0.8.3/src/syscalls/ffi-types-unix.c:95: error: 'EADDRINUSE' was not declared in this scope /home/tmy/.cache/common-lisp/sbcl-1.4.5.openbsd-bsd-x64/home/tmy/src/cl-test-grid/work-dir/agent/quicklisp/dists/quicklisp/software/iolib-v0.8.3/src/syscalls/ffi-types-unix.c:96: error: 'EADDRNOTAVAIL' was not declared in this scope /home/tmy/.cache/common-lisp/sbcl-1.4.5.openbsd-bsd-x64/home/tmy/src/cl-test-grid/work-dir/agent/quicklisp/dists/quicklisp/software/iolib-v0.8.3/src/syscalls/ffi-types-unix.c:100: error: 'EAFNOSUPPORT' was not declared in this scope /home/tmy/.cache/common-lisp/sbcl-1.4.5.openbsd-bsd-x64/home/tmy/src/cl-test-grid/work-dir/agent/quicklisp/dists/quicklisp/software/iolib-v0.8.3/src/syscalls/ffi-types-unix.c:101: error: 'EALREADY' was not declared in this scope /home/tmy/.cache/common-lisp/sbcl-1.4.5.openbsd-bsd-x64/home/tmy/src/cl-test-grid/work-dir/agent/quicklisp/dists/quicklisp/software/iolib-v0.8.3/src/syscalls/ffi-types-unix.c:105: error: 'EBADF' was not declared in this scope /home/tmy/.cache/common-lisp/sbcl-1.4.5.openbsd-bsd-x64/home/tmy/src/cl-test-grid/work-dir/agent/quicklisp/dists/quicklisp/software/iolib-v0.8.3/src/syscalls/ffi-types-unix.c:109: error: 'EBADMSG' was not declared in this scope /home/tmy/.cache/common-lisp/sbcl-1.4.5.openbsd-bsd-x64/home/tmy/src/cl-test-grid/work-dir/agent/quicklisp/dists/quicklisp/software/iolib-v0.8.3/src/syscalls/ffi-types-unix.c:122: error: 'EBUSY' was not declared in this scope /home/tmy/.cache/common-lisp/sbcl-1.4.5.openbsd-bsd-x64/home/tmy/src/cl-test-grid/work-dir/agent/quicklisp/dists/quicklisp/software/iolib-v0.8.3/src/syscalls/ffi-types-unix.c:123: error: 'ECANCELED' was not declared in this scope /home/tmy/.cache/common-lisp/sbcl-1.4.5.openbsd-bsd-x64/home/tmy/src/cl-test-grid/work-dir/agent/quicklisp/dists/quicklisp/software/iolib-v0.8.3/src/syscalls/ffi-types-unix.c:124: error: 'ECHILD' was not declared in this scope /home/tmy/.cache/common-lisp/sbcl-1.4.5.openbsd-bsd-x64/home/tmy/src/cl-test-grid/work-dir/agent/quicklisp/dists/quicklisp/software/iolib-v0.8.3/src/syscalls/ffi-types-unix.c:131: error: 'ECONNABORTED' was not declared in this scope /home/tmy/.cache/common-lisp/sbcl-1.4.5.openbsd-bsd-x64/home/tmy/src/cl-test-grid/work-dir/agent/quicklisp/dists/quicklisp/software/iolib-v0.8.3/src/syscalls/ffi-types-unix.c:132: error: 'ECONNREFUSED' was not declared in this scope /home/tmy/.cache/common-lisp/sbcl-1.4.5.openbsd-bsd-x64/home/tmy/src/cl-test-grid/work-dir/agent/quicklisp/dists/quicklisp/software/iolib-v0.8.3/src/syscalls/ffi-types-unix.c:133: error: 'ECONNRESET' was not declared in this scope /home/tmy/.cache/common-lisp/sbcl-1.4.5.openbsd-bsd-x64/home/tmy/src/cl-test-grid/work-dir/agent/quicklisp/dists/quicklisp/software/iolib-v0.8.3/src/syscalls/ffi-types-unix.c:134: error: 'EDEADLK' was not declared in this scope /home/tmy/.cache/common-lisp/sbcl-1.4.5.openbsd-bsd-x64/home/tmy/src/cl-test-grid/work-dir/agent/quicklisp/dists/quicklisp/software/iolib-v0.8.3/src/syscalls/ffi-types-unix.c:135: error: 'EDESTADDRREQ' was not declared in this scope /home/tmy/.cache/common-lisp/sbcl-1.4.5.openbsd-bsd-x64/home/tmy/src/cl-test-grid/work-dir/agent/quicklisp/dists/quicklisp/software/iolib-v0.8.3/src/syscalls/ffi-types-unix.c:136: error: 'EDOM' was not declared in this scope /home/tmy/.cache/common-lisp/sbcl-1.4.5.openbsd-bsd-x64/home/tmy/src/cl-test-grid/work-dir/agent/quicklisp/dists/quicklisp/software/iolib-v0.8.3/src/syscalls/ffi-types-unix.c:140: error: 'EDQUOT' was not declared in this scope /home/tmy/.cache/common-lisp/sbcl-1.4.5.openbsd-bsd-x64/home/tmy/src/cl-test-grid/work-dir/agent/quicklisp/dists/quicklisp/software/iolib-v0.8.3/src/syscalls/ffi-types-unix.c:141: error: 'EEXIST' was not declared in this scope /home/tmy/.cache/common-lisp/sbcl-1.4.5.openbsd-bsd-x64/home/tmy/src/cl-test-grid/work-dir/agent/quicklisp/dists/quicklisp/software/iolib-v0.8.3/src/syscalls/ffi-types-unix.c:142: error: 'EFAULT' was not declared in this scope /home/tmy/.cache/common-lisp/sbcl-1.4.5.openbsd-bsd-x64/home/tmy/src/cl-test-grid/work-dir/agent/quicklisp/dists/quicklisp/software/iolib-v0.8.3/src/syscalls/ffi-types-unix.c:143: error: 'EFBIG' was not declared in this scope /home/tmy/.cache/common-lisp/sbcl-1.4.5.openbsd-bsd-x64/home/tmy/src/cl-test-grid/work-dir/agent/quicklisp/dists/quicklisp/software/iolib-v0.8.3/src/syscalls/ffi-types-unix.c:144: error: 'EHOSTDOWN' was not declared in this scope /home/tmy/.cache/common-lisp/sbcl-1.4.5.openbsd-bsd-x64/home/tmy/src/cl-test-grid/work-dir/agent/quicklisp/dists/quicklisp/software/iolib-v0.8.3/src/syscalls/ffi-types-unix.c:145: error: 'EHOSTUNREACH' was not declared in this scope /home/tmy/.cache/common-lisp/sbcl-1.4.5.openbsd-bsd-x64/home/tmy/src/cl-test-grid/work-dir/agent/quicklisp/dists/quicklisp/software/iolib-v0.8.3/src/syscalls/ffi-types-unix.c:149: error: 'EIDRM' was not declared in this scope /home/tmy/.cache/common-lisp/sbcl-1.4.5.openbsd-bsd-x64/home/tmy/src/cl-test-grid/work-dir/agent/quicklisp/dists/quicklisp/software/iolib-v0.8.3/src/syscalls/ffi-types-unix.c:150: error: 'EILSEQ' was not declared in this scope /home/tmy/.cache/common-lisp/sbcl-1.4.5.openbsd-bsd-x64/home/tmy/src/cl-test-grid/work-dir/agent/quicklisp/dists/quicklisp/software/iolib-v0.8.3/src/syscalls/ffi-types-unix.c:151: error: 'EINPROGRESS' was not declared in this scope /home/tmy/.cache/common-lisp/sbcl-1.4.5.openbsd-bsd-x64/home/tmy/src/cl-test-grid/work-dir/agent/quicklisp/dists/quicklisp/software/iolib-v0.8.3/src/syscalls/ffi-types-unix.c:152: error: 'EINTR' was not declared in this scope /home/tmy/.cache/common-lisp/sbcl-1.4.5.openbsd-bsd-x64/home/tmy/src/cl-test-grid/work-dir/agent/quicklisp/dists/quicklisp/software/iolib-v0.8.3/src/syscalls/ffi-types-unix.c:153: error: 'EINVAL' was not declared in this scope /home/tmy/.cache/common-lisp/sbcl-1.4.5.openbsd-bsd-x64/home/tmy/src/cl-test-grid/work-dir/agent/quicklisp/dists/quicklisp/software/iolib-v0.8.3/src/syscalls/ffi-types-unix.c:154: error: 'EIO' was not declared in this scope /home/tmy/.cache/common-lisp/sbcl-1.4.5.openbsd-bsd-x64/home/tmy/src/cl-test-grid/work-dir/agent/quicklisp/dists/quicklisp/software/iolib-v0.8.3/src/syscalls/ffi-types-unix.c:155: error: 'EISCONN' was not declared in this scope /home/tmy/.cache/common-lisp/sbcl-1.4.5.openbsd-bsd-x64/home/tmy/src/cl-test-grid/work-dir/agent/quicklisp/dists/quicklisp/software/iolib-v0.8.3/src/syscalls/ffi-types-unix.c:156: error: 'EISDIR' was not declared in this scope /home/tmy/.cache/common-lisp/sbcl-1.4.5.openbsd-bsd-x64/home/tmy/src/cl-test-grid/work-dir/agent/quicklisp/dists/quicklisp/software/iolib-v0.8.3/src/syscalls/ffi-types-unix.c:199: error: 'ELOOP' was not declared in this scope /home/tmy/.cache/common-lisp/sbcl-1.4.5.openbsd-bsd-x64/home/tmy/src/cl-test-grid/work-dir/agent/quicklisp/dists/quicklisp/software/iolib-v0.8.3/src/syscalls/ffi-types-unix.c:203: error: 'EMFILE' was not declared in this scope /home/tmy/.cache/common-lisp/sbcl-1.4.5.openbsd-bsd-x64/home/tmy/src/cl-test-grid/work-dir/agent/quicklisp/dists/quicklisp/software/iolib-v0.8.3/src/syscalls/ffi-types-unix.c:204: error: 'EMLINK' was not declared in this scope /home/tmy/.cache/common-lisp/sbcl-1.4.5.openbsd-bsd-x64/home/tmy/src/cl-test-grid/work-dir/agent/quicklisp/dists/quicklisp/software/iolib-v0.8.3/src/syscalls/ffi-types-unix.c:205: error: 'EMSGSIZE' was not declared in this scope /home/tmy/.cache/common-lisp/sbcl-1.4.5.openbsd-bsd-x64/home/tmy/src/cl-test-grid/work-dir/agent/quicklisp/dists/quicklisp/software/iolib-v0.8.3/src/syscalls/ffi-types-unix.c:206: error: 'EMULTIHOP' was not declared in this scope /home/tmy/.cache/common-lisp/sbcl-1.4.5.openbsd-bsd-x64/home/tmy/src/cl-test-grid/work-dir/agent/quicklisp/dists/quicklisp/software/iolib-v0.8.3/src/syscalls/ffi-types-unix.c:207: error: 'ENAMETOOLONG' was not declared in this scope /home/tmy/.cache/common-lisp/sbcl-1.4.5.openbsd-bsd-x64/home/tmy/src/cl-test-grid/work-dir/agent/quicklisp/dists/quicklisp/software/iolib-v0.8.3/src/syscalls/ffi-types-unix.c:211: error: 'ENETDOWN' was not declared in this scope /home/tmy/.cache/common-lisp/sbcl-1.4.5.openbsd-bsd-x64/home/tmy/src/cl-test-grid/work-dir/agent/quicklisp/dists/quicklisp/software/iolib-v0.8.3/src/syscalls/ffi-types-unix.c:212: error: 'ENETRESET' was not declared in this scope /home/tmy/.cache/common-lisp/sbcl-1.4.5.openbsd-bsd-x64/home/tmy/src/cl-test-grid/work-dir/agent/quicklisp/dists/quicklisp/software/iolib-v0.8.3/src/syscalls/ffi-types-unix.c:213: error: 'ENETUNREACH' was not declared in this scope /home/tmy/.cache/common-lisp/sbcl-1.4.5.openbsd-bsd-x64/home/tmy/src/cl-test-grid/work-dir/agent/quicklisp/dists/quicklisp/software/iolib-v0.8.3/src/syscalls/ffi-types-unix.c:214: error: 'ENFILE' was not declared in this scope /home/tmy/.cache/common-lisp/sbcl-1.4.5.openbsd-bsd-x64/home/tmy/src/cl-test-grid/work-dir/agent/quicklisp/dists/quicklisp/software/iolib-v0.8.3/src/syscalls/ffi-types-unix.c:218: error: 'ENOBUFS' was not declared in this scope /home/tmy/.cache/common-lisp/sbcl-1.4.5.openbsd-bsd-x64/home/tmy/src/cl-test-grid/work-dir/agent/quicklisp/dists/quicklisp/software/iolib-v0.8.3/src/syscalls/ffi-types-unix.c:225: error: 'ENODEV' was not declared in this scope /home/tmy/.cache/common-lisp/sbcl-1.4.5.openbsd-bsd-x64/home/tmy/src/cl-test-grid/work-dir/agent/quicklisp/dists/quicklisp/software/iolib-v0.8.3/src/syscalls/ffi-types-unix.c:226: error: 'ENOENT' was not declared in this scope /home/tmy/.cache/common-lisp/sbcl-1.4.5.openbsd-bsd-x64/home/tmy/src/cl-test-grid/work-dir/agent/quicklisp/dists/quicklisp/software/iolib-v0.8.3/src/syscalls/ffi-types-unix.c:227: error: 'ENOEXEC' was not declared in this scope /home/tmy/.cache/common-lisp/sbcl-1.4.5.openbsd-bsd-x64/home/tmy/src/cl-test-grid/work-dir/agent/quicklisp/dists/quicklisp/software/iolib-v0.8.3/src/syscalls/ffi-types-unix.c:231: error: 'ENOLCK' was not declared in this scope /home/tmy/.cache/common-lisp/sbcl-1.4.5.openbsd-bsd-x64/home/tmy/src/cl-test-grid/work-dir/agent/quicklisp/dists/quicklisp/software/iolib-v0.8.3/src/syscalls/ffi-types-unix.c:232: error: 'ENOLINK' was not declared in this scope /home/tmy/.cache/common-lisp/sbcl-1.4.5.openbsd-bsd-x64/home/tmy/src/cl-test-grid/work-dir/agent/quicklisp/dists/quicklisp/software/iolib-v0.8.3/src/syscalls/ffi-types-unix.c:236: error: 'ENOMEM' was not declared in this scope /home/tmy/.cache/common-lisp/sbcl-1.4.5.openbsd-bsd-x64/home/tmy/src/cl-test-grid/work-dir/agent/quicklisp/dists/quicklisp/software/iolib-v0.8.3/src/syscalls/ffi-types-unix.c:237: error: 'ENOMSG' was not declared in this scope /home/tmy/.cache/common-lisp/sbcl-1.4.5.openbsd-bsd-x64/home/tmy/src/cl-test-grid/work-dir/agent/quicklisp/dists/quicklisp/software/iolib-v0.8.3/src/syscalls/ffi-types-unix.c:244: error: 'ENOPROTOOPT' was not declared in this scope /home/tmy/.cache/common-lisp/sbcl-1.4.5.openbsd-bsd-x64/home/tmy/src/cl-test-grid/work-dir/agent/quicklisp/dists/quicklisp/software/iolib-v0.8.3/src/syscalls/ffi-types-unix.c:245: error: 'ENOSPC' was not declared in this scope /home/tmy/.cache/common-lisp/sbcl-1.4.5.openbsd-bsd-x64/home/tmy/src/cl-test-grid/work-dir/agent/quicklisp/dists/quicklisp/software/iolib-v0.8.3/src/syscalls/ffi-types-unix.c:252: error: 'ENOSYS' was not declared in this scope /home/tmy/.cache/common-lisp/sbcl-1.4.5.openbsd-bsd-x64/home/tmy/src/cl-test-grid/work-dir/agent/quicklisp/dists/quicklisp/software/iolib-v0.8.3/src/syscalls/ffi-types-unix.c:256: error: 'ENOTCONN' was not declared in this scope /home/tmy/.cache/common-lisp/sbcl-1.4.5.openbsd-bsd-x64/home/tmy/src/cl-test-grid/work-dir/agent/quicklisp/dists/quicklisp/software/iolib-v0.8.3/src/syscalls/ffi-types-unix.c:257: error: 'ENOTDIR' was not declared in this scope /home/tmy/.cache/common-lisp/sbcl-1.4.5.openbsd-bsd-x64/home/tmy/src/cl-test-grid/work-dir/agent/quicklisp/dists/quicklisp/software/iolib-v0.8.3/src/syscalls/ffi-types-unix.c:258: error: 'ENOTEMPTY' was not declared in this scope /home/tmy/.cache/common-lisp/sbcl-1.4.5.openbsd-bsd-x64/home/tmy/src/cl-test-grid/work-dir/agent/quicklisp/dists/quicklisp/software/iolib-v0.8.3/src/syscalls/ffi-types-unix.c:265: error: 'ENOTSOCK' was not declared in this scope /home/tmy/.cache/common-lisp/sbcl-1.4.5.openbsd-bsd-x64/home/tmy/src/cl-test-grid/work-dir/agent/quicklisp/dists/quicklisp/software/iolib-v0.8.3/src/syscalls/ffi-types-unix.c:266: error: 'ENOTSUP' was not declared in this scope /home/tmy/.cache/common-lisp/sbcl-1.4.5.openbsd-bsd-x64/home/tmy/src/cl-test-grid/work-dir/agent/quicklisp/dists/quicklisp/software/iolib-v0.8.3/src/syscalls/ffi-types-unix.c:267: error: 'ENOTTY' was not declared in this scope /home/tmy/.cache/common-lisp/sbcl-1.4.5.openbsd-bsd-x64/home/tmy/src/cl-test-grid/work-dir/agent/quicklisp/dists/quicklisp/software/iolib-v0.8.3/src/syscalls/ffi-types-unix.c:271: error: 'ENXIO' was not declared in this scope /home/tmy/.cache/common-lisp/sbcl-1.4.5.openbsd-bsd-x64/home/tmy/src/cl-test-grid/work-dir/agent/quicklisp/dists/quicklisp/software/iolib-v0.8.3/src/syscalls/ffi-types-unix.c:272: error: 'EOPNOTSUPP' was not declared in this scope /home/tmy/.cache/common-lisp/sbcl-1.4.5.openbsd-bsd-x64/home/tmy/src/cl-test-grid/work-dir/agent/quicklisp/dists/quicklisp/software/iolib-v0.8.3/src/syscalls/ffi-types-unix.c:273: error: 'EOVERFLOW' was not declared in this scope /home/tmy/.cache/common-lisp/sbcl-1.4.5.openbsd-bsd-x64/home/tmy/src/cl-test-grid/work-dir/agent/quicklisp/dists/quicklisp/software/iolib-v0.8.3/src/syscalls/ffi-types-unix.c:277: error: 'EPERM' was not declared in this scope /home/tmy/.cache/common-lisp/sbcl-1.4.5.openbsd-bsd-x64/home/tmy/src/cl-test-grid/work-dir/agent/quicklisp/dists/quicklisp/software/iolib-v0.8.3/src/syscalls/ffi-types-unix.c:281: error: 'EPIPE' was not declared in this scope /home/tmy/.cache/common-lisp/sbcl-1.4.5.openbsd-bsd-x64/home/tmy/src/cl-test-grid/work-dir/agent/quicklisp/dists/quicklisp/software/iolib-v0.8.3/src/syscalls/ffi-types-unix.c:282: error: 'EPROTO' was not declared in this scope /home/tmy/.cache/common-lisp/sbcl-1.4.5.openbsd-bsd-x64/home/tmy/src/cl-test-grid/work-dir/agent/quicklisp/dists/quicklisp/software/iolib-v0.8.3/src/syscalls/ffi-types-unix.c:283: error: 'EPROTONOSUPPORT' was not declared in this scope /home/tmy/.cache/common-lisp/sbcl-1.4.5.openbsd-bsd-x64/home/tmy/src/cl-test-grid/work-dir/agent/quicklisp/dists/quicklisp/software/iolib-v0.8.3/src/syscalls/ffi-types-unix.c:284: error: 'EPROTOTYPE' was not declared in this scope /home/tmy/.cache/common-lisp/sbcl-1.4.5.openbsd-bsd-x64/home/tmy/src/cl-test-grid/work-dir/agent/quicklisp/dists/quicklisp/software/iolib-v0.8.3/src/syscalls/ffi-types-unix.c:285: error: 'ERANGE' was not declared in this scope /home/tmy/.cache/common-lisp/sbcl-1.4.5.openbsd-bsd-x64/home/tmy/src/cl-test-grid/work-dir/agent/quicklisp/dists/quicklisp/software/iolib-v0.8.3/src/syscalls/ffi-types-unix.c:301: error: 'EROFS' was not declared in this scope /home/tmy/.cache/common-lisp/sbcl-1.4.5.openbsd-bsd-x64/home/tmy/src/cl-test-grid/work-dir/agent/quicklisp/dists/quicklisp/software/iolib-v0.8.3/src/syscalls/ffi-types-unix.c:302: error: 'ESHUTDOWN' was not declared in this scope /home/tmy/.cache/common-lisp/sbcl-1.4.5.openbsd-bsd-x64/home/tmy/src/cl-test-grid/work-dir/agent/quicklisp/dists/quicklisp/software/iolib-v0.8.3/src/syscalls/ffi-types-unix.c:306: error: 'ESPIPE' was not declared in this scope /home/tmy/.cache/common-lisp/sbcl-1.4.5.openbsd-bsd-x64/home/tmy/src/cl-test-grid/work-dir/agent/quicklisp/dists/quicklisp/software/iolib-v0.8.3/src/syscalls/ffi-types-unix.c:307: error: 'ESRCH' was not declared in this scope /home/tmy/.cache/common-lisp/sbcl-1.4.5.openbsd-bsd-x64/home/tmy/src/cl-test-grid/work-dir/agent/quicklisp/dists/quicklisp/software/iolib-v0.8.3/src/syscalls/ffi-types-unix.c:311: error: 'ESTALE' was not declared in this scope /home/tmy/.cache/common-lisp/sbcl-1.4.5.openbsd-bsd-x64/home/tmy/src/cl-test-grid/work-dir/agent/quicklisp/dists/quicklisp/software/iolib-v0.8.3/src/syscalls/ffi-types-unix.c:318: error: 'ETIMEDOUT' was not declared in this scope /home/tmy/.cache/common-lisp/sbcl-1.4.5.openbsd-bsd-x64/home/tmy/src/cl-test-grid/work-dir/agent/quicklisp/dists/quicklisp/software/iolib-v0.8.3/src/syscalls/ffi-types-unix.c:322: error: 'ETXTBSY' was not declared in this scope /home/tmy/.cache/common-lisp/sbcl-1.4.5.openbsd-bsd-x64/home/tmy/src/cl-test-grid/work-dir/agent/quicklisp/dists/quicklisp/software/iolib-v0.8.3/src/syscalls/ffi-types-unix.c:332: error: 'EWOULDBLOCK' was not declared in this scope /home/tmy/.cache/common-lisp/sbcl-1.4.5.openbsd-bsd-x64/home/tmy/src/cl-test-grid/work-dir/agent/quicklisp/dists/quicklisp/software/iolib-v0.8.3/src/syscalls/ffi-types-unix.c:333: error: 'EXDEV' was not declared in this scope /home/tmy/.cache/common-lisp/sbcl-1.4.5.openbsd-bsd-x64/home/tmy/src/cl-test-grid/work-dir/agent/quicklisp/dists/quicklisp/software/iolib-v0.8.3/src/syscalls/ffi-types-unix.c:337: error: 'EBUG' was not declared in this scope /home/tmy/.cache/common-lisp/sbcl-1.4.5.openbsd-bsd-x64/home/tmy/src/cl-test-grid/work-dir/agent/quicklisp/dists/quicklisp/software/iolib-v0.8.3/src/syscalls/ffi-types-unix.c:1429: error: invalid application of 'sizeof' to incomplete type 'stat' /home/tmy/.cache/common-lisp/sbcl-1.4.5.openbsd-bsd-x64/home/tmy/src/cl-test-grid/work-dir/agent/quicklisp/dists/quicklisp/software/iolib-v0.8.3/src/syscalls/ffi-types-unix.c:1430: error: invalid use of incomplete type 'struct stat' /home/tmy/.cache/common-lisp/sbcl-1.4.5.openbsd-bsd-x64/home/tmy/src/cl-test-grid/work-dir/agent/quicklisp/dists/quicklisp/software/iolib-v0.8.3/src/syscalls/ffi-types-unix.c:1429: error: forward declaration of 'struct stat' /home/tmy/.cache/common-lisp/sbcl-1.4.5.openbsd-bsd-x64/home/tmy/src/cl-test-grid/work-dir/agent/quicklisp/dists/quicklisp/software/iolib-v0.8.3/src/syscalls/ffi-types-unix.c:1431: error: invalid use of incomplete type 'struct stat' /home/tmy/.cache/common-lisp/sbcl-1.4.5.openbsd-bsd-x64/home/tmy/src/cl-test-grid/work-dir/agent/quicklisp/dists/quicklisp/software/iolib-v0.8.3/src/syscalls/ffi-types-unix.c:1429: error: forward declaration of 'struct stat' /home/tmy/.cache/common-lisp/sbcl-1.4.5.openbsd-bsd-x64/home/tmy/src/cl-test-grid/work-dir/agent/quicklisp/dists/quicklisp/software/iolib-v0.8.3/src/syscalls/ffi-types-unix.c:1432: error: invalid use of incomplete type 'struct stat' /home/tmy/.cache/common-lisp/sbcl-1.4.5.openbsd-bsd-x64/home/tmy/src/cl-test-grid/work-dir/agent/quicklisp/dists/quicklisp/software/iolib-v0.8.3/src/syscalls/ffi-types-unix.c:1429: error: forward declaration of 'struct stat' /home/tmy/.cache/common-lisp/sbcl-1.4.5.openbsd-bsd-x64/home/tmy/src/cl-test-grid/work-dir/agent/quicklisp/dists/quicklisp/software/iolib-v0.8.3/src/syscalls/ffi-types-unix.c:1433: error: invalid use of incomplete type 'struct stat' /home/tmy/.cache/common-lisp/sbcl-1.4.5.openbsd-bsd-x64/home/tmy/src/cl-test-grid/work-dir/agent/quicklisp/dists/quicklisp/software/iolib-v0.8.3/src/syscalls/ffi-types-unix.c:1429: error: forward declaration of 'struct stat' /home/tmy/.cache/common-lisp/sbcl-1.4.5.openbsd-bsd-x64/home/tmy/src/cl-test-grid/work-dir/agent/quicklisp/dists/quicklisp/software/iolib-v0.8.3/src/syscalls/ffi-types-unix.c:1434: error: invalid use of incomplete type 'struct stat' /home/tmy/.cache/common-lisp/sbcl-1.4.5.openbsd-bsd-x64/home/tmy/src/cl-test-grid/work-dir/agent/quicklisp/dists/quicklisp/software/iolib-v0.8.3/src/syscalls/ffi-types-unix.c:1429: error: forward declaration of 'struct stat' /home/tmy/.cache/common-lisp/sbcl-1.4.5.openbsd-bsd-x64/home/tmy/src/cl-test-grid/work-dir/agent/quicklisp/dists/quicklisp/software/iolib-v0.8.3/src/syscalls/ffi-types-unix.c:1435: error: invalid use of incomplete type 'struct stat' /home/tmy/.cache/common-lisp/sbcl-1.4.5.openbsd-bsd-x64/home/tmy/src/cl-test-grid/work-dir/agent/quicklisp/dists/quicklisp/software/iolib-v0.8.3/src/syscalls/ffi-types-unix.c:1429: error: forward declaration of 'struct stat' /home/tmy/.cache/common-lisp/sbcl-1.4.5.openbsd-bsd-x64/home/tmy/src/cl-test-grid/work-dir/agent/quicklisp/dists/quicklisp/software/iolib-v0.8.3/src/syscalls/ffi-types-unix.c:1436: error: invalid use of incomplete type 'struct stat' /home/tmy/.cache/common-lisp/sbcl-1.4.5.openbsd-bsd-x64/home/tmy/src/cl-test-grid/work-dir/agent/quicklisp/dists/quicklisp/software/iolib-v0.8.3/src/syscalls/ffi-types-unix.c:1429: error: forward declaration of 'struct stat' /home/tmy/.cache/common-lisp/sbcl-1.4.5.openbsd-bsd-x64/home/tmy/src/cl-test-grid/work-dir/agent/quicklisp/dists/quicklisp/software/iolib-v0.8.3/src/syscalls/ffi-types-unix.c:1437: error: invalid use of incomplete type 'struct stat' /home/tmy/.cache/common-lisp/sbcl-1.4.5.openbsd-bsd-x64/home/tmy/src/cl-test-grid/work-dir/agent/quicklisp/dists/quicklisp/software/iolib-v0.8.3/src/syscalls/ffi-types-unix.c:1429: error: forward declaration of 'struct stat' /home/tmy/.cache/common-lisp/sbcl-1.4.5.openbsd-bsd-x64/home/tmy/src/cl-test-grid/work-dir/agent/quicklisp/dists/quicklisp/software/iolib-v0.8.3/src/syscalls/ffi-types-unix.c:1438: error: invalid use of incomplete type 'struct stat' /home/tmy/.cache/common-lisp/sbcl-1.4.5.openbsd-bsd-x64/home/tmy/src/cl-test-grid/work-dir/agent/quicklisp/dists/quicklisp/software/iolib-v0.8.3/src/syscalls/ffi-types-unix.c:1429: error: forward declaration of 'struct stat' /home/tmy/.cache/common-lisp/sbcl-1.4.5.openbsd-bsd-x64/home/tmy/src/cl-test-grid/work-dir/agent/quicklisp/dists/quicklisp/software/iolib-v0.8.3/src/syscalls/ffi-types-unix.c:1439: error: invalid use of incomplete type 'struct stat' /home/tmy/.cache/common-lisp/sbcl-1.4.5.openbsd-bsd-x64/home/tmy/src/cl-test-grid/work-dir/agent/quicklisp/dists/quicklisp/software/iolib-v0.8.3/src/syscalls/ffi-types-unix.c:1429: error: forward declaration of 'struct stat' /home/tmy/.cache/common-lisp/sbcl-1.4.5.openbsd-bsd-x64/home/tmy/src/cl-test-grid/work-dir/agent/quicklisp/dists/quicklisp/software/iolib-v0.8.3/src/syscalls/ffi-types-unix.c:1440: error: invalid use of incomplete type 'struct stat' /home/tmy/.cache/common-lisp/sbcl-1.4.5.openbsd-bsd-x64/home/tmy/src/cl-test-grid/work-dir/agent/quicklisp/dists/quicklisp/software/iolib-v0.8.3/src/syscalls/ffi-types-unix.c:1429: error: forward declaration of 'struct stat' /home/tmy/.cache/common-lisp/sbcl-1.4.5.openbsd-bsd-x64/home/tmy/src/cl-test-grid/work-dir/agent/quicklisp/dists/quicklisp/software/iolib-v0.8.3/src/syscalls/ffi-types-unix.c:1441: error: invalid use of incomplete type 'struct stat' /home/tmy/.cache/common-lisp/sbcl-1.4.5.openbsd-bsd-x64/home/tmy/src/cl-test-grid/work-dir/agent/quicklisp/dists/quicklisp/software/iolib-v0.8.3/src/syscalls/ffi-types-unix.c:1429: error: forward declaration of 'struct stat' /home/tmy/.cache/common-lisp/sbcl-1.4.5.openbsd-bsd-x64/home/tmy/src/cl-test-grid/work-dir/agent/quicklisp/dists/quicklisp/software/iolib-v0.8.3/src/syscalls/ffi-types-unix.c:1442: error: invalid use of incomplete type 'struct stat' /home/tmy/.cache/common-lisp/sbcl-1.4.5.openbsd-bsd-x64/home/tmy/src/cl-test-grid/work-dir/agent/quicklisp/dists/quicklisp/software/iolib-v0.8.3/src/syscalls/ffi-types-unix.c:1429: error: forward declaration of 'struct stat' /home/tmy/.cache/common-lisp/sbcl-1.4.5.openbsd-bsd-x64/home/tmy/src/cl-test-grid/work-dir/agent/quicklisp/dists/quicklisp/software/iolib-v0.8.3/src/syscalls/ffi-types-unix.c:1445: error: invalid application of 'sizeof' to incomplete type 'stat' /home/tmy/.cache/common-lisp/sbcl-1.4.5.openbsd-bsd-x64/home/tmy/src/cl-test-grid/work-dir/agent/quicklisp/dists/quicklisp/software/iolib-v0.8.3/src/syscalls/ffi-types-unix.c:1671: error: 'SIGHUP' was not declared in this scope /home/tmy/.cache/common-lisp/sbcl-1.4.5.openbsd-bsd-x64/home/tmy/src/cl-test-grid/work-dir/agent/quicklisp/dists/quicklisp/software/iolib-v0.8.3/src/syscalls/ffi-types-unix.c:1672: error: 'SIGINT' was not declared in this scope /home/tmy/.cache/common-lisp/sbcl-1.4.5.openbsd-bsd-x64/home/tmy/src/cl-test-grid/work-dir/agent/quicklisp/dists/quicklisp/software/iolib-v0.8.3/src/syscalls/ffi-types-unix.c:1673: error: 'SIGQUIT' was not declared in this scope /home/tmy/.cache/common-lisp/sbcl-1.4.5.openbsd-bsd-x64/home/tmy/src/cl-test-grid/work-dir/agent/quicklisp/dists/quicklisp/software/iolib-v0.8.3/src/syscalls/ffi-types-unix.c:1674: error: 'SIGILL' was not declared in this scope /home/tmy/.cache/common-lisp/sbcl-1.4.5.openbsd-bsd-x64/home/tmy/src/cl-test-grid/work-dir/agent/quicklisp/dists/quicklisp/software/iolib-v0.8.3/src/syscalls/ffi-types-unix.c:1675: error: 'SIGABRT' was not declared in this scope /home/tmy/.cache/common-lisp/sbcl-1.4.5.openbsd-bsd-x64/home/tmy/src/cl-test-grid/work-dir/agent/quicklisp/dists/quicklisp/software/iolib-v0.8.3/src/syscalls/ffi-types-unix.c:1676: error: 'SIGFPE' was not declared in this scope /home/tmy/.cache/common-lisp/sbcl-1.4.5.openbsd-bsd-x64/home/tmy/src/cl-test-grid/work-dir/agent/quicklisp/dists/quicklisp/software/iolib-v0.8.3/src/syscalls/ffi-types-unix.c:1677: error: 'SIGKILL' was not declared in this scope /home/tmy/.cache/common-lisp/sbcl-1.4.5.openbsd-bsd-x64/home/tmy/src/cl-test-grid/work-dir/agent/quicklisp/dists/quicklisp/software/iolib-v0.8.3/src/syscalls/ffi-types-unix.c:1678: error: 'SIGSEGV' was not declared in this scope /home/tmy/.cache/common-lisp/sbcl-1.4.5.openbsd-bsd-x64/home/tmy/src/cl-test-grid/work-dir/agent/quicklisp/dists/quicklisp/software/iolib-v0.8.3/src/syscalls/ffi-types-unix.c:1679: error: 'SIGPIPE' was not declared in this scope /home/tmy/.cache/common-lisp/sbcl-1.4.5.openbsd-bsd-x64/home/tmy/src/cl-test-grid/work-dir/agent/quicklisp/dists/quicklisp/software/iolib-v0.8.3/src/syscalls/ffi-types-unix.c:1680: error: 'SIGALRM' was not declared in this scope /home/tmy/.cache/common-lisp/sbcl-1.4.5.openbsd-bsd-x64/home/tmy/src/cl-test-grid/work-dir/agent/quicklisp/dists/quicklisp/software/iolib-v0.8.3/src/syscalls/ffi-types-unix.c:1681: error: 'SIGTERM' was not declared in this scope /home/tmy/.cache/common-lisp/sbcl-1.4.5.openbsd-bsd-x64/home/tmy/src/cl-test-grid/work-dir/agent/quicklisp/dists/quicklisp/software/iolib-v0.8.3/src/syscalls/ffi-types-unix.c:1682: error: 'SIGUSR1' was not declared in this scope /home/tmy/.cache/common-lisp/sbcl-1.4.5.openbsd-bsd-x64/home/tmy/src/cl-test-grid/work-dir/agent/quicklisp/dists/quicklisp/software/iolib-v0.8.3/src/syscalls/ffi-types-unix.c:1683: error: 'SIGUSR2' was not declared in this scope /home/tmy/.cache/common-lisp/sbcl-1.4.5.openbsd-bsd-x64/home/tmy/src/cl-test-grid/work-dir/agent/quicklisp/dists/quicklisp/software/iolib-v0.8.3/src/syscalls/ffi-types-unix.c:1684: error: 'SIGCHLD' was not declared in this scope /home/tmy/.cache/common-lisp/sbcl-1.4.5.openbsd-bsd-x64/home/tmy/src/cl-test-grid/work-dir/agent/quicklisp/dists/quicklisp/software/iolib-v0.8.3/src/syscalls/ffi-types-unix.c:1685: error: 'SIGCONT' was not declared in this scope /home/tmy/.cache/common-lisp/sbcl-1.4.5.openbsd-bsd-x64/home/tmy/src/cl-test-grid/work-dir/agent/quicklisp/dists/quicklisp/software/iolib-v0.8.3/src/syscalls/ffi-types-unix.c:1686: error: 'SIGSTOP' was not declared in this scope /home/tmy/.cache/common-lisp/sbcl-1.4.5.openbsd-bsd-x64/home/tmy/src/cl-test-grid/work-dir/agent/quicklisp/dists/quicklisp/software/iolib-v0.8.3/src/syscalls/ffi-types-unix.c:1687: error: 'SIGTSTP' was not declared in this scope /home/tmy/.cache/common-lisp/sbcl-1.4.5.openbsd-bsd-x64/home/tmy/src/cl-test-grid/work-dir/agent/quicklisp/dists/quicklisp/software/iolib-v0.8.3/src/syscalls/ffi-types-unix.c:1688: error: 'SIGTTIN' was not declared in this scope /home/tmy/.cache/common-lisp/sbcl-1.4.5.openbsd-bsd-x64/home/tmy/src/cl-test-grid/work-dir/agent/quicklisp/dists/quicklisp/software/iolib-v0.8.3/src/syscalls/ffi-types-unix.c:1689: error: 'SIGTTOU' was not declared in this scope /home/tmy/.cache/common-lisp/sbcl-1.4.5.openbsd-bsd-x64/home/tmy/src/cl-test-grid/work-dir/agent/quicklisp/dists/quicklisp/software/iolib-v0.8.3/src/syscalls/ffi-types-unix.c:1690: error: 'SIGBUS' was not declared in this scope /home/tmy/.cache/common-lisp/sbcl-1.4.5.openbsd-bsd-x64/home/tmy/src/cl-test-grid/work-dir/agent/quicklisp/dists/quicklisp/software/iolib-v0.8.3/src/syscalls/ffi-types-unix.c:1694: error: 'SIGPROF' was not declared in this scope /home/tmy/.cache/common-lisp/sbcl-1.4.5.openbsd-bsd-x64/home/tmy/src/cl-test-grid/work-dir/agent/quicklisp/dists/quicklisp/software/iolib-v0.8.3/src/syscalls/ffi-types-unix.c:1695: error: 'SIGSYS' was not declared in this scope /home/tmy/.cache/common-lisp/sbcl-1.4.5.openbsd-bsd-x64/home/tmy/src/cl-test-grid/work-dir/agent/quicklisp/dists/quicklisp/software/iolib-v0.8.3/src/syscalls/ffi-types-unix.c:1696: error: 'SIGTRAP' was not declared in this scope /home/tmy/.cache/common-lisp/sbcl-1.4.5.openbsd-bsd-x64/home/tmy/src/cl-test-grid/work-dir/agent/quicklisp/dists/quicklisp/software/iolib-v0.8.3/src/syscalls/ffi-types-unix.c:1697: error: 'SIGURG' was not declared in this scope /home/tmy/.cache/common-lisp/sbcl-1.4.5.openbsd-bsd-x64/home/tmy/src/cl-test-grid/work-dir/agent/quicklisp/dists/quicklisp/software/iolib-v0.8.3/src/syscalls/ffi-types-unix.c:1698: error: 'SIGVTALRM' was not declared in this scope /home/tmy/.cache/common-lisp/sbcl-1.4.5.openbsd-bsd-x64/home/tmy/src/cl-test-grid/work-dir/agent/quicklisp/dists/quicklisp/software/iolib-v0.8.3/src/syscalls/ffi-types-unix.c:1699: error: 'SIGXCPU' was not declared in this scope /home/tmy/.cache/common-lisp/sbcl-1.4.5.openbsd-bsd-x64/home/tmy/src/cl-test-grid/work-dir/agent/quicklisp/dists/quicklisp/software/iolib-v0.8.3/src/syscalls/ffi-types-unix.c:1700: error: 'SIGXFSZ' was not declared in this scope /home/tmy/.cache/common-lisp/sbcl-1.4.5.openbsd-bsd-x64/home/tmy/src/cl-test-grid/work-dir/agent/quicklisp/dists/quicklisp/software/iolib-v0.8.3/src/syscalls/ffi-types-unix.c:1704: error: 'SIGIO' was not declared in this scope /home/tmy/.cache/common-lisp/sbcl-1.4.5.openbsd-bsd-x64/home/tmy/src/cl-test-grid/work-dir/agent/quicklisp/dists/quicklisp/software/iolib-v0.8.3/src/syscalls/ffi-types-unix.c:1717: error: 'SIGWINCH' was not declared in this scope /home/tmy/.cache/common-lisp/sbcl-1.4.5.openbsd-bsd-x64/home/tmy/src/cl-test-grid/work-dir/agent/quicklisp/dists/quicklisp/software/iolib-v0.8.3/src/syscalls/ffi-types-unix.c:1968: error: invalid application of 'sizeof' to incomplete type 'sigaction' /home/tmy/.cache/common-lisp/sbcl-1.4.5.openbsd-bsd-x64/home/tmy/src/cl-test-grid/work-dir/agent/quicklisp/dists/quicklisp/software/iolib-v0.8.3/src/syscalls/ffi-types-unix.c:1969: error: invalid use of incomplete type 'struct sigaction' /home/tmy/.cache/common-lisp/sbcl-1.4.5.openbsd-bsd-x64/home/tmy/src/cl-test-grid/work-dir/agent/quicklisp/dists/quicklisp/software/iolib-v0.8.3/src/syscalls/ffi-types-unix.c:1968: error: forward declaration of 'struct sigaction' /home/tmy/.cache/common-lisp/sbcl-1.4.5.openbsd-bsd-x64/home/tmy/src/cl-test-grid/work-dir/agent/quicklisp/dists/quicklisp/software/iolib-v0.8.3/src/syscalls/ffi-types-unix.c:1970: error: invalid use of incomplete type 'struct sigaction' /home/tmy/.cache/common-lisp/sbcl-1.4.5.openbsd-bsd-x64/home/tmy/src/cl-test-grid/work-dir/agent/quicklisp/dists/quicklisp/software/iolib-v0.8.3/src/syscalls/ffi-types-unix.c:1968: error: forward declaration of 'struct sigaction' /home/tmy/.cache/common-lisp/sbcl-1.4.5.openbsd-bsd-x64/home/tmy/src/cl-test-grid/work-dir/agent/quicklisp/dists/quicklisp/software/iolib-v0.8.3/src/syscalls/ffi-types-unix.c:1971: error: invalid use of incomplete type 'struct sigaction' /home/tmy/.cache/common-lisp/sbcl-1.4.5.openbsd-bsd-x64/home/tmy/src/cl-test-grid/work-dir/agent/quicklisp/dists/quicklisp/software/iolib-v0.8.3/src/syscalls/ffi-types-unix.c:1968: error: forward declaration of 'struct sigaction' /home/tmy/.cache/common-lisp/sbcl-1.4.5.openbsd-bsd-x64/home/tmy/src/cl-test-grid/work-dir/agent/quicklisp/dists/quicklisp/software/iolib-v0.8.3/src/syscalls/ffi-types-unix.c:1972: error: invalid use of incomplete type 'struct sigaction' /home/tmy/.cache/common-lisp/sbcl-1.4.5.openbsd-bsd-x64/home/tmy/src/cl-test-grid/work-dir/agent/quicklisp/dists/quicklisp/software/iolib-v0.8.3/src/syscalls/ffi-types-unix.c:1968: error: forward declaration of 'struct sigaction' /home/tmy/.cache/common-lisp/sbcl-1.4.5.openbsd-bsd-x64/home/tmy/src/cl-test-grid/work-dir/agent/quicklisp/dists/quicklisp/software/iolib-v0.8.3/src/syscalls/ffi-types-unix.c:1975: error: invalid application of 'sizeof' to incomplete type 'sigaction' /home/tmy/.cache/common-lisp/sbcl-1.4.5.openbsd-bsd-x64/home/tmy/src/cl-test-grid/work-dir/agent/quicklisp/dists/quicklisp/software/iolib-v0.8.3/src/syscalls/ffi-types-unix.c:2183: error: invalid application of 'sizeof' to incomplete type 'dirent' /home/tmy/.cache/common-lisp/sbcl-1.4.5.openbsd-bsd-x64/home/tmy/src/cl-test-grid/work-dir/agent/quicklisp/dists/quicklisp/software/iolib-v0.8.3/src/syscalls/ffi-types-unix.c:2184: error: invalid use of incomplete type 'struct dirent' /home/tmy/.cache/common-lisp/sbcl-1.4.5.openbsd-bsd-x64/home/tmy/src/cl-test-grid/work-dir/agent/quicklisp/dists/quicklisp/software/iolib-v0.8.3/src/syscalls/ffi-types-unix.c:2183: error: forward declaration of 'struct dirent' /home/tmy/.cache/common-lisp/sbcl-1.4.5.openbsd-bsd-x64/home/tmy/src/cl-test-grid/work-dir/agent/quicklisp/dists/quicklisp/software/iolib-v0.8.3/src/syscalls/ffi-types-unix.c:2185: error: invalid use of incomplete type 'struct dirent' /home/tmy/.cache/common-lisp/sbcl-1.4.5.openbsd-bsd-x64/home/tmy/src/cl-test-grid/work-dir/agent/quicklisp/dists/quicklisp/software/iolib-v0.8.3/src/syscalls/ffi-types-unix.c:2183: error: forward declaration of 'struct dirent' /home/tmy/.cache/common-lisp/sbcl-1.4.5.openbsd-bsd-x64/home/tmy/src/cl-test-grid/work-dir/agent/quicklisp/dists/quicklisp/software/iolib-v0.8.3/src/syscalls/ffi-types-unix.c:2186: error: invalid use of incomplete type 'struct dirent' /home/tmy/.cache/common-lisp/sbcl-1.4.5.openbsd-bsd-x64/home/tmy/src/cl-test-grid/work-dir/agent/quicklisp/dists/quicklisp/software/iolib-v0.8.3/src/syscalls/ffi-types-unix.c:2183: error: forward declaration of 'struct dirent' /home/tmy/.cache/common-lisp/sbcl-1.4.5.openbsd-bsd-x64/home/tmy/src/cl-test-grid/work-dir/agent/quicklisp/dists/quicklisp/software/iolib-v0.8.3/src/syscalls/ffi-types-unix.c:2186: error: invalid use of incomplete type 'struct dirent' /home/tmy/.cache/common-lisp/sbcl-1.4.5.openbsd-bsd-x64/home/tmy/src/cl-test-grid/work-dir/agent/quicklisp/dists/quicklisp/software/iolib-v0.8.3/src/syscalls/ffi-types-unix.c:2183: error: forward declaration of 'struct dirent' /home/tmy/.cache/common-lisp/sbcl-1.4.5.openbsd-bsd-x64/home/tmy/src/cl-test-grid/work-dir/agent/quicklisp/dists/quicklisp/software/iolib-v0.8.3/src/syscalls/ffi-types-unix.c:2186: error: invalid use of incomplete type 'struct dirent' /home/tmy/.cache/common-lisp/sbcl-1.4.5.openbsd-bsd-x64/home/tmy/src/cl-test-grid/work-dir/agent/quicklisp/dists/quicklisp/software/iolib-v0.8.3/src/syscalls/ffi-types-unix.c:2183: error: forward declaration of 'struct dirent' /home/tmy/.cache/common-lisp/sbcl-1.4.5.openbsd-bsd-x64/home/tmy/src/cl-test-grid/work-dir/agent/quicklisp/dists/quicklisp/software/iolib-v0.8.3/src/syscalls/ffi-types-unix.c:2189: error: invalid application of 'sizeof' to incomplete type 'dirent' /home/tmy/.cache/common-lisp/sbcl-1.4.5.openbsd-bsd-x64/home/tmy/src/cl-test-grid/work-dir/agent/quicklisp/dists/quicklisp/software/iolib-v0.8.3/src/syscalls/ffi-types-unix.c:2255: error: invalid application of 'sizeof' to incomplete type 'rlimit' /home/tmy/.cache/common-lisp/sbcl-1.4.5.openbsd-bsd-x64/home/tmy/src/cl-test-grid/work-dir/agent/quicklisp/dists/quicklisp/software/iolib-v0.8.3/src/syscalls/ffi-types-unix.c:2256: error: invalid use of incomplete type 'struct rlimit' /home/tmy/.cache/common-lisp/sbcl-1.4.5.openbsd-bsd-x64/home/tmy/src/cl-test-grid/work-dir/agent/quicklisp/dists/quicklisp/software/iolib-v0.8.3/src/syscalls/ffi-types-unix.c:2255: error: forward declaration of 'struct rlimit' /home/tmy/.cache/common-lisp/sbcl-1.4.5.openbsd-bsd-x64/home/tmy/src/cl-test-grid/work-dir/agent/quicklisp/dists/quicklisp/software/iolib-v0.8.3/src/syscalls/ffi-types-unix.c:2257: error: invalid use of incomplete type 'struct rlimit' /home/tmy/.cache/common-lisp/sbcl-1.4.5.openbsd-bsd-x64/home/tmy/src/cl-test-grid/work-dir/agent/quicklisp/dists/quicklisp/software/iolib-v0.8.3/src/syscalls/ffi-types-unix.c:2255: error: forward declaration of 'struct rlimit' /home/tmy/.cache/common-lisp/sbcl-1.4.5.openbsd-bsd-x64/home/tmy/src/cl-test-grid/work-dir/agent/quicklisp/dists/quicklisp/software/iolib-v0.8.3/src/syscalls/ffi-types-unix.c:2260: error: invalid application of 'sizeof' to incomplete type 'rlimit' /home/tmy/.cache/common-lisp/sbcl-1.4.5.openbsd-bsd-x64/home/tmy/src/cl-test-grid/work-dir/agent/quicklisp/dists/quicklisp/software/iolib-v0.8.3/src/syscalls/ffi-types-unix.c:2263: error: invalid application of 'sizeof' to incomplete type 'rusage' /home/tmy/.cache/common-lisp/sbcl-1.4.5.openbsd-bsd-x64/home/tmy/src/cl-test-grid/work-dir/agent/quicklisp/dists/quicklisp/software/iolib-v0.8.3/src/syscalls/ffi-types-unix.c:2264: error: invalid use of incomplete type 'struct rusage' /home/tmy/.cache/common-lisp/sbcl-1.4.5.openbsd-bsd-x64/home/tmy/src/cl-test-grid/work-dir/agent/quicklisp/dists/quicklisp/software/iolib-v0.8.3/src/syscalls/ffi-types-unix.c:2263: error: forward declaration of 'struct rusage' /home/tmy/.cache/common-lisp/sbcl-1.4.5.openbsd-bsd-x64/home/tmy/src/cl-test-grid/work-dir/agent/quicklisp/dists/quicklisp/software/iolib-v0.8.3/src/syscalls/ffi-types-unix.c:2265: error: invalid use of incomplete type 'struct rusage' /home/tmy/.cache/common-lisp/sbcl-1.4.5.openbsd-bsd-x64/home/tmy/src/cl-test-grid/work-dir/agent/quicklisp/dists/quicklisp/software/iolib-v0.8.3/src/syscalls/ffi-types-unix.c:2263: error: forward declaration of 'struct rusage' /home/tmy/.cache/common-lisp/sbcl-1.4.5.openbsd-bsd-x64/home/tmy/src/cl-test-grid/work-dir/agent/quicklisp/dists/quicklisp/software/iolib-v0.8.3/src/syscalls/ffi-types-unix.c:2266: error: invalid use of incomplete type 'struct rusage' /home/tmy/.cache/common-lisp/sbcl-1.4.5.openbsd-bsd-x64/home/tmy/src/cl-test-grid/work-dir/agent/quicklisp/dists/quicklisp/software/iolib-v0.8.3/src/syscalls/ffi-types-unix.c:2263: error: forward declaration of 'struct rusage' /home/tmy/.cache/common-lisp/sbcl-1.4.5.openbsd-bsd-x64/home/tmy/src/cl-test-grid/work-dir/agent/quicklisp/dists/quicklisp/software/iolib-v0.8.3/src/syscalls/ffi-types-unix.c:2267: error: invalid use of incomplete type 'struct rusage' /home/tmy/.cache/common-lisp/sbcl-1.4.5.openbsd-bsd-x64/home/tmy/src/cl-test-grid/work-dir/agent/quicklisp/dists/quicklisp/software/iolib-v0.8.3/src/syscalls/ffi-types-unix.c:2263: error: forward declaration of 'struct rusage' /home/tmy/.cache/common-lisp/sbcl-1.4.5.openbsd-bsd-x64/home/tmy/src/cl-test-grid/work-dir/agent/quicklisp/dists/quicklisp/software/iolib-v0.8.3/src/syscalls/ffi-types-unix.c:2268: error: invalid use of incomplete type 'struct rusage' /home/tmy/.cache/common-lisp/sbcl-1.4.5.openbsd-bsd-x64/home/tmy/src/cl-test-grid/work-dir/agent/quicklisp/dists/quicklisp/software/iolib-v0.8.3/src/syscalls/ffi-types-unix.c:2263: error: forward declaration of 'struct rusage' /home/tmy/.cache/common-lisp/sbcl-1.4.5.openbsd-bsd-x64/home/tmy/src/cl-test-grid/work-dir/agent/quicklisp/dists/quicklisp/software/iolib-v0.8.3/src/syscalls/ffi-types-unix.c:2269: error: invalid use of incomplete type 'struct rusage' /home/tmy/.cache/common-lisp/sbcl-1.4.5.openbsd-bsd-x64/home/tmy/src/cl-test-grid/work-dir/agent/quicklisp/dists/quicklisp/software/iolib-v0.8.3/src/syscalls/ffi-types-unix.c:2263: error: forward declaration of 'struct rusage' /home/tmy/.cache/common-lisp/sbcl-1.4.5.openbsd-bsd-x64/home/tmy/src/cl-test-grid/work-dir/agent/quicklisp/dists/quicklisp/software/iolib-v0.8.3/src/syscalls/ffi-types-unix.c:2270: error: invalid use of incomplete type 'struct rusage' /home/tmy/.cache/common-lisp/sbcl-1.4.5.openbsd-bsd-x64/home/tmy/src/cl-test-grid/work-dir/agent/quicklisp/dists/quicklisp/software/iolib-v0.8.3/src/syscalls/ffi-types-unix.c:2263: error: forward declaration of 'struct rusage' /home/tmy/.cache/common-lisp/sbcl-1.4.5.openbsd-bsd-x64/home/tmy/src/cl-test-grid/work-dir/agent/quicklisp/dists/quicklisp/software/iolib-v0.8.3/src/syscalls/ffi-types-unix.c:2271: error: invalid use of incomplete type 'struct rusage' /home/tmy/.cache/common-lisp/sbcl-1.4.5.openbsd-bsd-x64/home/tmy/src/cl-test-grid/work-dir/agent/quicklisp/dists/quicklisp/software/iolib-v0.8.3/src/syscalls/ffi-types-unix.c:2263: error: forward declaration of 'struct rusage' /home/tmy/.cache/common-lisp/sbcl-1.4.5.openbsd-bsd-x64/home/tmy/src/cl-test-grid/work-dir/agent/quicklisp/dists/quicklisp/software/iolib-v0.8.3/src/syscalls/ffi-types-unix.c:2272: error: invalid use of incomplete type 'struct rusage' /home/tmy/.cache/common-lisp/sbcl-1.4.5.openbsd-bsd-x64/home/tmy/src/cl-test-grid/work-dir/agent/quicklisp/dists/quicklisp/software/iolib-v0.8.3/src/syscalls/ffi-types-unix.c:2263: error: forward declaration of 'struct rusage' /home/tmy/.cache/common-lisp/sbcl-1.4.5.openbsd-bsd-x64/home/tmy/src/cl-test-grid/work-dir/agent/quicklisp/dists/quicklisp/software/iolib-v0.8.3/src/syscalls/ffi-types-unix.c:2273: error: invalid use of incomplete type 'struct rusage' /home/tmy/.cache/common-lisp/sbcl-1.4.5.openbsd-bsd-x64/home/tmy/src/cl-test-grid/work-dir/agent/quicklisp/dists/quicklisp/software/iolib-v0.8.3/src/syscalls/ffi-types-unix.c:2263: error: forward declaration of 'struct rusage' /home/tmy/.cache/common-lisp/sbcl-1.4.5.openbsd-bsd-x64/home/tmy/src/cl-test-grid/work-dir/agent/quicklisp/dists/quicklisp/software/iolib-v0.8.3/src/syscalls/ffi-types-unix.c:2274: error: invalid use of incomplete type 'struct rusage' /home/tmy/.cache/common-lisp/sbcl-1.4.5.openbsd-bsd-x64/home/tmy/src/cl-test-grid/work-dir/agent/quicklisp/dists/quicklisp/software/iolib-v0.8.3/src/syscalls/ffi-types-unix.c:2263: error: forward declaration of 'struct rusage' /home/tmy/.cache/common-lisp/sbcl-1.4.5.openbsd-bsd-x64/home/tmy/src/cl-test-grid/work-dir/agent/quicklisp/dists/quicklisp/software/iolib-v0.8.3/src/syscalls/ffi-types-unix.c:2275: error: invalid use of incomplete type 'struct rusage' /home/tmy/.cache/common-lisp/sbcl-1.4.5.openbsd-bsd-x64/home/tmy/src/cl-test-grid/work-dir/agent/quicklisp/dists/quicklisp/software/iolib-v0.8.3/src/syscalls/ffi-types-unix.c:2263: error: forward declaration of 'struct rusage' /home/tmy/.cache/common-lisp/sbcl-1.4.5.openbsd-bsd-x64/home/tmy/src/cl-test-grid/work-dir/agent/quicklisp/dists/quicklisp/software/iolib-v0.8.3/src/syscalls/ffi-types-unix.c:2276: error: invalid use of incomplete type 'struct rusage' /home/tmy/.cache/common-lisp/sbcl-1.4.5.openbsd-bsd-x64/home/tmy/src/cl-test-grid/work-dir/agent/quicklisp/dists/quicklisp/software/iolib-v0.8.3/src/syscalls/ffi-types-unix.c:2263: error: forward declaration of 'struct rusage' /home/tmy/.cache/common-lisp/sbcl-1.4.5.openbsd-bsd-x64/home/tmy/src/cl-test-grid/work-dir/agent/quicklisp/dists/quicklisp/software/iolib-v0.8.3/src/syscalls/ffi-types-unix.c:2277: error: invalid use of incomplete type 'struct rusage' /home/tmy/.cache/common-lisp/sbcl-1.4.5.openbsd-bsd-x64/home/tmy/src/cl-test-grid/work-dir/agent/quicklisp/dists/quicklisp/software/iolib-v0.8.3/src/syscalls/ffi-types-unix.c:2263: error: forward declaration of 'struct rusage' /home/tmy/.cache/common-lisp/sbcl-1.4.5.openbsd-bsd-x64/home/tmy/src/cl-test-grid/work-dir/agent/quicklisp/dists/quicklisp/software/iolib-v0.8.3/src/syscalls/ffi-types-unix.c:2278: error: invalid use of incomplete type 'struct rusage' /home/tmy/.cache/common-lisp/sbcl-1.4.5.openbsd-bsd-x64/home/tmy/src/cl-test-grid/work-dir/agent/quicklisp/dists/quicklisp/software/iolib-v0.8.3/src/syscalls/ffi-types-unix.c:2263: error: forward declaration of 'struct rusage' /home/tmy/.cache/common-lisp/sbcl-1.4.5.openbsd-bsd-x64/home/tmy/src/cl-test-grid/work-dir/agent/quicklisp/dists/quicklisp/software/iolib-v0.8.3/src/syscalls/ffi-types-unix.c:2279: error: invalid use of incomplete type 'struct rusage' /home/tmy/.cache/common-lisp/sbcl-1.4.5.openbsd-bsd-x64/home/tmy/src/cl-test-grid/work-dir/agent/quicklisp/dists/quicklisp/software/iolib-v0.8.3/src/syscalls/ffi-types-unix.c:2263: error: forward declaration of 'struct rusage' /home/tmy/.cache/common-lisp/sbcl-1.4.5.openbsd-bsd-x64/home/tmy/src/cl-test-grid/work-dir/agent/quicklisp/dists/quicklisp/software/iolib-v0.8.3/src/syscalls/ffi-types-unix.c:2282: error: invalid application of 'sizeof' to incomplete type 'rusage'

Breakdown by testcases: for every failed testcase the lisp implmentations it fails on

The library does not have a testsuite adapter for CL Test Grid.

To reports overview

Generated at: 2018-04-20 06:28:04 GMT.