cl-xul results collected by cl-test-grid

Results on the last two Quicklisp distributions

 quicklisp 2015-04-07quicklisp 2015-03-02
abcl-1.2.1-fasl42-linux-x86
(LOAD cl-xul-test FAIL) COMMON-LISP:UNDEFINED-FUNCTION : The function CLWS::MAKE-ATOMIC-PLACE is undefined.
(LOAD cl-xul FAIL) COMMON-LISP:UNDEFINED-FUNCTION : The function CLWS::MAKE-ATOMIC-PLACE is undefined.
(LOAD cl-xul-test FAIL) COMMON-LISP:UNDEFINED-FUNCTION : The function CLWS::MAKE-ATOMIC-PLACE is undefined.
(LOAD cl-xul FAIL) COMMON-LISP:UNDEFINED-FUNCTION : The function CLWS::MAKE-ATOMIC-PLACE is undefined.
abcl-1.3.0-fasl42-linux-x86
(LOAD cl-xul-test FAIL) ASDF/FIND-SYSTEM:LOAD-SYSTEM-DEFINITION-ERROR : Error while trying to load definition for system ironclad from pathname /home/testgrid/cl-test-grid/work-dir/agent/quicklisp/dists/quicklisp/software/ironclad_0.33.0/ironclad.asd: don't recognize component type :TXT-FILE
(LOAD cl-xul FAIL) ASDF/FIND-SYSTEM:LOAD-SYSTEM-DEFINITION-ERROR : Error while trying to load definition for system ironclad from pathname /home/testgrid/cl-test-grid/work-dir/agent/quicklisp/dists/quicklisp/software/ironclad_0.33.0/ironclad.asd: don't recognize component type :TXT-FILE
(LOAD cl-xul-test FAIL) ASDF/FIND-SYSTEM:LOAD-SYSTEM-DEFINITION-ERROR : Error while trying to load definition for system ironclad from pathname /home/testgrid/cl-test-grid/work-dir/agent/quicklisp/dists/quicklisp/software/ironclad_0.33.0/ironclad.asd: don't recognize component type :TXT-FILE
(LOAD cl-xul FAIL) ASDF/FIND-SYSTEM:LOAD-SYSTEM-DEFINITION-ERROR : Error while trying to load definition for system ironclad from pathname /home/testgrid/cl-test-grid/work-dir/agent/quicklisp/dists/quicklisp/software/ironclad_0.33.0/ironclad.asd: don't recognize component type :TXT-FILE
abcl-1.3.1-fasl42-linux-x86
(LOAD cl-xul-test FAIL) COMMON-LISP:UNDEFINED-FUNCTION : The function CLWS::MAKE-ATOMIC-PLACE is undefined.
(LOAD cl-xul FAIL) COMMON-LISP:UNDEFINED-FUNCTION : The function CLWS::MAKE-ATOMIC-PLACE is undefined.
(LOAD cl-xul-test FAIL) COMMON-LISP:UNDEFINED-FUNCTION : The function CLWS::MAKE-ATOMIC-PLACE is undefined.
(LOAD cl-xul FAIL) COMMON-LISP:UNDEFINED-FUNCTION : The function CLWS::MAKE-ATOMIC-PLACE is undefined.
ccl-1.10-r16196-f96-linux-x64
(LOAD cl-xul-test FAIL) COMMON-LISP:SIMPLE-ERROR : External process exited with code 1. Command was: "g++" "-m64" "-Wno-write-strings" "-I/home/hijarian/systems/cl-test-grid/work-dir/agent/quicklisp/dists/quicklisp/software/iolib-20150302-git/src/grovel/" "-o" "/home/hijarian/systems/cl-test-grid/work-dir/agent/test-runs/20150408050757-ccl-1.10-r16196-f96-linux-x64/fasl/ql/dists/quicklisp/software/iolib-20150302-git/src/syscalls/ffi-types-unix" "/home/hijarian/systems/cl-test-grid/work-dir/agent/test-runs/20150408050757-ccl-1.10-r16196-f96-linux-x64/fasl/ql/dists/quicklisp/software/iolib-20150302-git/src/syscalls/ffi-types-unix.c" Output was: /home/hijarian/systems/cl-test-grid/work-dir/agent/test-runs/20150408050757-ccl-1.10-r16196-f96-linux-x64/fasl/ql/dists/quicklisp/software/iolib-20150302-git/src/syscalls/ffi-types-unix.c:14:17: fatal error: lfp.h: Нет такого файла или каталога #include <lfp.h> ^ compilation terminated.
(LOAD cl-xul FAIL) COMMON-LISP:SIMPLE-ERROR : External process exited with code 1. Command was: "g++" "-m64" "-Wno-write-strings" "-I/home/hijarian/systems/cl-test-grid/work-dir/agent/quicklisp/dists/quicklisp/software/iolib-20150302-git/src/grovel/" "-o" "/home/hijarian/systems/cl-test-grid/work-dir/agent/test-runs/20150408050757-ccl-1.10-r16196-f96-linux-x64/fasl/ql/dists/quicklisp/software/iolib-20150302-git/src/syscalls/ffi-types-unix" "/home/hijarian/systems/cl-test-grid/work-dir/agent/test-runs/20150408050757-ccl-1.10-r16196-f96-linux-x64/fasl/ql/dists/quicklisp/software/iolib-20150302-git/src/syscalls/ffi-types-unix.c" Output was: /home/hijarian/systems/cl-test-grid/work-dir/agent/test-runs/20150408050757-ccl-1.10-r16196-f96-linux-x64/fasl/ql/dists/quicklisp/software/iolib-20150302-git/src/syscalls/ffi-types-unix.c:14:17: fatal error: lfp.h: Нет такого файла или каталога #include <lfp.h> ^ compilation terminated.
(LOAD cl-xul-test FAIL) COMMON-LISP:SIMPLE-ERROR : External process exited with code 1. Command was: "g++" "-m64" "-Wno-write-strings" "-I/home/joram/dev/lisp/cl-test-grid/work-dir/agent/quicklisp/dists/quicklisp/software/iolib-20150302-git/src/grovel/" "-o" "/home/joram/dev/lisp/cl-test-grid/work-dir/agent/test-runs/20150316132516-ccl-1.10-r16196-f96-linux-x64/fasl/ql/dists/quicklisp/software/iolib-20150302-git/src/syscalls/ffi-types-unix" "/home/joram/dev/lisp/cl-test-grid/work-dir/agent/test-runs/20150316132516-ccl-1.10-r16196-f96-linux-x64/fasl/ql/dists/quicklisp/software/iolib-20150302-git/src/syscalls/ffi-types-unix.c" Output was: /home/joram/dev/lisp/cl-test-grid/work-dir/agent/test-runs/20150316132516-ccl-1.10-r16196-f96-linux-x64/fasl/ql/dists/quicklisp/software/iolib-20150302-git/src/syscalls/ffi-types-unix.c:14:17: fatal error: lfp.h: No such file or directory #include <lfp.h> ^ compilation terminated.
(LOAD cl-xul FAIL) COMMON-LISP:SIMPLE-ERROR : External process exited with code 1. Command was: "g++" "-m64" "-Wno-write-strings" "-I/home/joram/dev/lisp/cl-test-grid/work-dir/agent/quicklisp/dists/quicklisp/software/iolib-20150302-git/src/grovel/" "-o" "/home/joram/dev/lisp/cl-test-grid/work-dir/agent/test-runs/20150316132516-ccl-1.10-r16196-f96-linux-x64/fasl/ql/dists/quicklisp/software/iolib-20150302-git/src/syscalls/ffi-types-unix" "/home/joram/dev/lisp/cl-test-grid/work-dir/agent/test-runs/20150316132516-ccl-1.10-r16196-f96-linux-x64/fasl/ql/dists/quicklisp/software/iolib-20150302-git/src/syscalls/ffi-types-unix.c" Output was: /home/joram/dev/lisp/cl-test-grid/work-dir/agent/test-runs/20150316132516-ccl-1.10-r16196-f96-linux-x64/fasl/ql/dists/quicklisp/software/iolib-20150302-git/src/syscalls/ffi-types-unix.c:14:17: fatal error: lfp.h: No such file or directory #include <lfp.h> ^ compilation terminated.
(LOAD cl-xul-test FAIL) COMMON-LISP:SIMPLE-ERROR : External process exited with code 1. Command was: "g++" "-m64" "-Wno-write-strings" "-I/home/hijarian/systems/cl-test-grid/work-dir/agent/quicklisp/dists/quicklisp/software/iolib-20150302-git/src/grovel/" "-o" "/home/hijarian/systems/cl-test-grid/work-dir/agent/test-runs/20150303104636-ccl-1.10-r16196-f96-linux-x64/fasl/ql/dists/quicklisp/software/iolib-20150302-git/src/syscalls/ffi-types-unix" "/home/hijarian/systems/cl-test-grid/work-dir/agent/test-runs/20150303104636-ccl-1.10-r16196-f96-linux-x64/fasl/ql/dists/quicklisp/software/iolib-20150302-git/src/syscalls/ffi-types-unix.c" Output was: /home/hijarian/systems/cl-test-grid/work-dir/agent/test-runs/20150303104636-ccl-1.10-r16196-f96-linux-x64/fasl/ql/dists/quicklisp/software/iolib-20150302-git/src/syscalls/ffi-types-unix.c:14:17: fatal error: lfp.h: Нет такого файла или каталога #include <lfp.h> ^ compilation terminated.
(LOAD cl-xul FAIL) COMMON-LISP:SIMPLE-ERROR : External process exited with code 1. Command was: "g++" "-m64" "-Wno-write-strings" "-I/home/hijarian/systems/cl-test-grid/work-dir/agent/quicklisp/dists/quicklisp/software/iolib-20150302-git/src/grovel/" "-o" "/home/hijarian/systems/cl-test-grid/work-dir/agent/test-runs/20150303104636-ccl-1.10-r16196-f96-linux-x64/fasl/ql/dists/quicklisp/software/iolib-20150302-git/src/syscalls/ffi-types-unix" "/home/hijarian/systems/cl-test-grid/work-dir/agent/test-runs/20150303104636-ccl-1.10-r16196-f96-linux-x64/fasl/ql/dists/quicklisp/software/iolib-20150302-git/src/syscalls/ffi-types-unix.c" Output was: /home/hijarian/systems/cl-test-grid/work-dir/agent/test-runs/20150303104636-ccl-1.10-r16196-f96-linux-x64/fasl/ql/dists/quicklisp/software/iolib-20150302-git/src/syscalls/ffi-types-unix.c:14:17: fatal error: lfp.h: Нет такого файла или каталога #include <lfp.h> ^ compilation terminated.
ccl-1.10-r16196-f96-linux-x86
ccl-1.8-r15286m-f95-linux-x86
(LOAD cl-xul-test FAIL) ASDF:LOAD-SYSTEM-DEFINITION-ERROR : Error while trying to load definition for system iolib from pathname /home/testgrid/cl-test-grid/work-dir/agent/quicklisp/dists/quicklisp/software/iolib-20150302-git/iolib.asd: You need ASDF >= 2.31.1 to load this system correctly.
(LOAD cl-xul FAIL) ASDF:LOAD-SYSTEM-DEFINITION-ERROR : Error while trying to load definition for system iolib from pathname /home/testgrid/cl-test-grid/work-dir/agent/quicklisp/dists/quicklisp/software/iolib-20150302-git/iolib.asd: You need ASDF >= 2.31.1 to load this system correctly.
(LOAD cl-xul-test FAIL) ASDF:LOAD-SYSTEM-DEFINITION-ERROR : Error while trying to load definition for system iolib from pathname /home/testgrid/cl-test-grid/work-dir/agent/quicklisp/dists/quicklisp/software/iolib-20150302-git/iolib.asd: You need ASDF >= 2.31.1 to load this system correctly.
(LOAD cl-xul FAIL) ASDF:LOAD-SYSTEM-DEFINITION-ERROR : Error while trying to load definition for system iolib from pathname /home/testgrid/cl-test-grid/work-dir/agent/quicklisp/dists/quicklisp/software/iolib-20150302-git/iolib.asd: You need ASDF >= 2.31.1 to load this system correctly.
ccl-1.9-r15756-f96-linux-x86
clisp-2.49-unix-x64
(LOAD cl-xul-test FAIL) ASDF:LOAD-SYSTEM-DEFINITION-ERROR : Error while trying to load definition for system iolib from pathname /home/hijarian/systems/cl-test-grid/work-dir/agent/quicklisp/dists/quicklisp/software/iolib-20150302-git/iolib.asd: You need ASDF >= 2.31.1 to load this system correctly.
(LOAD cl-xul FAIL) ASDF:LOAD-SYSTEM-DEFINITION-ERROR : Error while trying to load definition for system iolib from pathname /home/hijarian/systems/cl-test-grid/work-dir/agent/quicklisp/dists/quicklisp/software/iolib-20150302-git/iolib.asd: You need ASDF >= 2.31.1 to load this system correctly.
(LOAD cl-xul-test FAIL) ASDF:LOAD-SYSTEM-DEFINITION-ERROR : Error while trying to load definition for system iolib from pathname /home/joram/dev/lisp/cl-test-grid/work-dir/agent/quicklisp/dists/quicklisp/software/iolib-20150302-git/iolib.asd: You need ASDF >= 2.31.1 to load this system correctly.
(LOAD cl-xul FAIL) ASDF:LOAD-SYSTEM-DEFINITION-ERROR : Error while trying to load definition for system iolib from pathname /home/joram/dev/lisp/cl-test-grid/work-dir/agent/quicklisp/dists/quicklisp/software/iolib-20150302-git/iolib.asd: You need ASDF >= 2.31.1 to load this system correctly.
(LOAD cl-xul-test FAIL) ASDF:LOAD-SYSTEM-DEFINITION-ERROR : Error while trying to load definition for system iolib from pathname /home/hijarian/systems/cl-test-grid/work-dir/agent/quicklisp/dists/quicklisp/software/iolib-20150302-git/iolib.asd: You need ASDF >= 2.31.1 to load this system correctly.
(LOAD cl-xul FAIL) ASDF:LOAD-SYSTEM-DEFINITION-ERROR : Error while trying to load definition for system iolib from pathname /home/hijarian/systems/cl-test-grid/work-dir/agent/quicklisp/dists/quicklisp/software/iolib-20150302-git/iolib.asd: You need ASDF >= 2.31.1 to load this system correctly.
clisp-2.49-unix-x86
(LOAD cl-xul-test FAIL) ASDF:LOAD-SYSTEM-DEFINITION-ERROR : Error while trying to load definition for system iolib from pathname /home/testgrid/cl-test-grid/work-dir/agent/quicklisp/dists/quicklisp/software/iolib-20150302-git/iolib.asd: You need ASDF >= 2.31.1 to load this system correctly.
(LOAD cl-xul FAIL) ASDF:LOAD-SYSTEM-DEFINITION-ERROR : Error while trying to load definition for system iolib from pathname /home/testgrid/cl-test-grid/work-dir/agent/quicklisp/dists/quicklisp/software/iolib-20150302-git/iolib.asd: You need ASDF >= 2.31.1 to load this system correctly.
(LOAD cl-xul-test FAIL) ASDF:LOAD-SYSTEM-DEFINITION-ERROR : Error while trying to load definition for system iolib from pathname /home/testgrid/cl-test-grid/work-dir/agent/quicklisp/dists/quicklisp/software/iolib-20150302-git/iolib.asd: You need ASDF >= 2.31.1 to load this system correctly.
(LOAD cl-xul FAIL) ASDF:LOAD-SYSTEM-DEFINITION-ERROR : Error while trying to load definition for system iolib from pathname /home/testgrid/cl-test-grid/work-dir/agent/quicklisp/dists/quicklisp/software/iolib-20150302-git/iolib.asd: You need ASDF >= 2.31.1 to load this system correctly.
cmu-snapshot-2013-04__20d_unicode_-linux-x86
(LOAD cl-xul-test FAIL) C::COMPILER-ERROR : (during macroexpansion) Error in function LISP::ASSERT-ERROR: The assertion (OR (NULL OPTS) (EQ (POP TYPE-LIST) '&OPTIONAL)) failed.
(LOAD cl-xul FAIL) C::COMPILER-ERROR : (during macroexpansion) Error in function LISP::ASSERT-ERROR: The assertion (OR (NULL OPTS) (EQ (POP TYPE-LIST) '&OPTIONAL)) failed.
(LOAD cl-xul-test FAIL) C::COMPILER-ERROR : (during macroexpansion) Error in function LISP::ASSERT-ERROR: The assertion (OR (NULL OPTS) (EQ (POP TYPE-LIST) '&OPTIONAL)) failed.
(LOAD cl-xul FAIL) C::COMPILER-ERROR : (during macroexpansion) Error in function LISP::ASSERT-ERROR: The assertion (OR (NULL OPTS) (EQ (POP TYPE-LIST) '&OPTIONAL)) failed.
cmu-snapshot-2014-01__20e_unicode_-linux-x86
(LOAD cl-xul-test FAIL) C::COMPILER-ERROR : (during macroexpansion) Error in function LISP::ASSERT-ERROR: The assertion (OR (NULL OPTS) (EQ (POP TYPE-LIST) '&OPTIONAL)) failed.
(LOAD cl-xul FAIL) C::COMPILER-ERROR : (during macroexpansion) Error in function LISP::ASSERT-ERROR: The assertion (OR (NULL OPTS) (EQ (POP TYPE-LIST) '&OPTIONAL)) failed.
(LOAD cl-xul-test FAIL) C::COMPILER-ERROR : (during macroexpansion) Error in function LISP::ASSERT-ERROR: The assertion (OR (NULL OPTS) (EQ (POP TYPE-LIST) '&OPTIONAL)) failed.
(LOAD cl-xul FAIL) C::COMPILER-ERROR : (during macroexpansion) Error in function LISP::ASSERT-ERROR: The assertion (OR (NULL OPTS) (EQ (POP TYPE-LIST) '&OPTIONAL)) failed.
cmu-snapshot-2014-05-dirty__20e_unicode_-linux-x86
(LOAD cl-xul-test FAIL) C::COMPILER-ERROR : (during macroexpansion) Error in function LISP::ASSERT-ERROR: The assertion (OR (NULL OPTS) (EQ (POP TYPE-LIST) '&OPTIONAL)) failed.
(LOAD cl-xul FAIL) C::COMPILER-ERROR : (during macroexpansion) Error in function LISP::ASSERT-ERROR: The assertion (OR (NULL OPTS) (EQ (POP TYPE-LIST) '&OPTIONAL)) failed.
(LOAD cl-xul-test FAIL) C::COMPILER-ERROR : (during macroexpansion) Error in function LISP::ASSERT-ERROR: The assertion (OR (NULL OPTS) (EQ (POP TYPE-LIST) '&OPTIONAL)) failed.
(LOAD cl-xul FAIL) C::COMPILER-ERROR : (during macroexpansion) Error in function LISP::ASSERT-ERROR: The assertion (OR (NULL OPTS) (EQ (POP TYPE-LIST) '&OPTIONAL)) failed.
cmu-snapshot-2014-12___20f_unicode_-linux-x86
(LOAD cl-xul-test FAIL) C::COMPILER-ERROR : (during macroexpansion) Error in function LISP::ASSERT-ERROR: The assertion (OR (NULL OPTS) (EQ (POP TYPE-LIST) '&OPTIONAL)) failed.
(LOAD cl-xul FAIL) C::COMPILER-ERROR : (during macroexpansion) Error in function LISP::ASSERT-ERROR: The assertion (OR (NULL OPTS) (EQ (POP TYPE-LIST) '&OPTIONAL)) failed.
(LOAD cl-xul-test FAIL) C::COMPILER-ERROR : (during macroexpansion) Error in function LISP::ASSERT-ERROR: The assertion (OR (NULL OPTS) (EQ (POP TYPE-LIST) '&OPTIONAL)) failed.
(LOAD cl-xul FAIL) C::COMPILER-ERROR : (during macroexpansion) Error in function LISP::ASSERT-ERROR: The assertion (OR (NULL OPTS) (EQ (POP TYPE-LIST) '&OPTIONAL)) failed.
ecl-13.5.1-76a84246-linux-x64-bytecode
(LOAD cl-xul-test FAIL) ASDF/FIND-SYSTEM:LOAD-SYSTEM-DEFINITION-ERROR : Error while trying to load definition for system iolib from pathname /home/hijarian/systems/cl-test-grid/work-dir/agent/quicklisp/dists/quicklisp/software/iolib-20150302-git/iolib.asd: The variable C::*CC-FLAGS* is unbound.
(LOAD cl-xul FAIL) ASDF/FIND-SYSTEM:LOAD-SYSTEM-DEFINITION-ERROR : Error while trying to load definition for system iolib from pathname /home/hijarian/systems/cl-test-grid/work-dir/agent/quicklisp/dists/quicklisp/software/iolib-20150302-git/iolib.asd: The variable C::*CC-FLAGS* is unbound.
(LOAD cl-xul-test FAIL) ASDF/FIND-SYSTEM:LOAD-SYSTEM-DEFINITION-ERROR : Error while trying to load definition for system iolib from pathname /home/hijarian/systems/cl-test-grid/work-dir/agent/quicklisp/dists/quicklisp/software/iolib-20150302-git/iolib.asd: The variable C::*CC-FLAGS* is unbound.
(LOAD cl-xul FAIL) ASDF/FIND-SYSTEM:LOAD-SYSTEM-DEFINITION-ERROR : Error while trying to load definition for system iolib from pathname /home/hijarian/systems/cl-test-grid/work-dir/agent/quicklisp/dists/quicklisp/software/iolib-20150302-git/iolib.asd: The variable C::*CC-FLAGS* is unbound.
ecl-13.5.1-76a84246-linux-x64-lisp-to-c
(LOAD cl-xul-test FAIL) UIOP/LISP-BUILD:COMPILE-FILE-ERROR : COMPILE-FILE-ERROR while compiling #<cl-source-file "chanl" "src" "actors">
(LOAD cl-xul FAIL) UIOP/LISP-BUILD:COMPILE-FILE-ERROR : COMPILE-FILE-ERROR while compiling #<cl-source-file "chanl" "src" "actors">
(LOAD cl-xul-test FAIL) COMMON-LISP:SIMPLE-ERROR : External process exited with code 1. Command was: "g++" "-m64" "-Wno-write-strings" " -D_GNU_SOURCE -D_FILE_OFFSET_BITS=64 -g -O2 -fPIC -D_THREAD_SAFE -Dlinux" "-I/home/hijarian/systems/cl-test-grid/work-dir/agent/quicklisp/dists/quicklisp/software/iolib-20150302-git/src/grovel/" "-o" "/home/hijarian/systems/cl-test-grid/work-dir/agent/test-runs/20150303152413-ecl-13.5.1-76a84246-linux-x64-lisp-to-c/fasl/ql/dists/quicklisp/software/iolib-20150302-git/src/syscalls/ffi-types-unix" "/home/hijarian/systems/cl-test-grid/work-dir/agent/test-runs/20150303152413-ecl-13.5.1-76a84246-linux-x64-lisp-to-c/fasl/ql/dists/quicklisp/software/iolib-20150302-git/src/syscalls/ffi-types-unix.c" Output was: <see above>
(LOAD cl-xul FAIL) COMMON-LISP:SIMPLE-ERROR : External process exited with code 1. Command was: "g++" "-m64" "-Wno-write-strings" " -D_GNU_SOURCE -D_FILE_OFFSET_BITS=64 -g -O2 -fPIC -D_THREAD_SAFE -Dlinux" "-I/home/hijarian/systems/cl-test-grid/work-dir/agent/quicklisp/dists/quicklisp/software/iolib-20150302-git/src/grovel/" "-o" "/home/hijarian/systems/cl-test-grid/work-dir/agent/test-runs/20150303152413-ecl-13.5.1-76a84246-linux-x64-lisp-to-c/fasl/ql/dists/quicklisp/software/iolib-20150302-git/src/syscalls/ffi-types-unix" "/home/hijarian/systems/cl-test-grid/work-dir/agent/test-runs/20150303152413-ecl-13.5.1-76a84246-linux-x64-lisp-to-c/fasl/ql/dists/quicklisp/software/iolib-20150302-git/src/syscalls/ffi-types-unix.c" Output was: <see above>
ecl-13.5.1-unknown-linux-i686-bytecode
(LOAD cl-xul-test FAIL) ASDF/FIND-SYSTEM:LOAD-SYSTEM-DEFINITION-ERROR : Error while trying to load definition for system iolib from pathname /home/testgrid/cl-test-grid/work-dir/agent/quicklisp/dists/quicklisp/software/iolib-20150302-git/iolib.asd: The variable C::*CC-FLAGS* is unbound.
(LOAD cl-xul FAIL) ASDF/FIND-SYSTEM:LOAD-SYSTEM-DEFINITION-ERROR : Error while trying to load definition for system iolib from pathname /home/testgrid/cl-test-grid/work-dir/agent/quicklisp/dists/quicklisp/software/iolib-20150302-git/iolib.asd: The variable C::*CC-FLAGS* is unbound.
(LOAD cl-xul-test FAIL) ASDF/FIND-SYSTEM:LOAD-SYSTEM-DEFINITION-ERROR : Error while trying to load definition for system iolib from pathname /home/testgrid/cl-test-grid/work-dir/agent/quicklisp/dists/quicklisp/software/iolib-20150302-git/iolib.asd: The variable C::*CC-FLAGS* is unbound.
(LOAD cl-xul FAIL) ASDF/FIND-SYSTEM:LOAD-SYSTEM-DEFINITION-ERROR : Error while trying to load definition for system iolib from pathname /home/testgrid/cl-test-grid/work-dir/agent/quicklisp/dists/quicklisp/software/iolib-20150302-git/iolib.asd: The variable C::*CC-FLAGS* is unbound.
ecl-13.5.1-unknown-linux-i686-lisp-to-c
(LOAD cl-xul-test FAIL) UIOP/LISP-BUILD:COMPILE-FILE-ERROR : COMPILE-FILE-ERROR while compiling #<cl-source-file "chanl" "src" "actors">
(LOAD cl-xul FAIL) UIOP/LISP-BUILD:COMPILE-FILE-ERROR : COMPILE-FILE-ERROR while compiling #<cl-source-file "chanl" "src" "actors">
(LOAD cl-xul-test FAIL) COMMON-LISP:SIMPLE-ERROR : %CLOSE-FOREIGN-LIBRARY unimplemented.
(LOAD cl-xul FAIL) COMMON-LISP:SIMPLE-ERROR : %CLOSE-FOREIGN-LIBRARY unimplemented.
ecl-15.2.21-ee989b97-linux-i686-bytecode
(LOAD cl-xul-test FAIL) ASDF/FIND-SYSTEM:LOAD-SYSTEM-DEFINITION-ERROR : Error while trying to load definition for system iolib from pathname /home/testgrid/cl-test-grid/work-dir/agent/quicklisp/dists/quicklisp/software/iolib-20150302-git/iolib.asd: The variable C::*CC-FLAGS* is unbound.
(LOAD cl-xul FAIL) ASDF/FIND-SYSTEM:LOAD-SYSTEM-DEFINITION-ERROR : Error while trying to load definition for system iolib from pathname /home/testgrid/cl-test-grid/work-dir/agent/quicklisp/dists/quicklisp/software/iolib-20150302-git/iolib.asd: The variable C::*CC-FLAGS* is unbound.
(LOAD cl-xul-test FAIL) ASDF/FIND-SYSTEM:LOAD-SYSTEM-DEFINITION-ERROR : Error while trying to load definition for system iolib from pathname /home/testgrid/cl-test-grid/work-dir/agent/quicklisp/dists/quicklisp/software/iolib-20150302-git/iolib.asd: The variable C::*CC-FLAGS* is unbound.
(LOAD cl-xul FAIL) ASDF/FIND-SYSTEM:LOAD-SYSTEM-DEFINITION-ERROR : Error while trying to load definition for system iolib from pathname /home/testgrid/cl-test-grid/work-dir/agent/quicklisp/dists/quicklisp/software/iolib-20150302-git/iolib.asd: The variable C::*CC-FLAGS* is unbound.
ecl-15.2.21-ee989b97-linux-i686-lisp-to-c
(LOAD cl-xul-test FAIL) UIOP/LISP-BUILD:COMPILE-FILE-ERROR : COMPILE-FILE-ERROR while compiling #<cl-source-file "chanl" "src" "actors">
(LOAD cl-xul FAIL) UIOP/LISP-BUILD:COMPILE-FILE-ERROR : COMPILE-FILE-ERROR while compiling #<cl-source-file "chanl" "src" "actors">
(LOAD cl-xul-test FAIL) COMMON-LISP:SIMPLE-ERROR : %CLOSE-FOREIGN-LIBRARY unimplemented.
(LOAD cl-xul FAIL) COMMON-LISP:SIMPLE-ERROR : %CLOSE-FOREIGN-LIBRARY unimplemented.
sbcl-1.0.58-linux-x86
(LOAD cl-xul-test FAIL) ASDF:LOAD-SYSTEM-DEFINITION-ERROR : Error while trying to load definition for system iolib from pathname /home/testgrid/cl-test-grid/work-dir/agent/quicklisp/dists/quicklisp/software/iolib-20150302-git/iolib.asd: You need ASDF >= 2.31.1 to load this system correctly.
(LOAD cl-xul FAIL) ASDF:LOAD-SYSTEM-DEFINITION-ERROR : Error while trying to load definition for system iolib from pathname /home/testgrid/cl-test-grid/work-dir/agent/quicklisp/dists/quicklisp/software/iolib-20150302-git/iolib.asd: You need ASDF >= 2.31.1 to load this system correctly.
(LOAD cl-xul-test FAIL) ASDF:LOAD-SYSTEM-DEFINITION-ERROR : Error while trying to load definition for system iolib from pathname /home/testgrid/cl-test-grid/work-dir/agent/quicklisp/dists/quicklisp/software/iolib-20150302-git/iolib.asd: You need ASDF >= 2.31.1 to load this system correctly.
(LOAD cl-xul FAIL) ASDF:LOAD-SYSTEM-DEFINITION-ERROR : Error while trying to load definition for system iolib from pathname /home/testgrid/cl-test-grid/work-dir/agent/quicklisp/dists/quicklisp/software/iolib-20150302-git/iolib.asd: You need ASDF >= 2.31.1 to load this system correctly.
sbcl-1.1.11-linux-x86
sbcl-1.1.16-linux-x86
sbcl-1.2.3-linux-x64
(LOAD cl-xul-test FAIL) COMMON-LISP:SIMPLE-ERROR : External process exited with code 1. Command was: "g++" "-m64" "-Wno-write-strings" "-I/home/hijarian/systems/cl-test-grid/work-dir/agent/quicklisp/dists/quicklisp/software/iolib-20150302-git/src/grovel/" "-o" "/home/hijarian/systems/cl-test-grid/work-dir/agent/test-runs/20150408075038-sbcl-1.2.3-linux-x64/fasl/ql/dists/quicklisp/software/iolib-20150302-git/src/syscalls/ffi-types-unix" "/home/hijarian/systems/cl-test-grid/work-dir/agent/test-runs/20150408075038-sbcl-1.2.3-linux-x64/fasl/ql/dists/quicklisp/software/iolib-20150302-git/src/syscalls/ffi-types-unix.c" Output was: /home/hijarian/systems/cl-test-grid/work-dir/agent/test-runs/20150408075038-sbcl-1.2.3-linux-x64/fasl/ql/dists/quicklisp/software/iolib-20150302-git/src/syscalls/ffi-types-unix.c:14:17: fatal error: lfp.h: Нет такого файла или каталога #include <lfp.h> ^ compilation terminated.
(LOAD cl-xul FAIL) COMMON-LISP:SIMPLE-ERROR : External process exited with code 1. Command was: "g++" "-m64" "-Wno-write-strings" "-I/home/hijarian/systems/cl-test-grid/work-dir/agent/quicklisp/dists/quicklisp/software/iolib-20150302-git/src/grovel/" "-o" "/home/hijarian/systems/cl-test-grid/work-dir/agent/test-runs/20150408075038-sbcl-1.2.3-linux-x64/fasl/ql/dists/quicklisp/software/iolib-20150302-git/src/syscalls/ffi-types-unix" "/home/hijarian/systems/cl-test-grid/work-dir/agent/test-runs/20150408075038-sbcl-1.2.3-linux-x64/fasl/ql/dists/quicklisp/software/iolib-20150302-git/src/syscalls/ffi-types-unix.c" Output was: /home/hijarian/systems/cl-test-grid/work-dir/agent/test-runs/20150408075038-sbcl-1.2.3-linux-x64/fasl/ql/dists/quicklisp/software/iolib-20150302-git/src/syscalls/ffi-types-unix.c:14:17: fatal error: lfp.h: Нет такого файла или каталога #include <lfp.h> ^ compilation terminated.
(LOAD cl-xul-test FAIL) COMMON-LISP:SIMPLE-ERROR : External process exited with code 1. Command was: "g++" "-m64" "-Wno-write-strings" "-I/home/hijarian/systems/cl-test-grid/work-dir/agent/quicklisp/dists/quicklisp/software/iolib-20150302-git/src/grovel/" "-o" "/home/hijarian/systems/cl-test-grid/work-dir/agent/test-runs/20150303132800-sbcl-1.2.3-linux-x64/fasl/ql/dists/quicklisp/software/iolib-20150302-git/src/syscalls/ffi-types-unix" "/home/hijarian/systems/cl-test-grid/work-dir/agent/test-runs/20150303132800-sbcl-1.2.3-linux-x64/fasl/ql/dists/quicklisp/software/iolib-20150302-git/src/syscalls/ffi-types-unix.c" Output was: /home/hijarian/systems/cl-test-grid/work-dir/agent/test-runs/20150303132800-sbcl-1.2.3-linux-x64/fasl/ql/dists/quicklisp/software/iolib-20150302-git/src/syscalls/ffi-types-unix.c:14:17: fatal error: lfp.h: Нет такого файла или каталога #include <lfp.h> ^ compilation terminated.
(LOAD cl-xul FAIL) COMMON-LISP:SIMPLE-ERROR : External process exited with code 1. Command was: "g++" "-m64" "-Wno-write-strings" "-I/home/hijarian/systems/cl-test-grid/work-dir/agent/quicklisp/dists/quicklisp/software/iolib-20150302-git/src/grovel/" "-o" "/home/hijarian/systems/cl-test-grid/work-dir/agent/test-runs/20150303132800-sbcl-1.2.3-linux-x64/fasl/ql/dists/quicklisp/software/iolib-20150302-git/src/syscalls/ffi-types-unix" "/home/hijarian/systems/cl-test-grid/work-dir/agent/test-runs/20150303132800-sbcl-1.2.3-linux-x64/fasl/ql/dists/quicklisp/software/iolib-20150302-git/src/syscalls/ffi-types-unix.c" Output was: /home/hijarian/systems/cl-test-grid/work-dir/agent/test-runs/20150303132800-sbcl-1.2.3-linux-x64/fasl/ql/dists/quicklisp/software/iolib-20150302-git/src/syscalls/ffi-types-unix.c:14:17: fatal error: lfp.h: Нет такого файла или каталога #include <lfp.h> ^ compilation terminated.
sbcl-1.2.6-linux-x86
sbcl-1.2.8-linux-x64
(LOAD cl-xul-test FAIL) COMMON-LISP:SIMPLE-ERROR : External process exited with code 1. Command was: "g++" "-m64" "-Wno-write-strings" "-I/home/joram/dev/lisp/cl-test-grid/work-dir/agent/quicklisp/dists/quicklisp/software/iolib-20150302-git/src/grovel/" "-o" "/home/joram/dev/lisp/cl-test-grid/work-dir/agent/test-runs/20150316154043-sbcl-1.2.8-linux-x64/fasl/ql/dists/quicklisp/software/iolib-20150302-git/src/syscalls/ffi-types-unix" "/home/joram/dev/lisp/cl-test-grid/work-dir/agent/test-runs/20150316154043-sbcl-1.2.8-linux-x64/fasl/ql/dists/quicklisp/software/iolib-20150302-git/src/syscalls/ffi-types-unix.c" Output was: /home/joram/dev/lisp/cl-test-grid/work-dir/agent/test-runs/20150316154043-sbcl-1.2.8-linux-x64/fasl/ql/dists/quicklisp/software/iolib-20150302-git/src/syscalls/ffi-types-unix.c:14:17: fatal error: lfp.h: No such file or directory #include <lfp.h> ^ compilation terminated.
(LOAD cl-xul FAIL) COMMON-LISP:SIMPLE-ERROR : External process exited with code 1. Command was: "g++" "-m64" "-Wno-write-strings" "-I/home/joram/dev/lisp/cl-test-grid/work-dir/agent/quicklisp/dists/quicklisp/software/iolib-20150302-git/src/grovel/" "-o" "/home/joram/dev/lisp/cl-test-grid/work-dir/agent/test-runs/20150316154043-sbcl-1.2.8-linux-x64/fasl/ql/dists/quicklisp/software/iolib-20150302-git/src/syscalls/ffi-types-unix" "/home/joram/dev/lisp/cl-test-grid/work-dir/agent/test-runs/20150316154043-sbcl-1.2.8-linux-x64/fasl/ql/dists/quicklisp/software/iolib-20150302-git/src/syscalls/ffi-types-unix.c" Output was: /home/joram/dev/lisp/cl-test-grid/work-dir/agent/test-runs/20150316154043-sbcl-1.2.8-linux-x64/fasl/ql/dists/quicklisp/software/iolib-20150302-git/src/syscalls/ffi-types-unix.c:14:17: fatal error: lfp.h: No such file or directory #include <lfp.h> ^ compilation terminated.

Breakdown by testcases: for every failed testcase the lisp implmentations it fails on

The library does not have a testsuite adapter for CL Test Grid.

To reports overview

Generated at: 2015-04-17 13:42:35 GMT.