cl-v4l2 results collected by cl-test-grid

Results on the last two Quicklisp distributions

 quicklisp 2015-03-02quicklisp 2015-01-13
abcl-1.2.1-fasl42-linux-x86
(LOAD cl-v4l2 FAIL) ASDF/FIND-SYSTEM:LOAD-SYSTEM-DEFINITION-ERROR : Error while trying to load definition for system cl-v4l2 from pathname /home/testgrid/cl-test-grid/work-dir/agent/quicklisp/dists/quicklisp/software/cl-v4l2-20101107-git/cl-v4l2.asd: Component :IOLIB/SYSCALLS not found, required by #<ASDF/SYSTEM:SYSTEM "iolib.syscalls">
(LOAD cl-v4l2 FAIL) ASDF/FIND-SYSTEM:LOAD-SYSTEM-DEFINITION-ERROR : Error while trying to load definition for system cl-v4l2 from pathname /home/testgrid/cl-test-grid/work-dir/agent/quicklisp/dists/quicklisp/software/cl-v4l2-20101107-git/cl-v4l2.asd: Component :IOLIB/SYSCALLS not found, required by #<ASDF/SYSTEM:SYSTEM "iolib.syscalls">
abcl-1.3.0-fasl42-linux-x86
abcl-1.3.1-fasl42-linux-x86
acl-9.0-linux-x86
(LOAD cl-v4l2 FAIL) ASDF/FIND-SYSTEM:LOAD-SYSTEM-DEFINITION-ERROR : Error while trying to load definition for system cl-v4l2 from pathname /home/cl-test-grid/lisp/cl-test-grid/work-dir/agent/quicklisp/dists/quicklisp/software/cl-v4l2-20101107-git/cl-v4l2.asd: Component :IOLIB/SYSCALLS not found, required by #<SYSTEM "iolib.syscalls">
ccl-1.10-r16196-f96-linux-x64
(LOAD cl-v4l2 FAIL) ASDF/FIND-SYSTEM:LOAD-SYSTEM-DEFINITION-ERROR : Error while trying to load definition for system cl-v4l2 from pathname /home/joram/dev/lisp/cl-test-grid/work-dir/agent/quicklisp/dists/quicklisp/software/cl-v4l2-20101107-git/cl-v4l2.asd: External process exited with code 1. Command was: "g++" "-m64" "-Wno-write-strings" "-I/home/joram/dev/lisp/cl-test-grid/work-dir/agent/quicklisp/dists/quicklisp/software/iolib-20150302-git/src/grovel/" "-o" "/home/joram/dev/lisp/cl-test-grid/work-dir/agent/test-runs/20150316132516-ccl-1.10-r16196-f96-linux-x64/fasl/ql/dists/quicklisp/software/iolib-20150302-git/src/syscalls/ffi-types-unix" "/home/joram/dev/lisp/cl-test-grid/work-dir/agent/test-runs/20150316132516-ccl-1.10-r16196-f96-linux-x64/fasl/ql/dists/quicklisp/software/iolib-20150302-git/src/syscalls/ffi-types-unix.c" Output was: /home/joram/dev/lisp/cl-test-grid/work-dir/agent/test-runs/20150316132516-ccl-1.10-r16196-f96-linux-x64/fasl/ql/dists/quicklisp/software/iolib-20150302-git/src/syscalls/ffi-types-unix.c:14:17: fatal error: lfp.h: No such file or directory #include <lfp.h> ^ compilation terminated.
(LOAD cl-v4l2 FAIL) ASDF/FIND-SYSTEM:LOAD-SYSTEM-DEFINITION-ERROR : Error while trying to load definition for system cl-v4l2 from pathname /home/hijarian/systems/cl-test-grid/work-dir/agent/quicklisp/dists/quicklisp/software/cl-v4l2-20101107-git/cl-v4l2.asd: External process exited with code 1. Command was: "g++" "-m64" "-Wno-write-strings" "-I/home/hijarian/systems/cl-test-grid/work-dir/agent/quicklisp/dists/quicklisp/software/iolib-20150302-git/src/grovel/" "-o" "/home/hijarian/systems/cl-test-grid/work-dir/agent/test-runs/20150303104636-ccl-1.10-r16196-f96-linux-x64/fasl/ql/dists/quicklisp/software/iolib-20150302-git/src/syscalls/ffi-types-unix" "/home/hijarian/systems/cl-test-grid/work-dir/agent/test-runs/20150303104636-ccl-1.10-r16196-f96-linux-x64/fasl/ql/dists/quicklisp/software/iolib-20150302-git/src/syscalls/ffi-types-unix.c" Output was: /home/hijarian/systems/cl-test-grid/work-dir/agent/test-runs/20150303104636-ccl-1.10-r16196-f96-linux-x64/fasl/ql/dists/quicklisp/software/iolib-20150302-git/src/syscalls/ffi-types-unix.c:14:17: fatal error: lfp.h: Нет такого файла или каталога #include <lfp.h> ^ compilation terminated.
(LOAD cl-v4l2 FAIL) ASDF/FIND-SYSTEM:LOAD-SYSTEM-DEFINITION-ERROR : Error while trying to load definition for system cl-v4l2 from pathname /home/hijarian/systems/cl-test-grid/work-dir/agent/quicklisp/dists/quicklisp/software/cl-v4l2-20101107-git/cl-v4l2.asd: External process exited with code 1. Command was: "g++" "-m64" "-Wno-write-strings" "-I/home/hijarian/systems/cl-test-grid/work-dir/agent/quicklisp/dists/quicklisp/software/iolib-20150113-git/src/grovel/" "-o" "/home/hijarian/systems/cl-test-grid/work-dir/agent/test-runs/20150116124133-ccl-1.10-r16196-f96-linux-x64/fasl/ql/dists/quicklisp/software/iolib-20150113-git/src/syscalls/ffi-types-unix" "/home/hijarian/systems/cl-test-grid/work-dir/agent/test-runs/20150116124133-ccl-1.10-r16196-f96-linux-x64/fasl/ql/dists/quicklisp/software/iolib-20150113-git/src/syscalls/ffi-types-unix.c" Output was: /home/hijarian/systems/cl-test-grid/work-dir/agent/test-runs/20150116124133-ccl-1.10-r16196-f96-linux-x64/fasl/ql/dists/quicklisp/software/iolib-20150113-git/src/syscalls/ffi-types-unix.c:14:17: fatal error: lfp.h: Нет такого файла или каталога #include <lfp.h> ^ compilation terminated.
ccl-1.10-r16196-f96-linux-x86
(LOAD cl-v4l2 FAIL) CCL::USE-PACKAGE-CONFLICT-ERROR : Using #<Package "COMMON-LISP"> in #<Package "CL-V4L2"> would cause name conflicts with symbols inherited by that package: CLOSER-MOP:STANDARD-METHOD STANDARD-METHOD CLOSER-MOP:STANDARD-CLASS STANDARD-CLASS
(LOAD cl-v4l2 FAIL) CCL::USE-PACKAGE-CONFLICT-ERROR : Using #<Package "COMMON-LISP"> in #<Package "CL-V4L2"> would cause name conflicts with symbols inherited by that package: CLOSER-MOP:STANDARD-METHOD STANDARD-METHOD CLOSER-MOP:STANDARD-CLASS STANDARD-CLASS
ccl-1.8-r15286m-f95-linux-x86
(LOAD cl-v4l2 FAIL) ASDF:LOAD-SYSTEM-DEFINITION-ERROR : Error while trying to load definition for system cl-v4l2 from pathname /home/testgrid/cl-test-grid/work-dir/agent/quicklisp/dists/quicklisp/software/cl-v4l2-20101107-git/cl-v4l2.asd: Component :IOLIB/SYSCALLS not found, required by #<SYSTEM "iolib.syscalls">
(LOAD cl-v4l2 FAIL) ASDF:LOAD-SYSTEM-DEFINITION-ERROR : Error while trying to load definition for system cl-v4l2 from pathname /home/testgrid/cl-test-grid/work-dir/agent/quicklisp/dists/quicklisp/software/cl-v4l2-20101107-git/cl-v4l2.asd: Component :IOLIB/SYSCALLS not found, required by #<SYSTEM "iolib.syscalls">
ccl-1.9-r15756-f96-linux-x86
(LOAD cl-v4l2 FAIL) ASDF/FIND-SYSTEM:LOAD-SYSTEM-DEFINITION-ERROR : Error while trying to load definition for system cl-v4l2 from pathname /home/testgrid/cl-test-grid/work-dir/agent/quicklisp/dists/quicklisp/software/cl-v4l2-20101107-git/cl-v4l2.asd: Component :IOLIB/SYSCALLS not found, required by #<SYSTEM "iolib.syscalls">
(LOAD cl-v4l2 FAIL) ASDF/FIND-SYSTEM:LOAD-SYSTEM-DEFINITION-ERROR : Error while trying to load definition for system cl-v4l2 from pathname /home/testgrid/cl-test-grid/work-dir/agent/quicklisp/dists/quicklisp/software/cl-v4l2-20101107-git/cl-v4l2.asd: Component :IOLIB/SYSCALLS not found, required by #<SYSTEM "iolib.syscalls">
clisp-2.49-unix-x64
(LOAD cl-v4l2 FAIL) ASDF:LOAD-SYSTEM-DEFINITION-ERROR : Error while trying to load definition for system cl-v4l2 from pathname /home/joram/dev/lisp/cl-test-grid/work-dir/agent/quicklisp/dists/quicklisp/software/cl-v4l2-20101107-git/cl-v4l2.asd: Component :IOLIB/SYSCALLS not found, required by #<SYSTEM "iolib.syscalls">
(LOAD cl-v4l2 FAIL) ASDF:LOAD-SYSTEM-DEFINITION-ERROR : Error while trying to load definition for system cl-v4l2 from pathname /home/hijarian/systems/cl-test-grid/work-dir/agent/quicklisp/dists/quicklisp/software/cl-v4l2-20101107-git/cl-v4l2.asd: Component :IOLIB/SYSCALLS not found, required by #<SYSTEM "iolib.syscalls">
(LOAD cl-v4l2 FAIL) ASDF:LOAD-SYSTEM-DEFINITION-ERROR : Error while trying to load definition for system cl-v4l2 from pathname /home/hijarian/systems/cl-test-grid/work-dir/agent/quicklisp/dists/quicklisp/software/cl-v4l2-20101107-git/cl-v4l2.asd: Component :IOLIB/SYSCALLS not found, required by #<SYSTEM "iolib.syscalls">
clisp-2.49-unix-x86
(LOAD cl-v4l2 FAIL) ASDF:LOAD-SYSTEM-DEFINITION-ERROR : Error while trying to load definition for system cl-v4l2 from pathname /home/testgrid/cl-test-grid/work-dir/agent/quicklisp/dists/quicklisp/software/cl-v4l2-20101107-git/cl-v4l2.asd: Component :IOLIB/SYSCALLS not found, required by #<SYSTEM "iolib.syscalls">
(LOAD cl-v4l2 FAIL) ASDF:LOAD-SYSTEM-DEFINITION-ERROR : Error while trying to load definition for system cl-v4l2 from pathname /home/testgrid/cl-test-grid/work-dir/agent/quicklisp/dists/quicklisp/software/cl-v4l2-20101107-git/cl-v4l2.asd: Component :IOLIB/SYSCALLS not found, required by #<SYSTEM "iolib.syscalls">
cmu-snapshot-2013-04__20d_unicode_-linux-x86
(LOAD cl-v4l2 FAIL) ASDF/FIND-SYSTEM:LOAD-SYSTEM-DEFINITION-ERROR : Error while trying to load definition for system cl-v4l2 from pathname /home/testgrid/cl-test-grid/work-dir/agent/quicklisp/dists/quicklisp/software/cl-v4l2-20101107-git/cl-v4l2.asd: Component :IOLIB/SYSCALLS not found, required by #<SYSTEM "iolib.syscalls">
(LOAD cl-v4l2 FAIL) ASDF/FIND-SYSTEM:LOAD-SYSTEM-DEFINITION-ERROR : Error while trying to load definition for system cl-v4l2 from pathname /home/testgrid/cl-test-grid/work-dir/agent/quicklisp/dists/quicklisp/software/cl-v4l2-20101107-git/cl-v4l2.asd: Component :IOLIB/SYSCALLS not found, required by #<SYSTEM "iolib.syscalls">
cmu-snapshot-2014-01__20e_unicode_-linux-x86
(LOAD cl-v4l2 FAIL) COMMON-LISP:SIMPLE-ERROR : Error in function USE-PACKAGE: Use'ing package COMMON-LISP results in name conflicts for these symbols: (CLOSER-MOP:TYPEP CLOSER-MOP:SUBTYPEP CLOSER-MOP:TYPEP CLOSER-MOP:SUBTYPEP)
(LOAD cl-v4l2 FAIL) COMMON-LISP:SIMPLE-ERROR : Error in function USE-PACKAGE: Use'ing package COMMON-LISP results in name conflicts for these symbols: (CLOSER-MOP:TYPEP CLOSER-MOP:SUBTYPEP CLOSER-MOP:TYPEP CLOSER-MOP:SUBTYPEP)
cmu-snapshot-2014-05-dirty__20e_unicode_-linux-x86
(LOAD cl-v4l2 FAIL) COMMON-LISP:SIMPLE-ERROR : Error in function USE-PACKAGE: Use'ing package COMMON-LISP results in name conflicts for these symbols: (CLOSER-MOP:TYPEP CLOSER-MOP:SUBTYPEP CLOSER-MOP:TYPEP CLOSER-MOP:SUBTYPEP)
(LOAD cl-v4l2 FAIL) COMMON-LISP:SIMPLE-ERROR : Error in function USE-PACKAGE: Use'ing package COMMON-LISP results in name conflicts for these symbols: (CLOSER-MOP:TYPEP CLOSER-MOP:SUBTYPEP CLOSER-MOP:TYPEP CLOSER-MOP:SUBTYPEP)
cmu-snapshot-2014-12___20f_unicode_-linux-x86
(LOAD cl-v4l2 FAIL) COMMON-LISP:SIMPLE-ERROR : Error in function USE-PACKAGE: Use'ing package COMMON-LISP results in name conflicts for these symbols: (CLOSER-MOP:TYPEP CLOSER-MOP:SUBTYPEP CLOSER-MOP:TYPEP CLOSER-MOP:SUBTYPEP)
(LOAD cl-v4l2 FAIL) COMMON-LISP:SIMPLE-ERROR : Error in function USE-PACKAGE: Use'ing package COMMON-LISP results in name conflicts for these symbols: (CLOSER-MOP:TYPEP CLOSER-MOP:SUBTYPEP CLOSER-MOP:TYPEP CLOSER-MOP:SUBTYPEP)
ecl-13.5.1-76a84246-linux-x64-bytecode
(LOAD cl-v4l2 FAIL) ASDF/FIND-SYSTEM:LOAD-SYSTEM-DEFINITION-ERROR : Error while trying to load definition for system cl-v4l2 from pathname /home/hijarian/systems/cl-test-grid/work-dir/agent/quicklisp/dists/quicklisp/software/cl-v4l2-20101107-git/cl-v4l2.asd: The variable C::*CC-FLAGS* is unbound.
(LOAD cl-v4l2 FAIL) ASDF/FIND-SYSTEM:LOAD-SYSTEM-DEFINITION-ERROR : Error while trying to load definition for system cl-v4l2 from pathname /home/hijarian/systems/cl-test-grid/work-dir/agent/quicklisp/dists/quicklisp/software/cl-v4l2-20101107-git/cl-v4l2.asd: The variable C::*CC-FLAGS* is unbound.
ecl-13.5.1-76a84246-linux-x64-lisp-to-c
(LOAD cl-v4l2 FAIL) ASDF/FIND-SYSTEM:LOAD-SYSTEM-DEFINITION-ERROR : Error while trying to load definition for system cl-v4l2 from pathname /home/hijarian/systems/cl-test-grid/work-dir/agent/quicklisp/dists/quicklisp/software/cl-v4l2-20101107-git/cl-v4l2.asd: External process exited with code 1. Command was: "g++" "-m64" "-Wno-write-strings" " -D_GNU_SOURCE -D_FILE_OFFSET_BITS=64 -g -O2 -fPIC -D_THREAD_SAFE -Dlinux" "-I/home/hijarian/systems/cl-test-grid/work-dir/agent/quicklisp/dists/quicklisp/software/iolib-20150302-git/src/grovel/" "-o" "/home/hijarian/systems/cl-test-grid/work-dir/agent/test-runs/20150303152413-ecl-13.5.1-76a84246-linux-x64-lisp-to-c/fasl/ql/dists/quicklisp/software/iolib-20150302-git/src/syscalls/ffi-types-unix" "/home/hijarian/systems/cl-test-grid/work-dir/agent/test-runs/20150303152413-ecl-13.5.1-76a84246-linux-x64-lisp-to-c/fasl/ql/dists/quicklisp/software/iolib-20150302-git/src/syscalls/ffi-types-unix.c" Output was: <see above>
(LOAD cl-v4l2 FAIL) ASDF/FIND-SYSTEM:LOAD-SYSTEM-DEFINITION-ERROR : Error while trying to load definition for system cl-v4l2 from pathname /home/hijarian/systems/cl-test-grid/work-dir/agent/quicklisp/dists/quicklisp/software/cl-v4l2-20101107-git/cl-v4l2.asd: External process exited with code 1. Command was: "g++" "-m64" "-Wno-write-strings" " -D_GNU_SOURCE -D_FILE_OFFSET_BITS=64 -g -O2 -fPIC -D_THREAD_SAFE -Dlinux" "-I/home/hijarian/systems/cl-test-grid/work-dir/agent/quicklisp/dists/quicklisp/software/iolib-20150113-git/src/grovel/" "-o" "/home/hijarian/systems/cl-test-grid/work-dir/agent/test-runs/20150119132805-ecl-13.5.1-76a84246-linux-x64-lisp-to-c/fasl/ql/dists/quicklisp/software/iolib-20150113-git/src/syscalls/ffi-types-unix" "/home/hijarian/systems/cl-test-grid/work-dir/agent/test-runs/20150119132805-ecl-13.5.1-76a84246-linux-x64-lisp-to-c/fasl/ql/dists/quicklisp/software/iolib-20150113-git/src/syscalls/ffi-types-unix.c" Output was: <see above>
ecl-13.5.1-unknown-linux-i686-bytecode
(LOAD cl-v4l2 FAIL) ASDF/FIND-SYSTEM:LOAD-SYSTEM-DEFINITION-ERROR : Error while trying to load definition for system cl-v4l2 from pathname /home/testgrid/cl-test-grid/work-dir/agent/quicklisp/dists/quicklisp/software/cl-v4l2-20101107-git/cl-v4l2.asd: The variable C::*CC-FLAGS* is unbound.
(LOAD cl-v4l2 FAIL) ASDF/FIND-SYSTEM:LOAD-SYSTEM-DEFINITION-ERROR : Error while trying to load definition for system cl-v4l2 from pathname /home/testgrid/cl-test-grid/work-dir/agent/quicklisp/dists/quicklisp/software/cl-v4l2-20101107-git/cl-v4l2.asd: The variable C::*CC-FLAGS* is unbound.
ecl-13.5.1-unknown-linux-i686-lisp-to-c
(LOAD cl-v4l2 FAIL) ASDF/FIND-SYSTEM:LOAD-SYSTEM-DEFINITION-ERROR : Error while trying to load definition for system cl-v4l2 from pathname /home/testgrid/cl-test-grid/work-dir/agent/quicklisp/dists/quicklisp/software/cl-v4l2-20101107-git/cl-v4l2.asd: Component :IOLIB/SYSCALLS not found, required by #<system "iolib.syscalls">
(LOAD cl-v4l2 FAIL) ASDF/FIND-SYSTEM:LOAD-SYSTEM-DEFINITION-ERROR : Error while trying to load definition for system cl-v4l2 from pathname /home/testgrid/cl-test-grid/work-dir/agent/quicklisp/dists/quicklisp/software/cl-v4l2-20101107-git/cl-v4l2.asd: Component :IOLIB/SYSCALLS not found, required by #<system "iolib.syscalls">
ecl-15.2.21-ee989b97-linux-i686-bytecode
(LOAD cl-v4l2 FAIL) ASDF/FIND-SYSTEM:LOAD-SYSTEM-DEFINITION-ERROR : Error while trying to load definition for system cl-v4l2 from pathname /home/testgrid/cl-test-grid/work-dir/agent/quicklisp/dists/quicklisp/software/cl-v4l2-20101107-git/cl-v4l2.asd: The variable C::*CC-FLAGS* is unbound.
(LOAD cl-v4l2 FAIL) ASDF/FIND-SYSTEM:LOAD-SYSTEM-DEFINITION-ERROR : Error while trying to load definition for system cl-v4l2 from pathname /home/testgrid/cl-test-grid/work-dir/agent/quicklisp/dists/quicklisp/software/cl-v4l2-20101107-git/cl-v4l2.asd: The variable C::*CC-FLAGS* is unbound.
ecl-15.2.21-ee989b97-linux-i686-lisp-to-c
(LOAD cl-v4l2 FAIL) ASDF/FIND-SYSTEM:LOAD-SYSTEM-DEFINITION-ERROR : Error while trying to load definition for system cl-v4l2 from pathname /home/testgrid/cl-test-grid/work-dir/agent/quicklisp/dists/quicklisp/software/cl-v4l2-20101107-git/cl-v4l2.asd: %CLOSE-FOREIGN-LIBRARY unimplemented.
(LOAD cl-v4l2 FAIL) ASDF/FIND-SYSTEM:LOAD-SYSTEM-DEFINITION-ERROR : Error while trying to load definition for system cl-v4l2 from pathname /home/testgrid/cl-test-grid/work-dir/agent/quicklisp/dists/quicklisp/software/cl-v4l2-20101107-git/cl-v4l2.asd: %CLOSE-FOREIGN-LIBRARY unimplemented.
sbcl-1.0.58-linux-x86
(LOAD cl-v4l2 FAIL) ASDF:LOAD-SYSTEM-DEFINITION-ERROR : Error while trying to load definition for system cl-v4l2 from pathname /home/testgrid/cl-test-grid/work-dir/agent/quicklisp/dists/quicklisp/software/cl-v4l2-20101107-git/cl-v4l2.asd: Component :IOLIB/SYSCALLS not found, required by #<SYSTEM "iolib.syscalls">
(LOAD cl-v4l2 FAIL) ASDF:LOAD-SYSTEM-DEFINITION-ERROR : Error while trying to load definition for system cl-v4l2 from pathname /home/testgrid/cl-test-grid/work-dir/agent/quicklisp/dists/quicklisp/software/cl-v4l2-20101107-git/cl-v4l2.asd: Component :IOLIB/SYSCALLS not found, required by #<SYSTEM "iolib.syscalls">
sbcl-1.1.11-linux-x86
(LOAD cl-v4l2 FAIL) ASDF/FIND-SYSTEM:LOAD-SYSTEM-DEFINITION-ERROR : Error while trying to load definition for system cl-v4l2 from pathname /home/testgrid/cl-test-grid/work-dir/agent/quicklisp/dists/quicklisp/software/cl-v4l2-20101107-git/cl-v4l2.asd: Component :IOLIB/SYSCALLS not found, required by #<SYSTEM "iolib.syscalls">
(LOAD cl-v4l2 FAIL) ASDF/FIND-SYSTEM:LOAD-SYSTEM-DEFINITION-ERROR : Error while trying to load definition for system cl-v4l2 from pathname /home/testgrid/cl-test-grid/work-dir/agent/quicklisp/dists/quicklisp/software/cl-v4l2-20101107-git/cl-v4l2.asd: Component :IOLIB/SYSCALLS not found, required by #<SYSTEM "iolib.syscalls">
sbcl-1.1.16-linux-x86
(LOAD cl-v4l2 FAIL) ASDF/FIND-SYSTEM:LOAD-SYSTEM-DEFINITION-ERROR : Error while trying to load definition for system cl-v4l2 from pathname /home/testgrid/cl-test-grid/work-dir/agent/quicklisp/dists/quicklisp/software/cl-v4l2-20101107-git/cl-v4l2.asd: Component :IOLIB/SYSCALLS not found, required by #<SYSTEM "iolib.syscalls">
(LOAD cl-v4l2 FAIL) ASDF/FIND-SYSTEM:LOAD-SYSTEM-DEFINITION-ERROR : Error while trying to load definition for system cl-v4l2 from pathname /home/testgrid/cl-test-grid/work-dir/agent/quicklisp/dists/quicklisp/software/cl-v4l2-20101107-git/cl-v4l2.asd: Component :IOLIB/SYSCALLS not found, required by #<SYSTEM "iolib.syscalls">
sbcl-1.2.3-linux-x64
(LOAD cl-v4l2 FAIL) ASDF/FIND-SYSTEM:LOAD-SYSTEM-DEFINITION-ERROR : Error while trying to load definition for system cl-v4l2 from pathname /home/hijarian/systems/cl-test-grid/work-dir/agent/quicklisp/dists/quicklisp/software/cl-v4l2-20101107-git/cl-v4l2.asd: External process exited with code 1. Command was: "g++" "-m64" "-Wno-write-strings" "-I/home/hijarian/systems/cl-test-grid/work-dir/agent/quicklisp/dists/quicklisp/software/iolib-20150302-git/src/grovel/" "-o" "/home/hijarian/systems/cl-test-grid/work-dir/agent/test-runs/20150303132800-sbcl-1.2.3-linux-x64/fasl/ql/dists/quicklisp/software/iolib-20150302-git/src/syscalls/ffi-types-unix" "/home/hijarian/systems/cl-test-grid/work-dir/agent/test-runs/20150303132800-sbcl-1.2.3-linux-x64/fasl/ql/dists/quicklisp/software/iolib-20150302-git/src/syscalls/ffi-types-unix.c" Output was: /home/hijarian/systems/cl-test-grid/work-dir/agent/test-runs/20150303132800-sbcl-1.2.3-linux-x64/fasl/ql/dists/quicklisp/software/iolib-20150302-git/src/syscalls/ffi-types-unix.c:14:17: fatal error: lfp.h: Нет такого файла или каталога #include <lfp.h> ^ compilation terminated.
(LOAD cl-v4l2 FAIL) ASDF/FIND-SYSTEM:LOAD-SYSTEM-DEFINITION-ERROR : Error while trying to load definition for system cl-v4l2 from pathname /home/hijarian/systems/cl-test-grid/work-dir/agent/quicklisp/dists/quicklisp/software/cl-v4l2-20101107-git/cl-v4l2.asd: External process exited with code 1. Command was: "g++" "-m64" "-Wno-write-strings" "-I/home/hijarian/systems/cl-test-grid/work-dir/agent/quicklisp/dists/quicklisp/software/iolib-20150113-git/src/grovel/" "-o" "/home/hijarian/systems/cl-test-grid/work-dir/agent/test-runs/20150116150322-sbcl-1.2.3-linux-x64/fasl/ql/dists/quicklisp/software/iolib-20150113-git/src/syscalls/ffi-types-unix" "/home/hijarian/systems/cl-test-grid/work-dir/agent/test-runs/20150116150322-sbcl-1.2.3-linux-x64/fasl/ql/dists/quicklisp/software/iolib-20150113-git/src/syscalls/ffi-types-unix.c" Output was: /home/hijarian/systems/cl-test-grid/work-dir/agent/test-runs/20150116150322-sbcl-1.2.3-linux-x64/fasl/ql/dists/quicklisp/software/iolib-20150113-git/src/syscalls/ffi-types-unix.c:14:17: fatal error: lfp.h: Нет такого файла или каталога #include <lfp.h> ^ compilation terminated.
sbcl-1.2.6-linux-x86
sbcl-1.2.8-linux-x64
(LOAD cl-v4l2 FAIL) ASDF/FIND-SYSTEM:LOAD-SYSTEM-DEFINITION-ERROR : Error while trying to load definition for system cl-v4l2 from pathname /home/joram/dev/lisp/cl-test-grid/work-dir/agent/quicklisp/dists/quicklisp/software/cl-v4l2-20101107-git/cl-v4l2.asd: External process exited with code 1. Command was: "g++" "-m64" "-Wno-write-strings" "-I/home/joram/dev/lisp/cl-test-grid/work-dir/agent/quicklisp/dists/quicklisp/software/iolib-20150302-git/src/grovel/" "-o" "/home/joram/dev/lisp/cl-test-grid/work-dir/agent/test-runs/20150316154043-sbcl-1.2.8-linux-x64/fasl/ql/dists/quicklisp/software/iolib-20150302-git/src/syscalls/ffi-types-unix" "/home/joram/dev/lisp/cl-test-grid/work-dir/agent/test-runs/20150316154043-sbcl-1.2.8-linux-x64/fasl/ql/dists/quicklisp/software/iolib-20150302-git/src/syscalls/ffi-types-unix.c" Output was: /home/joram/dev/lisp/cl-test-grid/work-dir/agent/test-runs/20150316154043-sbcl-1.2.8-linux-x64/fasl/ql/dists/quicklisp/software/iolib-20150302-git/src/syscalls/ffi-types-unix.c:14:17: fatal error: lfp.h: No such file or directory #include <lfp.h> ^ compilation terminated.

Breakdown by testcases: for every failed testcase the lisp implmentations it fails on

The library does not have a testsuite adapter for CL Test Grid.

To reports overview

Generated at: 2015-03-25 10:31:11 GMT.