cl-mw results collected by cl-test-grid

Results on the last two Quicklisp distributions

 quicklisp 2015-06-08quicklisp 2015-05-05
abcl-1.2.1-fasl42-linux-x86
(LOAD cl-mw.examples.with-task-policy FAIL) needs newer ASDF, ASDF/FIND-SYSTEM:LOAD-SYSTEM-DEFINITION-ERROR : Error while trying to load definition for system hu.dwim.serializer from pathname /home/testgrid/cl-test-grid/work-dir/agent/quicklisp/dists/quicklisp/software/hu.dwim.serializer-20150608-darcs/hu.dwim.serializer.asd: The symbol NON-PROPAGATING-OPERATION is not present in package ASDF/INTERFACE.
(LOAD cl-mw.examples.ping FAIL) needs newer ASDF, ASDF/FIND-SYSTEM:LOAD-SYSTEM-DEFINITION-ERROR : Error while trying to load definition for system hu.dwim.serializer from pathname /home/testgrid/cl-test-grid/work-dir/agent/quicklisp/dists/quicklisp/software/hu.dwim.serializer-20150608-darcs/hu.dwim.serializer.asd: The symbol NON-PROPAGATING-OPERATION is not present in package ASDF/INTERFACE.
(LOAD cl-mw.examples.monte-carlo-pi FAIL) needs newer ASDF, ASDF/FIND-SYSTEM:LOAD-SYSTEM-DEFINITION-ERROR : Error while trying to load definition for system hu.dwim.serializer from pathname /home/testgrid/cl-test-grid/work-dir/agent/quicklisp/dists/quicklisp/software/hu.dwim.serializer-20150608-darcs/hu.dwim.serializer.asd: The symbol NON-PROPAGATING-OPERATION is not present in package ASDF/INTERFACE.
(LOAD cl-mw.examples.higher-order FAIL) needs newer ASDF, ASDF/FIND-SYSTEM:LOAD-SYSTEM-DEFINITION-ERROR : Error while trying to load definition for system hu.dwim.serializer from pathname /home/testgrid/cl-test-grid/work-dir/agent/quicklisp/dists/quicklisp/software/hu.dwim.serializer-20150608-darcs/hu.dwim.serializer.asd: The symbol NON-PROPAGATING-OPERATION is not present in package ASDF/INTERFACE.
(LOAD cl-mw.examples.hello-world FAIL) needs newer ASDF, ASDF/FIND-SYSTEM:LOAD-SYSTEM-DEFINITION-ERROR : Error while trying to load definition for system hu.dwim.serializer from pathname /home/testgrid/cl-test-grid/work-dir/agent/quicklisp/dists/quicklisp/software/hu.dwim.serializer-20150608-darcs/hu.dwim.serializer.asd: The symbol NON-PROPAGATING-OPERATION is not present in package ASDF/INTERFACE.
(LOAD cl-mw.examples.argument-processing FAIL) needs newer ASDF, ASDF/FIND-SYSTEM:LOAD-SYSTEM-DEFINITION-ERROR : Error while trying to load definition for system hu.dwim.serializer from pathname /home/testgrid/cl-test-grid/work-dir/agent/quicklisp/dists/quicklisp/software/hu.dwim.serializer-20150608-darcs/hu.dwim.serializer.asd: The symbol NON-PROPAGATING-OPERATION is not present in package ASDF/INTERFACE.
(LOAD cl-mw FAIL) needs newer ASDF, ASDF/FIND-SYSTEM:LOAD-SYSTEM-DEFINITION-ERROR : Error while trying to load definition for system hu.dwim.serializer from pathname /home/testgrid/cl-test-grid/work-dir/agent/quicklisp/dists/quicklisp/software/hu.dwim.serializer-20150608-darcs/hu.dwim.serializer.asd: The symbol NON-PROPAGATING-OPERATION is not present in package ASDF/INTERFACE.
(LOAD cl-mw.examples.with-task-policy FAIL) COMMON-LISP:READER-ERROR : The package "SB-EXT" can't be found.
(LOAD cl-mw.examples.ping FAIL) COMMON-LISP:READER-ERROR : The package "SB-EXT" can't be found.
(LOAD cl-mw.examples.monte-carlo-pi FAIL) COMMON-LISP:READER-ERROR : The package "SB-EXT" can't be found.
(LOAD cl-mw.examples.higher-order FAIL) COMMON-LISP:READER-ERROR : The package "SB-EXT" can't be found.
(LOAD cl-mw.examples.hello-world FAIL) COMMON-LISP:READER-ERROR : The package "SB-EXT" can't be found.
(LOAD cl-mw.examples.argument-processing FAIL) COMMON-LISP:READER-ERROR : The package "SB-EXT" can't be found.
(LOAD cl-mw FAIL) COMMON-LISP:READER-ERROR : The package "SB-EXT" can't be found.
abcl-1.3.0-fasl42-linux-x86
(LOAD cl-mw.examples.with-task-policy FAIL) COMMON-LISP:READER-ERROR : The package "SB-EXT" can't be found.
(LOAD cl-mw.examples.ping FAIL) COMMON-LISP:READER-ERROR : The package "SB-EXT" can't be found.
(LOAD cl-mw.examples.monte-carlo-pi FAIL) COMMON-LISP:READER-ERROR : The package "SB-EXT" can't be found.
(LOAD cl-mw.examples.higher-order FAIL) COMMON-LISP:READER-ERROR : The package "SB-EXT" can't be found.
(LOAD cl-mw.examples.hello-world FAIL) COMMON-LISP:READER-ERROR : The package "SB-EXT" can't be found.
(LOAD cl-mw.examples.argument-processing FAIL) COMMON-LISP:READER-ERROR : The package "SB-EXT" can't be found.
(LOAD cl-mw FAIL) COMMON-LISP:READER-ERROR : The package "SB-EXT" can't be found.
(LOAD cl-mw.examples.with-task-policy FAIL) COMMON-LISP:READER-ERROR : The package "SB-EXT" can't be found.
(LOAD cl-mw.examples.ping FAIL) COMMON-LISP:READER-ERROR : The package "SB-EXT" can't be found.
(LOAD cl-mw.examples.monte-carlo-pi FAIL) COMMON-LISP:READER-ERROR : The package "SB-EXT" can't be found.
(LOAD cl-mw.examples.higher-order FAIL) COMMON-LISP:READER-ERROR : The package "SB-EXT" can't be found.
(LOAD cl-mw.examples.hello-world FAIL) COMMON-LISP:READER-ERROR : The package "SB-EXT" can't be found.
(LOAD cl-mw.examples.argument-processing FAIL) COMMON-LISP:READER-ERROR : The package "SB-EXT" can't be found.
(LOAD cl-mw FAIL) COMMON-LISP:READER-ERROR : The package "SB-EXT" can't be found.
abcl-1.3.1-fasl42-linux-x86
(LOAD cl-mw.examples.with-task-policy FAIL) COMMON-LISP:READER-ERROR : The package "SB-EXT" can't be found.
(LOAD cl-mw.examples.ping FAIL) COMMON-LISP:READER-ERROR : The package "SB-EXT" can't be found.
(LOAD cl-mw.examples.monte-carlo-pi FAIL) COMMON-LISP:READER-ERROR : The package "SB-EXT" can't be found.
(LOAD cl-mw.examples.higher-order FAIL) COMMON-LISP:READER-ERROR : The package "SB-EXT" can't be found.
(LOAD cl-mw.examples.hello-world FAIL) COMMON-LISP:READER-ERROR : The package "SB-EXT" can't be found.
(LOAD cl-mw.examples.argument-processing FAIL) COMMON-LISP:READER-ERROR : The package "SB-EXT" can't be found.
(LOAD cl-mw FAIL) COMMON-LISP:READER-ERROR : The package "SB-EXT" can't be found.
(LOAD cl-mw.examples.with-task-policy FAIL) COMMON-LISP:READER-ERROR : The package "SB-EXT" can't be found.
(LOAD cl-mw.examples.ping FAIL) COMMON-LISP:READER-ERROR : The package "SB-EXT" can't be found.
(LOAD cl-mw.examples.monte-carlo-pi FAIL) COMMON-LISP:READER-ERROR : The package "SB-EXT" can't be found.
(LOAD cl-mw.examples.higher-order FAIL) COMMON-LISP:READER-ERROR : The package "SB-EXT" can't be found.
(LOAD cl-mw.examples.hello-world FAIL) COMMON-LISP:READER-ERROR : The package "SB-EXT" can't be found.
(LOAD cl-mw.examples.argument-processing FAIL) COMMON-LISP:READER-ERROR : The package "SB-EXT" can't be found.
(LOAD cl-mw FAIL) COMMON-LISP:READER-ERROR : The package "SB-EXT" can't be found.
abcl-1.3.2-fasl42-linux-x86
(LOAD cl-mw.examples.with-task-policy FAIL) COMMON-LISP:READER-ERROR : The package "SB-EXT" can't be found.
(LOAD cl-mw.examples.ping FAIL) COMMON-LISP:READER-ERROR : The package "SB-EXT" can't be found.
(LOAD cl-mw.examples.monte-carlo-pi FAIL) COMMON-LISP:READER-ERROR : The package "SB-EXT" can't be found.
(LOAD cl-mw.examples.higher-order FAIL) COMMON-LISP:READER-ERROR : The package "SB-EXT" can't be found.
(LOAD cl-mw.examples.hello-world FAIL) COMMON-LISP:READER-ERROR : The package "SB-EXT" can't be found.
(LOAD cl-mw.examples.argument-processing FAIL) COMMON-LISP:READER-ERROR : The package "SB-EXT" can't be found.
(LOAD cl-mw FAIL) COMMON-LISP:READER-ERROR : The package "SB-EXT" can't be found.
(LOAD cl-mw.examples.with-task-policy FAIL) COMMON-LISP:READER-ERROR : The package "SB-EXT" can't be found.
(LOAD cl-mw.examples.ping FAIL) COMMON-LISP:READER-ERROR : The package "SB-EXT" can't be found.
(LOAD cl-mw.examples.monte-carlo-pi FAIL) COMMON-LISP:READER-ERROR : The package "SB-EXT" can't be found.
(LOAD cl-mw.examples.higher-order FAIL) COMMON-LISP:READER-ERROR : The package "SB-EXT" can't be found.
(LOAD cl-mw.examples.hello-world FAIL) COMMON-LISP:READER-ERROR : The package "SB-EXT" can't be found.
(LOAD cl-mw.examples.argument-processing FAIL) COMMON-LISP:READER-ERROR : The package "SB-EXT" can't be found.
(LOAD cl-mw FAIL) COMMON-LISP:READER-ERROR : The package "SB-EXT" can't be found.
ccl-1.10-r16196-f96-linux-x64
(LOAD cl-mw.examples.with-task-policy FAIL) COMMON-LISP:SIMPLE-ERROR : External process exited with code 1. Command was: "g++" "-m64" "-Wno-write-strings" "-I/home/hijarian/systems/cl-test-grid/work-dir/agent/quicklisp/dists/quicklisp/software/iolib-20150302-git/src/grovel/" "-o" "/home/hijarian/systems/cl-test-grid/work-dir/agent/test-runs/20150609102449-ccl-1.10-r16196-f96-linux-x64/fasl/ql/dists/quicklisp/software/iolib-20150302-git/src/syscalls/ffi-types-unix" "/home/hijarian/systems/cl-test-grid/work-dir/agent/test-runs/20150609102449-ccl-1.10-r16196-f96-linux-x64/fasl/ql/dists/quicklisp/software/iolib-20150302-git/src/syscalls/ffi-types-unix.c" Output was: /home/hijarian/systems/cl-test-grid/work-dir/agent/test-runs/20150609102449-ccl-1.10-r16196-f96-linux-x64/fasl/ql/dists/quicklisp/software/iolib-20150302-git/src/syscalls/ffi-types-unix.c:14:17: fatal error: lfp.h: Нет такого файла или каталога #include <lfp.h> ^ compilation terminated.
(LOAD cl-mw.examples.ping FAIL) COMMON-LISP:SIMPLE-ERROR : External process exited with code 1. Command was: "g++" "-m64" "-Wno-write-strings" "-I/home/hijarian/systems/cl-test-grid/work-dir/agent/quicklisp/dists/quicklisp/software/iolib-20150302-git/src/grovel/" "-o" "/home/hijarian/systems/cl-test-grid/work-dir/agent/test-runs/20150609102449-ccl-1.10-r16196-f96-linux-x64/fasl/ql/dists/quicklisp/software/iolib-20150302-git/src/syscalls/ffi-types-unix" "/home/hijarian/systems/cl-test-grid/work-dir/agent/test-runs/20150609102449-ccl-1.10-r16196-f96-linux-x64/fasl/ql/dists/quicklisp/software/iolib-20150302-git/src/syscalls/ffi-types-unix.c" Output was: /home/hijarian/systems/cl-test-grid/work-dir/agent/test-runs/20150609102449-ccl-1.10-r16196-f96-linux-x64/fasl/ql/dists/quicklisp/software/iolib-20150302-git/src/syscalls/ffi-types-unix.c:14:17: fatal error: lfp.h: Нет такого файла или каталога #include <lfp.h> ^ compilation terminated.
(LOAD cl-mw.examples.monte-carlo-pi FAIL) COMMON-LISP:SIMPLE-ERROR : External process exited with code 1. Command was: "g++" "-m64" "-Wno-write-strings" "-I/home/hijarian/systems/cl-test-grid/work-dir/agent/quicklisp/dists/quicklisp/software/iolib-20150302-git/src/grovel/" "-o" "/home/hijarian/systems/cl-test-grid/work-dir/agent/test-runs/20150609102449-ccl-1.10-r16196-f96-linux-x64/fasl/ql/dists/quicklisp/software/iolib-20150302-git/src/syscalls/ffi-types-unix" "/home/hijarian/systems/cl-test-grid/work-dir/agent/test-runs/20150609102449-ccl-1.10-r16196-f96-linux-x64/fasl/ql/dists/quicklisp/software/iolib-20150302-git/src/syscalls/ffi-types-unix.c" Output was: /home/hijarian/systems/cl-test-grid/work-dir/agent/test-runs/20150609102449-ccl-1.10-r16196-f96-linux-x64/fasl/ql/dists/quicklisp/software/iolib-20150302-git/src/syscalls/ffi-types-unix.c:14:17: fatal error: lfp.h: Нет такого файла или каталога #include <lfp.h> ^ compilation terminated.
(LOAD cl-mw.examples.higher-order FAIL) COMMON-LISP:SIMPLE-ERROR : External process exited with code 1. Command was: "g++" "-m64" "-Wno-write-strings" "-I/home/hijarian/systems/cl-test-grid/work-dir/agent/quicklisp/dists/quicklisp/software/iolib-20150302-git/src/grovel/" "-o" "/home/hijarian/systems/cl-test-grid/work-dir/agent/test-runs/20150609102449-ccl-1.10-r16196-f96-linux-x64/fasl/ql/dists/quicklisp/software/iolib-20150302-git/src/syscalls/ffi-types-unix" "/home/hijarian/systems/cl-test-grid/work-dir/agent/test-runs/20150609102449-ccl-1.10-r16196-f96-linux-x64/fasl/ql/dists/quicklisp/software/iolib-20150302-git/src/syscalls/ffi-types-unix.c" Output was: /home/hijarian/systems/cl-test-grid/work-dir/agent/test-runs/20150609102449-ccl-1.10-r16196-f96-linux-x64/fasl/ql/dists/quicklisp/software/iolib-20150302-git/src/syscalls/ffi-types-unix.c:14:17: fatal error: lfp.h: Нет такого файла или каталога #include <lfp.h> ^ compilation terminated.
(LOAD cl-mw.examples.hello-world FAIL) COMMON-LISP:SIMPLE-ERROR : External process exited with code 1. Command was: "g++" "-m64" "-Wno-write-strings" "-I/home/hijarian/systems/cl-test-grid/work-dir/agent/quicklisp/dists/quicklisp/software/iolib-20150302-git/src/grovel/" "-o" "/home/hijarian/systems/cl-test-grid/work-dir/agent/test-runs/20150609102449-ccl-1.10-r16196-f96-linux-x64/fasl/ql/dists/quicklisp/software/iolib-20150302-git/src/syscalls/ffi-types-unix" "/home/hijarian/systems/cl-test-grid/work-dir/agent/test-runs/20150609102449-ccl-1.10-r16196-f96-linux-x64/fasl/ql/dists/quicklisp/software/iolib-20150302-git/src/syscalls/ffi-types-unix.c" Output was: /home/hijarian/systems/cl-test-grid/work-dir/agent/test-runs/20150609102449-ccl-1.10-r16196-f96-linux-x64/fasl/ql/dists/quicklisp/software/iolib-20150302-git/src/syscalls/ffi-types-unix.c:14:17: fatal error: lfp.h: Нет такого файла или каталога #include <lfp.h> ^ compilation terminated.
(LOAD cl-mw.examples.argument-processing FAIL) COMMON-LISP:SIMPLE-ERROR : External process exited with code 1. Command was: "g++" "-m64" "-Wno-write-strings" "-I/home/hijarian/systems/cl-test-grid/work-dir/agent/quicklisp/dists/quicklisp/software/iolib-20150302-git/src/grovel/" "-o" "/home/hijarian/systems/cl-test-grid/work-dir/agent/test-runs/20150609102449-ccl-1.10-r16196-f96-linux-x64/fasl/ql/dists/quicklisp/software/iolib-20150302-git/src/syscalls/ffi-types-unix" "/home/hijarian/systems/cl-test-grid/work-dir/agent/test-runs/20150609102449-ccl-1.10-r16196-f96-linux-x64/fasl/ql/dists/quicklisp/software/iolib-20150302-git/src/syscalls/ffi-types-unix.c" Output was: /home/hijarian/systems/cl-test-grid/work-dir/agent/test-runs/20150609102449-ccl-1.10-r16196-f96-linux-x64/fasl/ql/dists/quicklisp/software/iolib-20150302-git/src/syscalls/ffi-types-unix.c:14:17: fatal error: lfp.h: Нет такого файла или каталога #include <lfp.h> ^ compilation terminated.
(LOAD cl-mw FAIL) COMMON-LISP:SIMPLE-ERROR : External process exited with code 1. Command was: "g++" "-m64" "-Wno-write-strings" "-I/home/hijarian/systems/cl-test-grid/work-dir/agent/quicklisp/dists/quicklisp/software/iolib-20150302-git/src/grovel/" "-o" "/home/hijarian/systems/cl-test-grid/work-dir/agent/test-runs/20150609102449-ccl-1.10-r16196-f96-linux-x64/fasl/ql/dists/quicklisp/software/iolib-20150302-git/src/syscalls/ffi-types-unix" "/home/hijarian/systems/cl-test-grid/work-dir/agent/test-runs/20150609102449-ccl-1.10-r16196-f96-linux-x64/fasl/ql/dists/quicklisp/software/iolib-20150302-git/src/syscalls/ffi-types-unix.c" Output was: /home/hijarian/systems/cl-test-grid/work-dir/agent/test-runs/20150609102449-ccl-1.10-r16196-f96-linux-x64/fasl/ql/dists/quicklisp/software/iolib-20150302-git/src/syscalls/ffi-types-unix.c:14:17: fatal error: lfp.h: Нет такого файла или каталога #include <lfp.h> ^ compilation terminated.
(LOAD cl-mw.examples.with-task-policy FAIL) COMMON-LISP:SIMPLE-ERROR : External process exited with code 1. Command was: "g++" "-m64" "-Wno-write-strings" "-I/home/hijarian/systems/cl-test-grid/work-dir/agent/quicklisp/dists/quicklisp/software/iolib-20150302-git/src/grovel/" "-o" "/home/hijarian/systems/cl-test-grid/work-dir/agent/test-runs/20150518161431-ccl-1.10-r16196-f96-linux-x64/fasl/ql/dists/quicklisp/software/iolib-20150302-git/src/syscalls/ffi-types-unix" "/home/hijarian/systems/cl-test-grid/work-dir/agent/test-runs/20150518161431-ccl-1.10-r16196-f96-linux-x64/fasl/ql/dists/quicklisp/software/iolib-20150302-git/src/syscalls/ffi-types-unix.c" Output was: /home/hijarian/systems/cl-test-grid/work-dir/agent/test-runs/20150518161431-ccl-1.10-r16196-f96-linux-x64/fasl/ql/dists/quicklisp/software/iolib-20150302-git/src/syscalls/ffi-types-unix.c:14:17: fatal error: lfp.h: Нет такого файла или каталога #include <lfp.h> ^ compilation terminated.
(LOAD cl-mw.examples.ping FAIL) COMMON-LISP:SIMPLE-ERROR : External process exited with code 1. Command was: "g++" "-m64" "-Wno-write-strings" "-I/home/hijarian/systems/cl-test-grid/work-dir/agent/quicklisp/dists/quicklisp/software/iolib-20150302-git/src/grovel/" "-o" "/home/hijarian/systems/cl-test-grid/work-dir/agent/test-runs/20150518161431-ccl-1.10-r16196-f96-linux-x64/fasl/ql/dists/quicklisp/software/iolib-20150302-git/src/syscalls/ffi-types-unix" "/home/hijarian/systems/cl-test-grid/work-dir/agent/test-runs/20150518161431-ccl-1.10-r16196-f96-linux-x64/fasl/ql/dists/quicklisp/software/iolib-20150302-git/src/syscalls/ffi-types-unix.c" Output was: /home/hijarian/systems/cl-test-grid/work-dir/agent/test-runs/20150518161431-ccl-1.10-r16196-f96-linux-x64/fasl/ql/dists/quicklisp/software/iolib-20150302-git/src/syscalls/ffi-types-unix.c:14:17: fatal error: lfp.h: Нет такого файла или каталога #include <lfp.h> ^ compilation terminated.
(LOAD cl-mw.examples.monte-carlo-pi FAIL) COMMON-LISP:SIMPLE-ERROR : External process exited with code 1. Command was: "g++" "-m64" "-Wno-write-strings" "-I/home/hijarian/systems/cl-test-grid/work-dir/agent/quicklisp/dists/quicklisp/software/iolib-20150302-git/src/grovel/" "-o" "/home/hijarian/systems/cl-test-grid/work-dir/agent/test-runs/20150518161431-ccl-1.10-r16196-f96-linux-x64/fasl/ql/dists/quicklisp/software/iolib-20150302-git/src/syscalls/ffi-types-unix" "/home/hijarian/systems/cl-test-grid/work-dir/agent/test-runs/20150518161431-ccl-1.10-r16196-f96-linux-x64/fasl/ql/dists/quicklisp/software/iolib-20150302-git/src/syscalls/ffi-types-unix.c" Output was: /home/hijarian/systems/cl-test-grid/work-dir/agent/test-runs/20150518161431-ccl-1.10-r16196-f96-linux-x64/fasl/ql/dists/quicklisp/software/iolib-20150302-git/src/syscalls/ffi-types-unix.c:14:17: fatal error: lfp.h: Нет такого файла или каталога #include <lfp.h> ^ compilation terminated.
(LOAD cl-mw.examples.higher-order FAIL) COMMON-LISP:SIMPLE-ERROR : External process exited with code 1. Command was: "g++" "-m64" "-Wno-write-strings" "-I/home/hijarian/systems/cl-test-grid/work-dir/agent/quicklisp/dists/quicklisp/software/iolib-20150302-git/src/grovel/" "-o" "/home/hijarian/systems/cl-test-grid/work-dir/agent/test-runs/20150518161431-ccl-1.10-r16196-f96-linux-x64/fasl/ql/dists/quicklisp/software/iolib-20150302-git/src/syscalls/ffi-types-unix" "/home/hijarian/systems/cl-test-grid/work-dir/agent/test-runs/20150518161431-ccl-1.10-r16196-f96-linux-x64/fasl/ql/dists/quicklisp/software/iolib-20150302-git/src/syscalls/ffi-types-unix.c" Output was: /home/hijarian/systems/cl-test-grid/work-dir/agent/test-runs/20150518161431-ccl-1.10-r16196-f96-linux-x64/fasl/ql/dists/quicklisp/software/iolib-20150302-git/src/syscalls/ffi-types-unix.c:14:17: fatal error: lfp.h: Нет такого файла или каталога #include <lfp.h> ^ compilation terminated.
(LOAD cl-mw.examples.hello-world FAIL) COMMON-LISP:SIMPLE-ERROR : External process exited with code 1. Command was: "g++" "-m64" "-Wno-write-strings" "-I/home/hijarian/systems/cl-test-grid/work-dir/agent/quicklisp/dists/quicklisp/software/iolib-20150302-git/src/grovel/" "-o" "/home/hijarian/systems/cl-test-grid/work-dir/agent/test-runs/20150518161431-ccl-1.10-r16196-f96-linux-x64/fasl/ql/dists/quicklisp/software/iolib-20150302-git/src/syscalls/ffi-types-unix" "/home/hijarian/systems/cl-test-grid/work-dir/agent/test-runs/20150518161431-ccl-1.10-r16196-f96-linux-x64/fasl/ql/dists/quicklisp/software/iolib-20150302-git/src/syscalls/ffi-types-unix.c" Output was: /home/hijarian/systems/cl-test-grid/work-dir/agent/test-runs/20150518161431-ccl-1.10-r16196-f96-linux-x64/fasl/ql/dists/quicklisp/software/iolib-20150302-git/src/syscalls/ffi-types-unix.c:14:17: fatal error: lfp.h: Нет такого файла или каталога #include <lfp.h> ^ compilation terminated.
(LOAD cl-mw.examples.argument-processing FAIL) COMMON-LISP:SIMPLE-ERROR : External process exited with code 1. Command was: "g++" "-m64" "-Wno-write-strings" "-I/home/hijarian/systems/cl-test-grid/work-dir/agent/quicklisp/dists/quicklisp/software/iolib-20150302-git/src/grovel/" "-o" "/home/hijarian/systems/cl-test-grid/work-dir/agent/test-runs/20150518161431-ccl-1.10-r16196-f96-linux-x64/fasl/ql/dists/quicklisp/software/iolib-20150302-git/src/syscalls/ffi-types-unix" "/home/hijarian/systems/cl-test-grid/work-dir/agent/test-runs/20150518161431-ccl-1.10-r16196-f96-linux-x64/fasl/ql/dists/quicklisp/software/iolib-20150302-git/src/syscalls/ffi-types-unix.c" Output was: /home/hijarian/systems/cl-test-grid/work-dir/agent/test-runs/20150518161431-ccl-1.10-r16196-f96-linux-x64/fasl/ql/dists/quicklisp/software/iolib-20150302-git/src/syscalls/ffi-types-unix.c:14:17: fatal error: lfp.h: Нет такого файла или каталога #include <lfp.h> ^ compilation terminated.
(LOAD cl-mw FAIL) COMMON-LISP:SIMPLE-ERROR : External process exited with code 1. Command was: "g++" "-m64" "-Wno-write-strings" "-I/home/hijarian/systems/cl-test-grid/work-dir/agent/quicklisp/dists/quicklisp/software/iolib-20150302-git/src/grovel/" "-o" "/home/hijarian/systems/cl-test-grid/work-dir/agent/test-runs/20150518161431-ccl-1.10-r16196-f96-linux-x64/fasl/ql/dists/quicklisp/software/iolib-20150302-git/src/syscalls/ffi-types-unix" "/home/hijarian/systems/cl-test-grid/work-dir/agent/test-runs/20150518161431-ccl-1.10-r16196-f96-linux-x64/fasl/ql/dists/quicklisp/software/iolib-20150302-git/src/syscalls/ffi-types-unix.c" Output was: /home/hijarian/systems/cl-test-grid/work-dir/agent/test-runs/20150518161431-ccl-1.10-r16196-f96-linux-x64/fasl/ql/dists/quicklisp/software/iolib-20150302-git/src/syscalls/ffi-types-unix.c:14:17: fatal error: lfp.h: Нет такого файла или каталога #include <lfp.h> ^ compilation terminated.
ccl-1.10-r16196-f96-linux-x86
(LOAD cl-mw.examples.with-task-policy FAIL) CCL::NO-SUCH-PACKAGE : There is no package named "SB-EXT" .
(LOAD cl-mw.examples.ping FAIL) CCL::NO-SUCH-PACKAGE : There is no package named "SB-EXT" .
(LOAD cl-mw.examples.monte-carlo-pi FAIL) CCL::NO-SUCH-PACKAGE : There is no package named "SB-EXT" .
(LOAD cl-mw.examples.higher-order FAIL) CCL::NO-SUCH-PACKAGE : There is no package named "SB-EXT" .
(LOAD cl-mw.examples.hello-world FAIL) CCL::NO-SUCH-PACKAGE : There is no package named "SB-EXT" .
(LOAD cl-mw.examples.argument-processing FAIL) CCL::NO-SUCH-PACKAGE : There is no package named "SB-EXT" .
(LOAD cl-mw FAIL) CCL::NO-SUCH-PACKAGE : There is no package named "SB-EXT" .
(LOAD cl-mw.examples.with-task-policy FAIL) CCL::NO-SUCH-PACKAGE : There is no package named "SB-EXT" .
(LOAD cl-mw.examples.ping FAIL) CCL::NO-SUCH-PACKAGE : There is no package named "SB-EXT" .
(LOAD cl-mw.examples.monte-carlo-pi FAIL) CCL::NO-SUCH-PACKAGE : There is no package named "SB-EXT" .
(LOAD cl-mw.examples.higher-order FAIL) CCL::NO-SUCH-PACKAGE : There is no package named "SB-EXT" .
(LOAD cl-mw.examples.hello-world FAIL) CCL::NO-SUCH-PACKAGE : There is no package named "SB-EXT" .
(LOAD cl-mw.examples.argument-processing FAIL) CCL::NO-SUCH-PACKAGE : There is no package named "SB-EXT" .
(LOAD cl-mw FAIL) CCL::NO-SUCH-PACKAGE : There is no package named "SB-EXT" .
ccl-1.8-r15286m-f95-linux-x86
(LOAD cl-mw.examples.with-task-policy FAIL) ASDF:LOAD-SYSTEM-DEFINITION-ERROR : Error while trying to load definition for system iolib from pathname /home/testgrid/cl-test-grid/work-dir/agent/quicklisp/dists/quicklisp/software/iolib-20150302-git/iolib.asd: You need ASDF >= 2.31.1 to load this system correctly.
(LOAD cl-mw.examples.ping FAIL) ASDF:LOAD-SYSTEM-DEFINITION-ERROR : Error while trying to load definition for system iolib from pathname /home/testgrid/cl-test-grid/work-dir/agent/quicklisp/dists/quicklisp/software/iolib-20150302-git/iolib.asd: You need ASDF >= 2.31.1 to load this system correctly.
(LOAD cl-mw.examples.monte-carlo-pi FAIL) ASDF:LOAD-SYSTEM-DEFINITION-ERROR : Error while trying to load definition for system iolib from pathname /home/testgrid/cl-test-grid/work-dir/agent/quicklisp/dists/quicklisp/software/iolib-20150302-git/iolib.asd: You need ASDF >= 2.31.1 to load this system correctly.
(LOAD cl-mw.examples.higher-order FAIL) ASDF:LOAD-SYSTEM-DEFINITION-ERROR : Error while trying to load definition for system iolib from pathname /home/testgrid/cl-test-grid/work-dir/agent/quicklisp/dists/quicklisp/software/iolib-20150302-git/iolib.asd: You need ASDF >= 2.31.1 to load this system correctly.
(LOAD cl-mw.examples.hello-world FAIL) ASDF:LOAD-SYSTEM-DEFINITION-ERROR : Error while trying to load definition for system iolib from pathname /home/testgrid/cl-test-grid/work-dir/agent/quicklisp/dists/quicklisp/software/iolib-20150302-git/iolib.asd: You need ASDF >= 2.31.1 to load this system correctly.
(LOAD cl-mw.examples.argument-processing FAIL) ASDF:LOAD-SYSTEM-DEFINITION-ERROR : Error while trying to load definition for system iolib from pathname /home/testgrid/cl-test-grid/work-dir/agent/quicklisp/dists/quicklisp/software/iolib-20150302-git/iolib.asd: You need ASDF >= 2.31.1 to load this system correctly.
(LOAD cl-mw FAIL) ASDF:LOAD-SYSTEM-DEFINITION-ERROR : Error while trying to load definition for system iolib from pathname /home/testgrid/cl-test-grid/work-dir/agent/quicklisp/dists/quicklisp/software/iolib-20150302-git/iolib.asd: You need ASDF >= 2.31.1 to load this system correctly.
(LOAD cl-mw.examples.with-task-policy FAIL) ASDF:LOAD-SYSTEM-DEFINITION-ERROR : Error while trying to load definition for system iolib from pathname /home/testgrid/cl-test-grid/work-dir/agent/quicklisp/dists/quicklisp/software/iolib-20150302-git/iolib.asd: You need ASDF >= 2.31.1 to load this system correctly.
(LOAD cl-mw.examples.ping FAIL) ASDF:LOAD-SYSTEM-DEFINITION-ERROR : Error while trying to load definition for system iolib from pathname /home/testgrid/cl-test-grid/work-dir/agent/quicklisp/dists/quicklisp/software/iolib-20150302-git/iolib.asd: You need ASDF >= 2.31.1 to load this system correctly.
(LOAD cl-mw.examples.monte-carlo-pi FAIL) ASDF:LOAD-SYSTEM-DEFINITION-ERROR : Error while trying to load definition for system iolib from pathname /home/testgrid/cl-test-grid/work-dir/agent/quicklisp/dists/quicklisp/software/iolib-20150302-git/iolib.asd: You need ASDF >= 2.31.1 to load this system correctly.
(LOAD cl-mw.examples.higher-order FAIL) ASDF:LOAD-SYSTEM-DEFINITION-ERROR : Error while trying to load definition for system iolib from pathname /home/testgrid/cl-test-grid/work-dir/agent/quicklisp/dists/quicklisp/software/iolib-20150302-git/iolib.asd: You need ASDF >= 2.31.1 to load this system correctly.
(LOAD cl-mw.examples.hello-world FAIL) ASDF:LOAD-SYSTEM-DEFINITION-ERROR : Error while trying to load definition for system iolib from pathname /home/testgrid/cl-test-grid/work-dir/agent/quicklisp/dists/quicklisp/software/iolib-20150302-git/iolib.asd: You need ASDF >= 2.31.1 to load this system correctly.
(LOAD cl-mw.examples.argument-processing FAIL) ASDF:LOAD-SYSTEM-DEFINITION-ERROR : Error while trying to load definition for system iolib from pathname /home/testgrid/cl-test-grid/work-dir/agent/quicklisp/dists/quicklisp/software/iolib-20150302-git/iolib.asd: You need ASDF >= 2.31.1 to load this system correctly.
(LOAD cl-mw FAIL) ASDF:LOAD-SYSTEM-DEFINITION-ERROR : Error while trying to load definition for system iolib from pathname /home/testgrid/cl-test-grid/work-dir/agent/quicklisp/dists/quicklisp/software/iolib-20150302-git/iolib.asd: You need ASDF >= 2.31.1 to load this system correctly.
ccl-1.9-r15756-f96-linux-x86
(LOAD cl-mw.examples.with-task-policy FAIL) needs newer ASDF, ASDF/FIND-SYSTEM:LOAD-SYSTEM-DEFINITION-ERROR : Error while trying to load definition for system hu.dwim.serializer from pathname /home/testgrid/cl-test-grid/work-dir/agent/quicklisp/dists/quicklisp/software/hu.dwim.serializer-20150608-darcs/hu\.dwim\.serializer.asd: Cannot IMPORT "NON-PROPAGATING-OPERATION" from package "ASDF"
(LOAD cl-mw.examples.ping FAIL) needs newer ASDF, ASDF/FIND-SYSTEM:LOAD-SYSTEM-DEFINITION-ERROR : Error while trying to load definition for system hu.dwim.serializer from pathname /home/testgrid/cl-test-grid/work-dir/agent/quicklisp/dists/quicklisp/software/hu.dwim.serializer-20150608-darcs/hu\.dwim\.serializer.asd: Cannot IMPORT "NON-PROPAGATING-OPERATION" from package "ASDF"
(LOAD cl-mw.examples.monte-carlo-pi FAIL) needs newer ASDF, ASDF/FIND-SYSTEM:LOAD-SYSTEM-DEFINITION-ERROR : Error while trying to load definition for system hu.dwim.serializer from pathname /home/testgrid/cl-test-grid/work-dir/agent/quicklisp/dists/quicklisp/software/hu.dwim.serializer-20150608-darcs/hu\.dwim\.serializer.asd: Cannot IMPORT "NON-PROPAGATING-OPERATION" from package "ASDF"
(LOAD cl-mw.examples.higher-order FAIL) needs newer ASDF, ASDF/FIND-SYSTEM:LOAD-SYSTEM-DEFINITION-ERROR : Error while trying to load definition for system hu.dwim.serializer from pathname /home/testgrid/cl-test-grid/work-dir/agent/quicklisp/dists/quicklisp/software/hu.dwim.serializer-20150608-darcs/hu\.dwim\.serializer.asd: Cannot IMPORT "NON-PROPAGATING-OPERATION" from package "ASDF"
(LOAD cl-mw.examples.hello-world FAIL) needs newer ASDF, ASDF/FIND-SYSTEM:LOAD-SYSTEM-DEFINITION-ERROR : Error while trying to load definition for system hu.dwim.serializer from pathname /home/testgrid/cl-test-grid/work-dir/agent/quicklisp/dists/quicklisp/software/hu.dwim.serializer-20150608-darcs/hu\.dwim\.serializer.asd: Cannot IMPORT "NON-PROPAGATING-OPERATION" from package "ASDF"
(LOAD cl-mw.examples.argument-processing FAIL) needs newer ASDF, ASDF/FIND-SYSTEM:LOAD-SYSTEM-DEFINITION-ERROR : Error while trying to load definition for system hu.dwim.serializer from pathname /home/testgrid/cl-test-grid/work-dir/agent/quicklisp/dists/quicklisp/software/hu.dwim.serializer-20150608-darcs/hu\.dwim\.serializer.asd: Cannot IMPORT "NON-PROPAGATING-OPERATION" from package "ASDF"
(LOAD cl-mw FAIL) needs newer ASDF, ASDF/FIND-SYSTEM:LOAD-SYSTEM-DEFINITION-ERROR : Error while trying to load definition for system hu.dwim.serializer from pathname /home/testgrid/cl-test-grid/work-dir/agent/quicklisp/dists/quicklisp/software/hu.dwim.serializer-20150608-darcs/hu\.dwim\.serializer.asd: Cannot IMPORT "NON-PROPAGATING-OPERATION" from package "ASDF"
(LOAD cl-mw.examples.with-task-policy FAIL) CCL::NO-SUCH-PACKAGE : There is no package named "SB-EXT" .
(LOAD cl-mw.examples.ping FAIL) CCL::NO-SUCH-PACKAGE : There is no package named "SB-EXT" .
(LOAD cl-mw.examples.monte-carlo-pi FAIL) CCL::NO-SUCH-PACKAGE : There is no package named "SB-EXT" .
(LOAD cl-mw.examples.higher-order FAIL) CCL::NO-SUCH-PACKAGE : There is no package named "SB-EXT" .
(LOAD cl-mw.examples.hello-world FAIL) CCL::NO-SUCH-PACKAGE : There is no package named "SB-EXT" .
(LOAD cl-mw.examples.argument-processing FAIL) CCL::NO-SUCH-PACKAGE : There is no package named "SB-EXT" .
(LOAD cl-mw FAIL) CCL::NO-SUCH-PACKAGE : There is no package named "SB-EXT" .
clisp-2.49-unix-x64
(LOAD cl-mw.examples.with-task-policy FAIL) ASDF:LOAD-SYSTEM-DEFINITION-ERROR : Error while trying to load definition for system iolib from pathname /home/hijarian/systems/cl-test-grid/work-dir/agent/quicklisp/dists/quicklisp/software/iolib-20150302-git/iolib.asd: You need ASDF >= 2.31.1 to load this system correctly.
(LOAD cl-mw.examples.ping FAIL) ASDF:LOAD-SYSTEM-DEFINITION-ERROR : Error while trying to load definition for system iolib from pathname /home/hijarian/systems/cl-test-grid/work-dir/agent/quicklisp/dists/quicklisp/software/iolib-20150302-git/iolib.asd: You need ASDF >= 2.31.1 to load this system correctly.
(LOAD cl-mw.examples.monte-carlo-pi FAIL) ASDF:LOAD-SYSTEM-DEFINITION-ERROR : Error while trying to load definition for system iolib from pathname /home/hijarian/systems/cl-test-grid/work-dir/agent/quicklisp/dists/quicklisp/software/iolib-20150302-git/iolib.asd: You need ASDF >= 2.31.1 to load this system correctly.
(LOAD cl-mw.examples.higher-order FAIL) ASDF:LOAD-SYSTEM-DEFINITION-ERROR : Error while trying to load definition for system iolib from pathname /home/hijarian/systems/cl-test-grid/work-dir/agent/quicklisp/dists/quicklisp/software/iolib-20150302-git/iolib.asd: You need ASDF >= 2.31.1 to load this system correctly.
(LOAD cl-mw.examples.hello-world FAIL) ASDF:LOAD-SYSTEM-DEFINITION-ERROR : Error while trying to load definition for system iolib from pathname /home/hijarian/systems/cl-test-grid/work-dir/agent/quicklisp/dists/quicklisp/software/iolib-20150302-git/iolib.asd: You need ASDF >= 2.31.1 to load this system correctly.
(LOAD cl-mw.examples.argument-processing FAIL) ASDF:LOAD-SYSTEM-DEFINITION-ERROR : Error while trying to load definition for system iolib from pathname /home/hijarian/systems/cl-test-grid/work-dir/agent/quicklisp/dists/quicklisp/software/iolib-20150302-git/iolib.asd: You need ASDF >= 2.31.1 to load this system correctly.
(LOAD cl-mw FAIL) ASDF:LOAD-SYSTEM-DEFINITION-ERROR : Error while trying to load definition for system iolib from pathname /home/hijarian/systems/cl-test-grid/work-dir/agent/quicklisp/dists/quicklisp/software/iolib-20150302-git/iolib.asd: You need ASDF >= 2.31.1 to load this system correctly.
(LOAD cl-mw.examples.with-task-policy FAIL) ASDF:LOAD-SYSTEM-DEFINITION-ERROR : Error while trying to load definition for system iolib from pathname /home/hijarian/systems/cl-test-grid/work-dir/agent/quicklisp/dists/quicklisp/software/iolib-20150302-git/iolib.asd: You need ASDF >= 2.31.1 to load this system correctly.
(LOAD cl-mw.examples.ping FAIL) ASDF:LOAD-SYSTEM-DEFINITION-ERROR : Error while trying to load definition for system iolib from pathname /home/hijarian/systems/cl-test-grid/work-dir/agent/quicklisp/dists/quicklisp/software/iolib-20150302-git/iolib.asd: You need ASDF >= 2.31.1 to load this system correctly.
(LOAD cl-mw.examples.monte-carlo-pi FAIL) ASDF:LOAD-SYSTEM-DEFINITION-ERROR : Error while trying to load definition for system iolib from pathname /home/hijarian/systems/cl-test-grid/work-dir/agent/quicklisp/dists/quicklisp/software/iolib-20150302-git/iolib.asd: You need ASDF >= 2.31.1 to load this system correctly.
(LOAD cl-mw.examples.higher-order FAIL) ASDF:LOAD-SYSTEM-DEFINITION-ERROR : Error while trying to load definition for system iolib from pathname /home/hijarian/systems/cl-test-grid/work-dir/agent/quicklisp/dists/quicklisp/software/iolib-20150302-git/iolib.asd: You need ASDF >= 2.31.1 to load this system correctly.
(LOAD cl-mw.examples.hello-world FAIL) ASDF:LOAD-SYSTEM-DEFINITION-ERROR : Error while trying to load definition for system iolib from pathname /home/hijarian/systems/cl-test-grid/work-dir/agent/quicklisp/dists/quicklisp/software/iolib-20150302-git/iolib.asd: You need ASDF >= 2.31.1 to load this system correctly.
(LOAD cl-mw.examples.argument-processing FAIL) ASDF:LOAD-SYSTEM-DEFINITION-ERROR : Error while trying to load definition for system iolib from pathname /home/hijarian/systems/cl-test-grid/work-dir/agent/quicklisp/dists/quicklisp/software/iolib-20150302-git/iolib.asd: You need ASDF >= 2.31.1 to load this system correctly.
(LOAD cl-mw FAIL) ASDF:LOAD-SYSTEM-DEFINITION-ERROR : Error while trying to load definition for system iolib from pathname /home/hijarian/systems/cl-test-grid/work-dir/agent/quicklisp/dists/quicklisp/software/iolib-20150302-git/iolib.asd: You need ASDF >= 2.31.1 to load this system correctly.
clisp-2.49-unix-x86
(LOAD cl-mw.examples.with-task-policy FAIL) ASDF:LOAD-SYSTEM-DEFINITION-ERROR : Error while trying to load definition for system iolib from pathname /home/testgrid/cl-test-grid/work-dir/agent/quicklisp/dists/quicklisp/software/iolib-20150302-git/iolib.asd: You need ASDF >= 2.31.1 to load this system correctly.
(LOAD cl-mw.examples.ping FAIL) ASDF:LOAD-SYSTEM-DEFINITION-ERROR : Error while trying to load definition for system iolib from pathname /home/testgrid/cl-test-grid/work-dir/agent/quicklisp/dists/quicklisp/software/iolib-20150302-git/iolib.asd: You need ASDF >= 2.31.1 to load this system correctly.
(LOAD cl-mw.examples.monte-carlo-pi FAIL) ASDF:LOAD-SYSTEM-DEFINITION-ERROR : Error while trying to load definition for system iolib from pathname /home/testgrid/cl-test-grid/work-dir/agent/quicklisp/dists/quicklisp/software/iolib-20150302-git/iolib.asd: You need ASDF >= 2.31.1 to load this system correctly.
(LOAD cl-mw.examples.higher-order FAIL) ASDF:LOAD-SYSTEM-DEFINITION-ERROR : Error while trying to load definition for system iolib from pathname /home/testgrid/cl-test-grid/work-dir/agent/quicklisp/dists/quicklisp/software/iolib-20150302-git/iolib.asd: You need ASDF >= 2.31.1 to load this system correctly.
(LOAD cl-mw.examples.hello-world FAIL) ASDF:LOAD-SYSTEM-DEFINITION-ERROR : Error while trying to load definition for system iolib from pathname /home/testgrid/cl-test-grid/work-dir/agent/quicklisp/dists/quicklisp/software/iolib-20150302-git/iolib.asd: You need ASDF >= 2.31.1 to load this system correctly.
(LOAD cl-mw.examples.argument-processing FAIL) ASDF:LOAD-SYSTEM-DEFINITION-ERROR : Error while trying to load definition for system iolib from pathname /home/testgrid/cl-test-grid/work-dir/agent/quicklisp/dists/quicklisp/software/iolib-20150302-git/iolib.asd: You need ASDF >= 2.31.1 to load this system correctly.
(LOAD cl-mw FAIL) ASDF:LOAD-SYSTEM-DEFINITION-ERROR : Error while trying to load definition for system iolib from pathname /home/testgrid/cl-test-grid/work-dir/agent/quicklisp/dists/quicklisp/software/iolib-20150302-git/iolib.asd: You need ASDF >= 2.31.1 to load this system correctly.
(LOAD cl-mw.examples.with-task-policy FAIL) ASDF:LOAD-SYSTEM-DEFINITION-ERROR : Error while trying to load definition for system iolib from pathname /home/testgrid/cl-test-grid/work-dir/agent/quicklisp/dists/quicklisp/software/iolib-20150302-git/iolib.asd: You need ASDF >= 2.31.1 to load this system correctly.
(LOAD cl-mw.examples.ping FAIL) ASDF:LOAD-SYSTEM-DEFINITION-ERROR : Error while trying to load definition for system iolib from pathname /home/testgrid/cl-test-grid/work-dir/agent/quicklisp/dists/quicklisp/software/iolib-20150302-git/iolib.asd: You need ASDF >= 2.31.1 to load this system correctly.
(LOAD cl-mw.examples.monte-carlo-pi FAIL) ASDF:LOAD-SYSTEM-DEFINITION-ERROR : Error while trying to load definition for system iolib from pathname /home/testgrid/cl-test-grid/work-dir/agent/quicklisp/dists/quicklisp/software/iolib-20150302-git/iolib.asd: You need ASDF >= 2.31.1 to load this system correctly.
(LOAD cl-mw.examples.higher-order FAIL) ASDF:LOAD-SYSTEM-DEFINITION-ERROR : Error while trying to load definition for system iolib from pathname /home/testgrid/cl-test-grid/work-dir/agent/quicklisp/dists/quicklisp/software/iolib-20150302-git/iolib.asd: You need ASDF >= 2.31.1 to load this system correctly.
(LOAD cl-mw.examples.hello-world FAIL) ASDF:LOAD-SYSTEM-DEFINITION-ERROR : Error while trying to load definition for system iolib from pathname /home/testgrid/cl-test-grid/work-dir/agent/quicklisp/dists/quicklisp/software/iolib-20150302-git/iolib.asd: You need ASDF >= 2.31.1 to load this system correctly.
(LOAD cl-mw.examples.argument-processing FAIL) ASDF:LOAD-SYSTEM-DEFINITION-ERROR : Error while trying to load definition for system iolib from pathname /home/testgrid/cl-test-grid/work-dir/agent/quicklisp/dists/quicklisp/software/iolib-20150302-git/iolib.asd: You need ASDF >= 2.31.1 to load this system correctly.
(LOAD cl-mw FAIL) ASDF:LOAD-SYSTEM-DEFINITION-ERROR : Error while trying to load definition for system iolib from pathname /home/testgrid/cl-test-grid/work-dir/agent/quicklisp/dists/quicklisp/software/iolib-20150302-git/iolib.asd: You need ASDF >= 2.31.1 to load this system correctly.
cmu-snapshot-2013-04__20d_unicode_-linux-x86
(LOAD cl-mw.examples.with-task-policy FAIL) needs newer ASDF, ASDF/FIND-SYSTEM:LOAD-SYSTEM-DEFINITION-ERROR : Error while trying to load definition for system hu.dwim.serializer from pathname /home/testgrid/cl-test-grid/work-dir/agent/quicklisp/dists/quicklisp/software/hu.dwim.serializer-20150608-darcs/hu.dwim.serializer.asd: ASDF/INTERFACE does not contain a symbol NON-PROPAGATING-OPERATION
(LOAD cl-mw.examples.ping FAIL) needs newer ASDF, ASDF/FIND-SYSTEM:LOAD-SYSTEM-DEFINITION-ERROR : Error while trying to load definition for system hu.dwim.serializer from pathname /home/testgrid/cl-test-grid/work-dir/agent/quicklisp/dists/quicklisp/software/hu.dwim.serializer-20150608-darcs/hu.dwim.serializer.asd: ASDF/INTERFACE does not contain a symbol NON-PROPAGATING-OPERATION
(LOAD cl-mw.examples.monte-carlo-pi FAIL) needs newer ASDF, ASDF/FIND-SYSTEM:LOAD-SYSTEM-DEFINITION-ERROR : Error while trying to load definition for system hu.dwim.serializer from pathname /home/testgrid/cl-test-grid/work-dir/agent/quicklisp/dists/quicklisp/software/hu.dwim.serializer-20150608-darcs/hu.dwim.serializer.asd: ASDF/INTERFACE does not contain a symbol NON-PROPAGATING-OPERATION
(LOAD cl-mw.examples.higher-order FAIL) needs newer ASDF, ASDF/FIND-SYSTEM:LOAD-SYSTEM-DEFINITION-ERROR : Error while trying to load definition for system hu.dwim.serializer from pathname /home/testgrid/cl-test-grid/work-dir/agent/quicklisp/dists/quicklisp/software/hu.dwim.serializer-20150608-darcs/hu.dwim.serializer.asd: ASDF/INTERFACE does not contain a symbol NON-PROPAGATING-OPERATION
(LOAD cl-mw.examples.hello-world FAIL) needs newer ASDF, ASDF/FIND-SYSTEM:LOAD-SYSTEM-DEFINITION-ERROR : Error while trying to load definition for system hu.dwim.serializer from pathname /home/testgrid/cl-test-grid/work-dir/agent/quicklisp/dists/quicklisp/software/hu.dwim.serializer-20150608-darcs/hu.dwim.serializer.asd: ASDF/INTERFACE does not contain a symbol NON-PROPAGATING-OPERATION
(LOAD cl-mw.examples.argument-processing FAIL) needs newer ASDF, ASDF/FIND-SYSTEM:LOAD-SYSTEM-DEFINITION-ERROR : Error while trying to load definition for system hu.dwim.serializer from pathname /home/testgrid/cl-test-grid/work-dir/agent/quicklisp/dists/quicklisp/software/hu.dwim.serializer-20150608-darcs/hu.dwim.serializer.asd: ASDF/INTERFACE does not contain a symbol NON-PROPAGATING-OPERATION
(LOAD cl-mw FAIL) needs newer ASDF, ASDF/FIND-SYSTEM:LOAD-SYSTEM-DEFINITION-ERROR : Error while trying to load definition for system hu.dwim.serializer from pathname /home/testgrid/cl-test-grid/work-dir/agent/quicklisp/dists/quicklisp/software/hu.dwim.serializer-20150608-darcs/hu.dwim.serializer.asd: ASDF/INTERFACE does not contain a symbol NON-PROPAGATING-OPERATION
(LOAD cl-mw.examples.with-task-policy FAIL) COMMON-LISP:SIMPLE-ERROR : Error in function USE-PACKAGE: Use'ing package CLOSER-MOP results in name conflicts for these symbols: (TYPEP SUBTYPEP)
(LOAD cl-mw.examples.ping FAIL) COMMON-LISP:SIMPLE-ERROR : Error in function USE-PACKAGE: Use'ing package CLOSER-MOP results in name conflicts for these symbols: (TYPEP SUBTYPEP)
(LOAD cl-mw.examples.monte-carlo-pi FAIL) COMMON-LISP:SIMPLE-ERROR : Error in function USE-PACKAGE: Use'ing package CLOSER-MOP results in name conflicts for these symbols: (TYPEP SUBTYPEP)
(LOAD cl-mw.examples.higher-order FAIL) COMMON-LISP:SIMPLE-ERROR : Error in function USE-PACKAGE: Use'ing package CLOSER-MOP results in name conflicts for these symbols: (TYPEP SUBTYPEP)
(LOAD cl-mw.examples.hello-world FAIL) COMMON-LISP:SIMPLE-ERROR : Error in function USE-PACKAGE: Use'ing package CLOSER-MOP results in name conflicts for these symbols: (TYPEP SUBTYPEP)
(LOAD cl-mw.examples.argument-processing FAIL) COMMON-LISP:SIMPLE-ERROR : Error in function USE-PACKAGE: Use'ing package CLOSER-MOP results in name conflicts for these symbols: (TYPEP SUBTYPEP)
(LOAD cl-mw FAIL) COMMON-LISP:SIMPLE-ERROR : Error in function USE-PACKAGE: Use'ing package CLOSER-MOP results in name conflicts for these symbols: (TYPEP SUBTYPEP)
cmu-snapshot-2014-01__20e_unicode_-linux-x86
(LOAD cl-mw.examples.with-task-policy FAIL) needs newer ASDF, ASDF/FIND-SYSTEM:LOAD-SYSTEM-DEFINITION-ERROR : Error while trying to load definition for system hu.dwim.serializer from pathname /home/testgrid/cl-test-grid/work-dir/agent/quicklisp/dists/quicklisp/software/hu.dwim.serializer-20150608-darcs/hu.dwim.serializer.asd: ASDF/INTERFACE does not contain a symbol NON-PROPAGATING-OPERATION
(LOAD cl-mw.examples.ping FAIL) needs newer ASDF, ASDF/FIND-SYSTEM:LOAD-SYSTEM-DEFINITION-ERROR : Error while trying to load definition for system hu.dwim.serializer from pathname /home/testgrid/cl-test-grid/work-dir/agent/quicklisp/dists/quicklisp/software/hu.dwim.serializer-20150608-darcs/hu.dwim.serializer.asd: ASDF/INTERFACE does not contain a symbol NON-PROPAGATING-OPERATION
(LOAD cl-mw.examples.monte-carlo-pi FAIL) needs newer ASDF, ASDF/FIND-SYSTEM:LOAD-SYSTEM-DEFINITION-ERROR : Error while trying to load definition for system hu.dwim.serializer from pathname /home/testgrid/cl-test-grid/work-dir/agent/quicklisp/dists/quicklisp/software/hu.dwim.serializer-20150608-darcs/hu.dwim.serializer.asd: ASDF/INTERFACE does not contain a symbol NON-PROPAGATING-OPERATION
(LOAD cl-mw.examples.higher-order FAIL) needs newer ASDF, ASDF/FIND-SYSTEM:LOAD-SYSTEM-DEFINITION-ERROR : Error while trying to load definition for system hu.dwim.serializer from pathname /home/testgrid/cl-test-grid/work-dir/agent/quicklisp/dists/quicklisp/software/hu.dwim.serializer-20150608-darcs/hu.dwim.serializer.asd: ASDF/INTERFACE does not contain a symbol NON-PROPAGATING-OPERATION
(LOAD cl-mw.examples.hello-world FAIL) needs newer ASDF, ASDF/FIND-SYSTEM:LOAD-SYSTEM-DEFINITION-ERROR : Error while trying to load definition for system hu.dwim.serializer from pathname /home/testgrid/cl-test-grid/work-dir/agent/quicklisp/dists/quicklisp/software/hu.dwim.serializer-20150608-darcs/hu.dwim.serializer.asd: ASDF/INTERFACE does not contain a symbol NON-PROPAGATING-OPERATION
(LOAD cl-mw.examples.argument-processing FAIL) needs newer ASDF, ASDF/FIND-SYSTEM:LOAD-SYSTEM-DEFINITION-ERROR : Error while trying to load definition for system hu.dwim.serializer from pathname /home/testgrid/cl-test-grid/work-dir/agent/quicklisp/dists/quicklisp/software/hu.dwim.serializer-20150608-darcs/hu.dwim.serializer.asd: ASDF/INTERFACE does not contain a symbol NON-PROPAGATING-OPERATION
(LOAD cl-mw FAIL) needs newer ASDF, ASDF/FIND-SYSTEM:LOAD-SYSTEM-DEFINITION-ERROR : Error while trying to load definition for system hu.dwim.serializer from pathname /home/testgrid/cl-test-grid/work-dir/agent/quicklisp/dists/quicklisp/software/hu.dwim.serializer-20150608-darcs/hu.dwim.serializer.asd: ASDF/INTERFACE does not contain a symbol NON-PROPAGATING-OPERATION
(LOAD cl-mw.examples.with-task-policy FAIL) COMMON-LISP:SIMPLE-ERROR : Error in function USE-PACKAGE: Use'ing package CLOSER-MOP results in name conflicts for these symbols: (TYPEP SUBTYPEP)
(LOAD cl-mw.examples.ping FAIL) COMMON-LISP:SIMPLE-ERROR : Error in function USE-PACKAGE: Use'ing package CLOSER-MOP results in name conflicts for these symbols: (TYPEP SUBTYPEP)
(LOAD cl-mw.examples.monte-carlo-pi FAIL) COMMON-LISP:SIMPLE-ERROR : Error in function USE-PACKAGE: Use'ing package CLOSER-MOP results in name conflicts for these symbols: (TYPEP SUBTYPEP)
(LOAD cl-mw.examples.higher-order FAIL) COMMON-LISP:SIMPLE-ERROR : Error in function USE-PACKAGE: Use'ing package CLOSER-MOP results in name conflicts for these symbols: (TYPEP SUBTYPEP)
(LOAD cl-mw.examples.hello-world FAIL) COMMON-LISP:SIMPLE-ERROR : Error in function USE-PACKAGE: Use'ing package CLOSER-MOP results in name conflicts for these symbols: (TYPEP SUBTYPEP)
(LOAD cl-mw.examples.argument-processing FAIL) COMMON-LISP:SIMPLE-ERROR : Error in function USE-PACKAGE: Use'ing package CLOSER-MOP results in name conflicts for these symbols: (TYPEP SUBTYPEP)
(LOAD cl-mw FAIL) COMMON-LISP:SIMPLE-ERROR : Error in function USE-PACKAGE: Use'ing package CLOSER-MOP results in name conflicts for these symbols: (TYPEP SUBTYPEP)
cmu-snapshot-2014-05-dirty__20e_unicode_-linux-x86
(LOAD cl-mw.examples.with-task-policy FAIL) needs newer ASDF, ASDF/FIND-SYSTEM:LOAD-SYSTEM-DEFINITION-ERROR : Error while trying to load definition for system hu.dwim.serializer from pathname /home/testgrid/cl-test-grid/work-dir/agent/quicklisp/dists/quicklisp/software/hu.dwim.serializer-20150608-darcs/hu.dwim.serializer.asd: ASDF/INTERFACE does not contain a symbol NON-PROPAGATING-OPERATION
(LOAD cl-mw.examples.ping FAIL) needs newer ASDF, ASDF/FIND-SYSTEM:LOAD-SYSTEM-DEFINITION-ERROR : Error while trying to load definition for system hu.dwim.serializer from pathname /home/testgrid/cl-test-grid/work-dir/agent/quicklisp/dists/quicklisp/software/hu.dwim.serializer-20150608-darcs/hu.dwim.serializer.asd: ASDF/INTERFACE does not contain a symbol NON-PROPAGATING-OPERATION
(LOAD cl-mw.examples.monte-carlo-pi FAIL) needs newer ASDF, ASDF/FIND-SYSTEM:LOAD-SYSTEM-DEFINITION-ERROR : Error while trying to load definition for system hu.dwim.serializer from pathname /home/testgrid/cl-test-grid/work-dir/agent/quicklisp/dists/quicklisp/software/hu.dwim.serializer-20150608-darcs/hu.dwim.serializer.asd: ASDF/INTERFACE does not contain a symbol NON-PROPAGATING-OPERATION
(LOAD cl-mw.examples.higher-order FAIL) needs newer ASDF, ASDF/FIND-SYSTEM:LOAD-SYSTEM-DEFINITION-ERROR : Error while trying to load definition for system hu.dwim.serializer from pathname /home/testgrid/cl-test-grid/work-dir/agent/quicklisp/dists/quicklisp/software/hu.dwim.serializer-20150608-darcs/hu.dwim.serializer.asd: ASDF/INTERFACE does not contain a symbol NON-PROPAGATING-OPERATION
(LOAD cl-mw.examples.hello-world FAIL) needs newer ASDF, ASDF/FIND-SYSTEM:LOAD-SYSTEM-DEFINITION-ERROR : Error while trying to load definition for system hu.dwim.serializer from pathname /home/testgrid/cl-test-grid/work-dir/agent/quicklisp/dists/quicklisp/software/hu.dwim.serializer-20150608-darcs/hu.dwim.serializer.asd: ASDF/INTERFACE does not contain a symbol NON-PROPAGATING-OPERATION
(LOAD cl-mw.examples.argument-processing FAIL) needs newer ASDF, ASDF/FIND-SYSTEM:LOAD-SYSTEM-DEFINITION-ERROR : Error while trying to load definition for system hu.dwim.serializer from pathname /home/testgrid/cl-test-grid/work-dir/agent/quicklisp/dists/quicklisp/software/hu.dwim.serializer-20150608-darcs/hu.dwim.serializer.asd: ASDF/INTERFACE does not contain a symbol NON-PROPAGATING-OPERATION
(LOAD cl-mw FAIL) needs newer ASDF, ASDF/FIND-SYSTEM:LOAD-SYSTEM-DEFINITION-ERROR : Error while trying to load definition for system hu.dwim.serializer from pathname /home/testgrid/cl-test-grid/work-dir/agent/quicklisp/dists/quicklisp/software/hu.dwim.serializer-20150608-darcs/hu.dwim.serializer.asd: ASDF/INTERFACE does not contain a symbol NON-PROPAGATING-OPERATION
(LOAD cl-mw.examples.with-task-policy FAIL) COMMON-LISP:SIMPLE-ERROR : Error in function USE-PACKAGE: Use'ing package CLOSER-MOP results in name conflicts for these symbols: (TYPEP SUBTYPEP)
(LOAD cl-mw.examples.ping FAIL) COMMON-LISP:SIMPLE-ERROR : Error in function USE-PACKAGE: Use'ing package CLOSER-MOP results in name conflicts for these symbols: (TYPEP SUBTYPEP)
(LOAD cl-mw.examples.monte-carlo-pi FAIL) COMMON-LISP:SIMPLE-ERROR : Error in function USE-PACKAGE: Use'ing package CLOSER-MOP results in name conflicts for these symbols: (TYPEP SUBTYPEP)
(LOAD cl-mw.examples.higher-order FAIL) COMMON-LISP:SIMPLE-ERROR : Error in function USE-PACKAGE: Use'ing package CLOSER-MOP results in name conflicts for these symbols: (TYPEP SUBTYPEP)
(LOAD cl-mw.examples.hello-world FAIL) COMMON-LISP:SIMPLE-ERROR : Error in function USE-PACKAGE: Use'ing package CLOSER-MOP results in name conflicts for these symbols: (TYPEP SUBTYPEP)
(LOAD cl-mw.examples.argument-processing FAIL) COMMON-LISP:SIMPLE-ERROR : Error in function USE-PACKAGE: Use'ing package CLOSER-MOP results in name conflicts for these symbols: (TYPEP SUBTYPEP)
(LOAD cl-mw FAIL) COMMON-LISP:SIMPLE-ERROR : Error in function USE-PACKAGE: Use'ing package CLOSER-MOP results in name conflicts for these symbols: (TYPEP SUBTYPEP)
cmu-snapshot-2014-12___20f_unicode_-linux-x86
(LOAD cl-mw.examples.with-task-policy FAIL) COMMON-LISP:SIMPLE-ERROR : Error in function USE-PACKAGE: Use'ing package CLOSER-MOP results in name conflicts for these symbols: (TYPEP SUBTYPEP)
(LOAD cl-mw.examples.ping FAIL) COMMON-LISP:SIMPLE-ERROR : Error in function USE-PACKAGE: Use'ing package CLOSER-MOP results in name conflicts for these symbols: (TYPEP SUBTYPEP)
(LOAD cl-mw.examples.monte-carlo-pi FAIL) COMMON-LISP:SIMPLE-ERROR : Error in function USE-PACKAGE: Use'ing package CLOSER-MOP results in name conflicts for these symbols: (TYPEP SUBTYPEP)
(LOAD cl-mw.examples.higher-order FAIL) COMMON-LISP:SIMPLE-ERROR : Error in function USE-PACKAGE: Use'ing package CLOSER-MOP results in name conflicts for these symbols: (TYPEP SUBTYPEP)
(LOAD cl-mw.examples.hello-world FAIL) COMMON-LISP:SIMPLE-ERROR : Error in function USE-PACKAGE: Use'ing package CLOSER-MOP results in name conflicts for these symbols: (TYPEP SUBTYPEP)
(LOAD cl-mw.examples.argument-processing FAIL) COMMON-LISP:SIMPLE-ERROR : Error in function USE-PACKAGE: Use'ing package CLOSER-MOP results in name conflicts for these symbols: (TYPEP SUBTYPEP)
(LOAD cl-mw FAIL) COMMON-LISP:SIMPLE-ERROR : Error in function USE-PACKAGE: Use'ing package CLOSER-MOP results in name conflicts for these symbols: (TYPEP SUBTYPEP)
(LOAD cl-mw.examples.with-task-policy FAIL) COMMON-LISP:SIMPLE-ERROR : Error in function USE-PACKAGE: Use'ing package CLOSER-MOP results in name conflicts for these symbols: (TYPEP SUBTYPEP)
(LOAD cl-mw.examples.ping FAIL) COMMON-LISP:SIMPLE-ERROR : Error in function USE-PACKAGE: Use'ing package CLOSER-MOP results in name conflicts for these symbols: (TYPEP SUBTYPEP)
(LOAD cl-mw.examples.monte-carlo-pi FAIL) COMMON-LISP:SIMPLE-ERROR : Error in function USE-PACKAGE: Use'ing package CLOSER-MOP results in name conflicts for these symbols: (TYPEP SUBTYPEP)
(LOAD cl-mw.examples.higher-order FAIL) COMMON-LISP:SIMPLE-ERROR : Error in function USE-PACKAGE: Use'ing package CLOSER-MOP results in name conflicts for these symbols: (TYPEP SUBTYPEP)
(LOAD cl-mw.examples.hello-world FAIL) COMMON-LISP:SIMPLE-ERROR : Error in function USE-PACKAGE: Use'ing package CLOSER-MOP results in name conflicts for these symbols: (TYPEP SUBTYPEP)
(LOAD cl-mw.examples.argument-processing FAIL) COMMON-LISP:SIMPLE-ERROR : Error in function USE-PACKAGE: Use'ing package CLOSER-MOP results in name conflicts for these symbols: (TYPEP SUBTYPEP)
(LOAD cl-mw FAIL) COMMON-LISP:SIMPLE-ERROR : Error in function USE-PACKAGE: Use'ing package CLOSER-MOP results in name conflicts for these symbols: (TYPEP SUBTYPEP)
ecl-13.5.1-unknown-linux-i686-bytecode
(LOAD cl-mw.examples.with-task-policy FAIL) needs newer ASDF, ASDF/FIND-SYSTEM:LOAD-SYSTEM-DEFINITION-ERROR : Error while trying to load definition for system hu.dwim.serializer from pathname /home/testgrid/cl-test-grid/work-dir/agent/quicklisp/dists/quicklisp/software/hu.dwim.serializer-20150608-darcs/hu.dwim.serializer.asd: Cannot find symbol "NON-PROPAGATING-OPERATION" in package #<"ASDF/INTERFACE" package>
(LOAD cl-mw.examples.ping FAIL) needs newer ASDF, ASDF/FIND-SYSTEM:LOAD-SYSTEM-DEFINITION-ERROR : Error while trying to load definition for system hu.dwim.serializer from pathname /home/testgrid/cl-test-grid/work-dir/agent/quicklisp/dists/quicklisp/software/hu.dwim.serializer-20150608-darcs/hu.dwim.serializer.asd: Cannot find symbol "NON-PROPAGATING-OPERATION" in package #<"ASDF/INTERFACE" package>
(LOAD cl-mw.examples.monte-carlo-pi FAIL) needs newer ASDF, ASDF/FIND-SYSTEM:LOAD-SYSTEM-DEFINITION-ERROR : Error while trying to load definition for system hu.dwim.serializer from pathname /home/testgrid/cl-test-grid/work-dir/agent/quicklisp/dists/quicklisp/software/hu.dwim.serializer-20150608-darcs/hu.dwim.serializer.asd: Cannot find symbol "NON-PROPAGATING-OPERATION" in package #<"ASDF/INTERFACE" package>
(LOAD cl-mw.examples.higher-order FAIL) needs newer ASDF, ASDF/FIND-SYSTEM:LOAD-SYSTEM-DEFINITION-ERROR : Error while trying to load definition for system hu.dwim.serializer from pathname /home/testgrid/cl-test-grid/work-dir/agent/quicklisp/dists/quicklisp/software/hu.dwim.serializer-20150608-darcs/hu.dwim.serializer.asd: Cannot find symbol "NON-PROPAGATING-OPERATION" in package #<"ASDF/INTERFACE" package>
(LOAD cl-mw.examples.hello-world FAIL) needs newer ASDF, ASDF/FIND-SYSTEM:LOAD-SYSTEM-DEFINITION-ERROR : Error while trying to load definition for system hu.dwim.serializer from pathname /home/testgrid/cl-test-grid/work-dir/agent/quicklisp/dists/quicklisp/software/hu.dwim.serializer-20150608-darcs/hu.dwim.serializer.asd: Cannot find symbol "NON-PROPAGATING-OPERATION" in package #<"ASDF/INTERFACE" package>
(LOAD cl-mw.examples.argument-processing FAIL) needs newer ASDF, ASDF/FIND-SYSTEM:LOAD-SYSTEM-DEFINITION-ERROR : Error while trying to load definition for system hu.dwim.serializer from pathname /home/testgrid/cl-test-grid/work-dir/agent/quicklisp/dists/quicklisp/software/hu.dwim.serializer-20150608-darcs/hu.dwim.serializer.asd: Cannot find symbol "NON-PROPAGATING-OPERATION" in package #<"ASDF/INTERFACE" package>
(LOAD cl-mw FAIL) needs newer ASDF, ASDF/FIND-SYSTEM:LOAD-SYSTEM-DEFINITION-ERROR : Error while trying to load definition for system hu.dwim.serializer from pathname /home/testgrid/cl-test-grid/work-dir/agent/quicklisp/dists/quicklisp/software/hu.dwim.serializer-20150608-darcs/hu.dwim.serializer.asd: Cannot find symbol "NON-PROPAGATING-OPERATION" in package #<"ASDF/INTERFACE" package>
(LOAD cl-mw.examples.with-task-policy FAIL) ASDF/FIND-SYSTEM:LOAD-SYSTEM-DEFINITION-ERROR : Error while trying to load definition for system iolib from pathname /home/testgrid/cl-test-grid/work-dir/agent/quicklisp/dists/quicklisp/software/iolib-20150302-git/iolib.asd: The variable C::*CC-FLAGS* is unbound.
(LOAD cl-mw.examples.ping FAIL) ASDF/FIND-SYSTEM:LOAD-SYSTEM-DEFINITION-ERROR : Error while trying to load definition for system iolib from pathname /home/testgrid/cl-test-grid/work-dir/agent/quicklisp/dists/quicklisp/software/iolib-20150302-git/iolib.asd: The variable C::*CC-FLAGS* is unbound.
(LOAD cl-mw.examples.monte-carlo-pi FAIL) ASDF/FIND-SYSTEM:LOAD-SYSTEM-DEFINITION-ERROR : Error while trying to load definition for system iolib from pathname /home/testgrid/cl-test-grid/work-dir/agent/quicklisp/dists/quicklisp/software/iolib-20150302-git/iolib.asd: The variable C::*CC-FLAGS* is unbound.
(LOAD cl-mw.examples.higher-order FAIL) ASDF/FIND-SYSTEM:LOAD-SYSTEM-DEFINITION-ERROR : Error while trying to load definition for system iolib from pathname /home/testgrid/cl-test-grid/work-dir/agent/quicklisp/dists/quicklisp/software/iolib-20150302-git/iolib.asd: The variable C::*CC-FLAGS* is unbound.
(LOAD cl-mw.examples.hello-world FAIL) ASDF/FIND-SYSTEM:LOAD-SYSTEM-DEFINITION-ERROR : Error while trying to load definition for system iolib from pathname /home/testgrid/cl-test-grid/work-dir/agent/quicklisp/dists/quicklisp/software/iolib-20150302-git/iolib.asd: The variable C::*CC-FLAGS* is unbound.
(LOAD cl-mw.examples.argument-processing FAIL) ASDF/FIND-SYSTEM:LOAD-SYSTEM-DEFINITION-ERROR : Error while trying to load definition for system iolib from pathname /home/testgrid/cl-test-grid/work-dir/agent/quicklisp/dists/quicklisp/software/iolib-20150302-git/iolib.asd: The variable C::*CC-FLAGS* is unbound.
(LOAD cl-mw FAIL) ASDF/FIND-SYSTEM:LOAD-SYSTEM-DEFINITION-ERROR : Error while trying to load definition for system iolib from pathname /home/testgrid/cl-test-grid/work-dir/agent/quicklisp/dists/quicklisp/software/iolib-20150302-git/iolib.asd: The variable C::*CC-FLAGS* is unbound.
ecl-13.5.1-unknown-linux-i686-lisp-to-c
(LOAD cl-mw.examples.with-task-policy FAIL) ASDF/FIND-SYSTEM:LOAD-SYSTEM-DEFINITION-ERROR : Error while trying to load definition for system hu.dwim.serializer from pathname /home/testgrid/cl-test-grid/work-dir/agent/quicklisp/dists/quicklisp/software/hu.dwim.serializer-20150608-darcs/hu.dwim.serializer.asd: COMPILE-FILE-ERROR while compiling #<cl-source-file "hu.dwim.asdf" "source" "package">
(LOAD cl-mw.examples.ping FAIL) ASDF/FIND-SYSTEM:LOAD-SYSTEM-DEFINITION-ERROR : Error while trying to load definition for system hu.dwim.serializer from pathname /home/testgrid/cl-test-grid/work-dir/agent/quicklisp/dists/quicklisp/software/hu.dwim.serializer-20150608-darcs/hu.dwim.serializer.asd: COMPILE-FILE-ERROR while compiling #<cl-source-file "hu.dwim.asdf" "source" "package">
(LOAD cl-mw.examples.monte-carlo-pi FAIL) ASDF/FIND-SYSTEM:LOAD-SYSTEM-DEFINITION-ERROR : Error while trying to load definition for system hu.dwim.serializer from pathname /home/testgrid/cl-test-grid/work-dir/agent/quicklisp/dists/quicklisp/software/hu.dwim.serializer-20150608-darcs/hu.dwim.serializer.asd: COMPILE-FILE-ERROR while compiling #<cl-source-file "hu.dwim.asdf" "source" "package">
(LOAD cl-mw.examples.higher-order FAIL) ASDF/FIND-SYSTEM:LOAD-SYSTEM-DEFINITION-ERROR : Error while trying to load definition for system hu.dwim.serializer from pathname /home/testgrid/cl-test-grid/work-dir/agent/quicklisp/dists/quicklisp/software/hu.dwim.serializer-20150608-darcs/hu.dwim.serializer.asd: COMPILE-FILE-ERROR while compiling #<cl-source-file "hu.dwim.asdf" "source" "package">
(LOAD cl-mw.examples.hello-world FAIL) ASDF/FIND-SYSTEM:LOAD-SYSTEM-DEFINITION-ERROR : Error while trying to load definition for system hu.dwim.serializer from pathname /home/testgrid/cl-test-grid/work-dir/agent/quicklisp/dists/quicklisp/software/hu.dwim.serializer-20150608-darcs/hu.dwim.serializer.asd: COMPILE-FILE-ERROR while compiling #<cl-source-file "hu.dwim.asdf" "source" "package">
(LOAD cl-mw.examples.argument-processing FAIL) ASDF/FIND-SYSTEM:LOAD-SYSTEM-DEFINITION-ERROR : Error while trying to load definition for system hu.dwim.serializer from pathname /home/testgrid/cl-test-grid/work-dir/agent/quicklisp/dists/quicklisp/software/hu.dwim.serializer-20150608-darcs/hu.dwim.serializer.asd: COMPILE-FILE-ERROR while compiling #<cl-source-file "hu.dwim.asdf" "source" "package">
(LOAD cl-mw FAIL) ASDF/FIND-SYSTEM:LOAD-SYSTEM-DEFINITION-ERROR : Error while trying to load definition for system hu.dwim.serializer from pathname /home/testgrid/cl-test-grid/work-dir/agent/quicklisp/dists/quicklisp/software/hu.dwim.serializer-20150608-darcs/hu.dwim.serializer.asd: COMPILE-FILE-ERROR while compiling #<cl-source-file "hu.dwim.asdf" "source" "package">
(LOAD cl-mw.examples.with-task-policy FAIL) COMMON-LISP:UNBOUND-VARIABLE : The variable +WRITERS+ is unbound.
(LOAD cl-mw.examples.ping FAIL) COMMON-LISP:UNBOUND-VARIABLE : The variable +WRITERS+ is unbound.
(LOAD cl-mw.examples.monte-carlo-pi FAIL) COMMON-LISP:UNBOUND-VARIABLE : The variable +WRITERS+ is unbound.
(LOAD cl-mw.examples.higher-order FAIL) COMMON-LISP:UNBOUND-VARIABLE : The variable +WRITERS+ is unbound.
(LOAD cl-mw.examples.hello-world FAIL) COMMON-LISP:UNBOUND-VARIABLE : The variable +WRITERS+ is unbound.
(LOAD cl-mw.examples.argument-processing FAIL) COMMON-LISP:UNBOUND-VARIABLE : The variable +WRITERS+ is unbound.
(LOAD cl-mw FAIL) COMMON-LISP:UNBOUND-VARIABLE : The variable +WRITERS+ is unbound.
ecl-15.2.21-ee989b97-linux-i686-bytecode
(LOAD cl-mw.examples.with-task-policy FAIL) ASDF/FIND-SYSTEM:LOAD-SYSTEM-DEFINITION-ERROR : Error while trying to load definition for system iolib from pathname /home/testgrid/cl-test-grid/work-dir/agent/quicklisp/dists/quicklisp/software/iolib-20150302-git/iolib.asd: The variable C::*CC-FLAGS* is unbound.
(LOAD cl-mw.examples.ping FAIL) ASDF/FIND-SYSTEM:LOAD-SYSTEM-DEFINITION-ERROR : Error while trying to load definition for system iolib from pathname /home/testgrid/cl-test-grid/work-dir/agent/quicklisp/dists/quicklisp/software/iolib-20150302-git/iolib.asd: The variable C::*CC-FLAGS* is unbound.
(LOAD cl-mw.examples.monte-carlo-pi FAIL) ASDF/FIND-SYSTEM:LOAD-SYSTEM-DEFINITION-ERROR : Error while trying to load definition for system iolib from pathname /home/testgrid/cl-test-grid/work-dir/agent/quicklisp/dists/quicklisp/software/iolib-20150302-git/iolib.asd: The variable C::*CC-FLAGS* is unbound.
(LOAD cl-mw.examples.higher-order FAIL) ASDF/FIND-SYSTEM:LOAD-SYSTEM-DEFINITION-ERROR : Error while trying to load definition for system iolib from pathname /home/testgrid/cl-test-grid/work-dir/agent/quicklisp/dists/quicklisp/software/iolib-20150302-git/iolib.asd: The variable C::*CC-FLAGS* is unbound.
(LOAD cl-mw.examples.hello-world FAIL) ASDF/FIND-SYSTEM:LOAD-SYSTEM-DEFINITION-ERROR : Error while trying to load definition for system iolib from pathname /home/testgrid/cl-test-grid/work-dir/agent/quicklisp/dists/quicklisp/software/iolib-20150302-git/iolib.asd: The variable C::*CC-FLAGS* is unbound.
(LOAD cl-mw.examples.argument-processing FAIL) ASDF/FIND-SYSTEM:LOAD-SYSTEM-DEFINITION-ERROR : Error while trying to load definition for system iolib from pathname /home/testgrid/cl-test-grid/work-dir/agent/quicklisp/dists/quicklisp/software/iolib-20150302-git/iolib.asd: The variable C::*CC-FLAGS* is unbound.
(LOAD cl-mw FAIL) ASDF/FIND-SYSTEM:LOAD-SYSTEM-DEFINITION-ERROR : Error while trying to load definition for system iolib from pathname /home/testgrid/cl-test-grid/work-dir/agent/quicklisp/dists/quicklisp/software/iolib-20150302-git/iolib.asd: The variable C::*CC-FLAGS* is unbound.
(LOAD cl-mw.examples.with-task-policy FAIL) ASDF/FIND-SYSTEM:LOAD-SYSTEM-DEFINITION-ERROR : Error while trying to load definition for system iolib from pathname /home/testgrid/cl-test-grid/work-dir/agent/quicklisp/dists/quicklisp/software/iolib-20150302-git/iolib.asd: The variable C::*CC-FLAGS* is unbound.
(LOAD cl-mw.examples.ping FAIL) ASDF/FIND-SYSTEM:LOAD-SYSTEM-DEFINITION-ERROR : Error while trying to load definition for system iolib from pathname /home/testgrid/cl-test-grid/work-dir/agent/quicklisp/dists/quicklisp/software/iolib-20150302-git/iolib.asd: The variable C::*CC-FLAGS* is unbound.
(LOAD cl-mw.examples.monte-carlo-pi FAIL) ASDF/FIND-SYSTEM:LOAD-SYSTEM-DEFINITION-ERROR : Error while trying to load definition for system iolib from pathname /home/testgrid/cl-test-grid/work-dir/agent/quicklisp/dists/quicklisp/software/iolib-20150302-git/iolib.asd: The variable C::*CC-FLAGS* is unbound.
(LOAD cl-mw.examples.higher-order FAIL) ASDF/FIND-SYSTEM:LOAD-SYSTEM-DEFINITION-ERROR : Error while trying to load definition for system iolib from pathname /home/testgrid/cl-test-grid/work-dir/agent/quicklisp/dists/quicklisp/software/iolib-20150302-git/iolib.asd: The variable C::*CC-FLAGS* is unbound.
(LOAD cl-mw.examples.hello-world FAIL) ASDF/FIND-SYSTEM:LOAD-SYSTEM-DEFINITION-ERROR : Error while trying to load definition for system iolib from pathname /home/testgrid/cl-test-grid/work-dir/agent/quicklisp/dists/quicklisp/software/iolib-20150302-git/iolib.asd: The variable C::*CC-FLAGS* is unbound.
(LOAD cl-mw.examples.argument-processing FAIL) ASDF/FIND-SYSTEM:LOAD-SYSTEM-DEFINITION-ERROR : Error while trying to load definition for system iolib from pathname /home/testgrid/cl-test-grid/work-dir/agent/quicklisp/dists/quicklisp/software/iolib-20150302-git/iolib.asd: The variable C::*CC-FLAGS* is unbound.
(LOAD cl-mw FAIL) ASDF/FIND-SYSTEM:LOAD-SYSTEM-DEFINITION-ERROR : Error while trying to load definition for system iolib from pathname /home/testgrid/cl-test-grid/work-dir/agent/quicklisp/dists/quicklisp/software/iolib-20150302-git/iolib.asd: The variable C::*CC-FLAGS* is unbound.
ecl-15.2.21-ee989b97-linux-i686-lisp-to-c
(LOAD cl-mw.examples.with-task-policy FAIL) COMMON-LISP:UNBOUND-VARIABLE : The variable +WRITERS+ is unbound.
(LOAD cl-mw.examples.ping FAIL) COMMON-LISP:UNBOUND-VARIABLE : The variable +WRITERS+ is unbound.
(LOAD cl-mw.examples.monte-carlo-pi FAIL) COMMON-LISP:UNBOUND-VARIABLE : The variable +WRITERS+ is unbound.
(LOAD cl-mw.examples.higher-order FAIL) COMMON-LISP:UNBOUND-VARIABLE : The variable +WRITERS+ is unbound.
(LOAD cl-mw.examples.hello-world FAIL) COMMON-LISP:UNBOUND-VARIABLE : The variable +WRITERS+ is unbound.
(LOAD cl-mw.examples.argument-processing FAIL) COMMON-LISP:UNBOUND-VARIABLE : The variable +WRITERS+ is unbound.
(LOAD cl-mw FAIL) COMMON-LISP:UNBOUND-VARIABLE : The variable +WRITERS+ is unbound.
(LOAD cl-mw.examples.with-task-policy FAIL) COMMON-LISP:UNBOUND-VARIABLE : The variable +WRITERS+ is unbound.
(LOAD cl-mw.examples.ping FAIL) COMMON-LISP:UNBOUND-VARIABLE : The variable +WRITERS+ is unbound.
(LOAD cl-mw.examples.monte-carlo-pi FAIL) COMMON-LISP:UNBOUND-VARIABLE : The variable +WRITERS+ is unbound.
(LOAD cl-mw.examples.higher-order FAIL) COMMON-LISP:UNBOUND-VARIABLE : The variable +WRITERS+ is unbound.
(LOAD cl-mw.examples.hello-world FAIL) COMMON-LISP:UNBOUND-VARIABLE : The variable +WRITERS+ is unbound.
(LOAD cl-mw.examples.argument-processing FAIL) COMMON-LISP:UNBOUND-VARIABLE : The variable +WRITERS+ is unbound.
(LOAD cl-mw FAIL) COMMON-LISP:UNBOUND-VARIABLE : The variable +WRITERS+ is unbound.
ecl-15.2.21-ee989b97-linux-x64-bytecode
(LOAD cl-mw.examples.with-task-policy FAIL) ASDF/FIND-SYSTEM:LOAD-SYSTEM-DEFINITION-ERROR : Error while trying to load definition for system iolib from pathname /home/hijarian/systems/cl-test-grid/work-dir/agent/quicklisp/dists/quicklisp/software/iolib-20150302-git/iolib.asd: The variable C::*CC-FLAGS* is unbound.
(LOAD cl-mw.examples.ping FAIL) ASDF/FIND-SYSTEM:LOAD-SYSTEM-DEFINITION-ERROR : Error while trying to load definition for system iolib from pathname /home/hijarian/systems/cl-test-grid/work-dir/agent/quicklisp/dists/quicklisp/software/iolib-20150302-git/iolib.asd: The variable C::*CC-FLAGS* is unbound.
(LOAD cl-mw.examples.monte-carlo-pi FAIL) ASDF/FIND-SYSTEM:LOAD-SYSTEM-DEFINITION-ERROR : Error while trying to load definition for system iolib from pathname /home/hijarian/systems/cl-test-grid/work-dir/agent/quicklisp/dists/quicklisp/software/iolib-20150302-git/iolib.asd: The variable C::*CC-FLAGS* is unbound.
(LOAD cl-mw.examples.higher-order FAIL) ASDF/FIND-SYSTEM:LOAD-SYSTEM-DEFINITION-ERROR : Error while trying to load definition for system iolib from pathname /home/hijarian/systems/cl-test-grid/work-dir/agent/quicklisp/dists/quicklisp/software/iolib-20150302-git/iolib.asd: The variable C::*CC-FLAGS* is unbound.
(LOAD cl-mw.examples.hello-world FAIL) ASDF/FIND-SYSTEM:LOAD-SYSTEM-DEFINITION-ERROR : Error while trying to load definition for system iolib from pathname /home/hijarian/systems/cl-test-grid/work-dir/agent/quicklisp/dists/quicklisp/software/iolib-20150302-git/iolib.asd: The variable C::*CC-FLAGS* is unbound.
(LOAD cl-mw.examples.argument-processing FAIL) ASDF/FIND-SYSTEM:LOAD-SYSTEM-DEFINITION-ERROR : Error while trying to load definition for system iolib from pathname /home/hijarian/systems/cl-test-grid/work-dir/agent/quicklisp/dists/quicklisp/software/iolib-20150302-git/iolib.asd: The variable C::*CC-FLAGS* is unbound.
(LOAD cl-mw FAIL) ASDF/FIND-SYSTEM:LOAD-SYSTEM-DEFINITION-ERROR : Error while trying to load definition for system iolib from pathname /home/hijarian/systems/cl-test-grid/work-dir/agent/quicklisp/dists/quicklisp/software/iolib-20150302-git/iolib.asd: The variable C::*CC-FLAGS* is unbound.
(LOAD cl-mw.examples.with-task-policy FAIL) ASDF/FIND-SYSTEM:LOAD-SYSTEM-DEFINITION-ERROR : Error while trying to load definition for system iolib from pathname /home/hijarian/systems/cl-test-grid/work-dir/agent/quicklisp/dists/quicklisp/software/iolib-20150302-git/iolib.asd: The variable C::*CC-FLAGS* is unbound.
(LOAD cl-mw.examples.ping FAIL) ASDF/FIND-SYSTEM:LOAD-SYSTEM-DEFINITION-ERROR : Error while trying to load definition for system iolib from pathname /home/hijarian/systems/cl-test-grid/work-dir/agent/quicklisp/dists/quicklisp/software/iolib-20150302-git/iolib.asd: The variable C::*CC-FLAGS* is unbound.
(LOAD cl-mw.examples.monte-carlo-pi FAIL) ASDF/FIND-SYSTEM:LOAD-SYSTEM-DEFINITION-ERROR : Error while trying to load definition for system iolib from pathname /home/hijarian/systems/cl-test-grid/work-dir/agent/quicklisp/dists/quicklisp/software/iolib-20150302-git/iolib.asd: The variable C::*CC-FLAGS* is unbound.
(LOAD cl-mw.examples.higher-order FAIL) ASDF/FIND-SYSTEM:LOAD-SYSTEM-DEFINITION-ERROR : Error while trying to load definition for system iolib from pathname /home/hijarian/systems/cl-test-grid/work-dir/agent/quicklisp/dists/quicklisp/software/iolib-20150302-git/iolib.asd: The variable C::*CC-FLAGS* is unbound.
(LOAD cl-mw.examples.hello-world FAIL) ASDF/FIND-SYSTEM:LOAD-SYSTEM-DEFINITION-ERROR : Error while trying to load definition for system iolib from pathname /home/hijarian/systems/cl-test-grid/work-dir/agent/quicklisp/dists/quicklisp/software/iolib-20150302-git/iolib.asd: The variable C::*CC-FLAGS* is unbound.
(LOAD cl-mw.examples.argument-processing FAIL) ASDF/FIND-SYSTEM:LOAD-SYSTEM-DEFINITION-ERROR : Error while trying to load definition for system iolib from pathname /home/hijarian/systems/cl-test-grid/work-dir/agent/quicklisp/dists/quicklisp/software/iolib-20150302-git/iolib.asd: The variable C::*CC-FLAGS* is unbound.
(LOAD cl-mw FAIL) ASDF/FIND-SYSTEM:LOAD-SYSTEM-DEFINITION-ERROR : Error while trying to load definition for system iolib from pathname /home/hijarian/systems/cl-test-grid/work-dir/agent/quicklisp/dists/quicklisp/software/iolib-20150302-git/iolib.asd: The variable C::*CC-FLAGS* is unbound.
ecl-15.2.21-ee989b97-linux-x64-lisp-to-c
(LOAD cl-mw.examples.with-task-policy FAIL) COMMON-LISP:UNBOUND-VARIABLE : The variable +WRITERS+ is unbound.
(LOAD cl-mw.examples.ping FAIL) COMMON-LISP:UNBOUND-VARIABLE : The variable +WRITERS+ is unbound.
(LOAD cl-mw.examples.monte-carlo-pi FAIL) COMMON-LISP:UNBOUND-VARIABLE : The variable +WRITERS+ is unbound.
(LOAD cl-mw.examples.higher-order FAIL) COMMON-LISP:UNBOUND-VARIABLE : The variable +WRITERS+ is unbound.
(LOAD cl-mw.examples.hello-world FAIL) COMMON-LISP:UNBOUND-VARIABLE : The variable +WRITERS+ is unbound.
(LOAD cl-mw.examples.argument-processing FAIL) COMMON-LISP:UNBOUND-VARIABLE : The variable +WRITERS+ is unbound.
(LOAD cl-mw FAIL) COMMON-LISP:UNBOUND-VARIABLE : The variable +WRITERS+ is unbound.
(LOAD cl-mw.examples.with-task-policy FAIL) COMMON-LISP:UNBOUND-VARIABLE : The variable +WRITERS+ is unbound.
(LOAD cl-mw.examples.ping FAIL) COMMON-LISP:UNBOUND-VARIABLE : The variable +WRITERS+ is unbound.
(LOAD cl-mw.examples.monte-carlo-pi FAIL) COMMON-LISP:UNBOUND-VARIABLE : The variable +WRITERS+ is unbound.
(LOAD cl-mw.examples.higher-order FAIL) COMMON-LISP:UNBOUND-VARIABLE : The variable +WRITERS+ is unbound.
(LOAD cl-mw.examples.hello-world FAIL) COMMON-LISP:UNBOUND-VARIABLE : The variable +WRITERS+ is unbound.
(LOAD cl-mw.examples.argument-processing FAIL) COMMON-LISP:UNBOUND-VARIABLE : The variable +WRITERS+ is unbound.
(LOAD cl-mw FAIL) COMMON-LISP:UNBOUND-VARIABLE : The variable +WRITERS+ is unbound.
ecl-15.3.7-827d3035-linux-x64-lisp-to-c
(LOAD cl-mw.examples.with-task-policy FAIL) COMMON-LISP:UNBOUND-VARIABLE : The variable +WRITERS+ is unbound.
(LOAD cl-mw.examples.ping FAIL) COMMON-LISP:UNBOUND-VARIABLE : The variable +WRITERS+ is unbound.
(LOAD cl-mw.examples.monte-carlo-pi FAIL) COMMON-LISP:UNBOUND-VARIABLE : The variable +WRITERS+ is unbound.
(LOAD cl-mw.examples.higher-order FAIL) COMMON-LISP:UNBOUND-VARIABLE : The variable +WRITERS+ is unbound.
(LOAD cl-mw.examples.hello-world FAIL) COMMON-LISP:UNBOUND-VARIABLE : The variable +WRITERS+ is unbound.
(LOAD cl-mw.examples.argument-processing FAIL) COMMON-LISP:UNBOUND-VARIABLE : The variable +WRITERS+ is unbound.
(LOAD cl-mw FAIL) COMMON-LISP:UNBOUND-VARIABLE : The variable +WRITERS+ is unbound.
(LOAD cl-mw.examples.with-task-policy FAIL) COMMON-LISP:UNBOUND-VARIABLE : The variable +WRITERS+ is unbound.
(LOAD cl-mw.examples.ping FAIL) COMMON-LISP:UNBOUND-VARIABLE : The variable +WRITERS+ is unbound.
(LOAD cl-mw.examples.monte-carlo-pi FAIL) COMMON-LISP:UNBOUND-VARIABLE : The variable +WRITERS+ is unbound.
(LOAD cl-mw.examples.higher-order FAIL) COMMON-LISP:UNBOUND-VARIABLE : The variable +WRITERS+ is unbound.
(LOAD cl-mw.examples.hello-world FAIL) COMMON-LISP:UNBOUND-VARIABLE : The variable +WRITERS+ is unbound.
(LOAD cl-mw.examples.argument-processing FAIL) COMMON-LISP:UNBOUND-VARIABLE : The variable +WRITERS+ is unbound.
(LOAD cl-mw FAIL) COMMON-LISP:UNBOUND-VARIABLE : The variable +WRITERS+ is unbound.
ecl-15.3.7-a014bd2c-linux-x64-lisp-to-c
(LOAD cl-mw.examples.with-task-policy FAIL) COMMON-LISP:UNBOUND-VARIABLE : The variable +WRITERS+ is unbound.
(LOAD cl-mw.examples.ping FAIL) COMMON-LISP:UNBOUND-VARIABLE : The variable +WRITERS+ is unbound.
(LOAD cl-mw.examples.monte-carlo-pi FAIL) COMMON-LISP:UNBOUND-VARIABLE : The variable +WRITERS+ is unbound.
(LOAD cl-mw.examples.higher-order FAIL) COMMON-LISP:UNBOUND-VARIABLE : The variable +WRITERS+ is unbound.
(LOAD cl-mw.examples.hello-world FAIL) COMMON-LISP:UNBOUND-VARIABLE : The variable +WRITERS+ is unbound.
(LOAD cl-mw.examples.argument-processing FAIL) COMMON-LISP:UNBOUND-VARIABLE : The variable +WRITERS+ is unbound.
(LOAD cl-mw FAIL) COMMON-LISP:UNBOUND-VARIABLE : The variable +WRITERS+ is unbound.
sbcl-1.0.58-linux-x86
(LOAD cl-mw.examples.with-task-policy FAIL) ASDF:LOAD-SYSTEM-DEFINITION-ERROR : Error while trying to load definition for system iolib from pathname /home/testgrid/cl-test-grid/work-dir/agent/quicklisp/dists/quicklisp/software/iolib-20150302-git/iolib.asd: You need ASDF >= 2.31.1 to load this system correctly.
(LOAD cl-mw.examples.ping FAIL) ASDF:LOAD-SYSTEM-DEFINITION-ERROR : Error while trying to load definition for system iolib from pathname /home/testgrid/cl-test-grid/work-dir/agent/quicklisp/dists/quicklisp/software/iolib-20150302-git/iolib.asd: You need ASDF >= 2.31.1 to load this system correctly.
(LOAD cl-mw.examples.monte-carlo-pi FAIL) ASDF:LOAD-SYSTEM-DEFINITION-ERROR : Error while trying to load definition for system iolib from pathname /home/testgrid/cl-test-grid/work-dir/agent/quicklisp/dists/quicklisp/software/iolib-20150302-git/iolib.asd: You need ASDF >= 2.31.1 to load this system correctly.
(LOAD cl-mw.examples.higher-order FAIL) ASDF:LOAD-SYSTEM-DEFINITION-ERROR : Error while trying to load definition for system iolib from pathname /home/testgrid/cl-test-grid/work-dir/agent/quicklisp/dists/quicklisp/software/iolib-20150302-git/iolib.asd: You need ASDF >= 2.31.1 to load this system correctly.
(LOAD cl-mw.examples.hello-world FAIL) ASDF:LOAD-SYSTEM-DEFINITION-ERROR : Error while trying to load definition for system iolib from pathname /home/testgrid/cl-test-grid/work-dir/agent/quicklisp/dists/quicklisp/software/iolib-20150302-git/iolib.asd: You need ASDF >= 2.31.1 to load this system correctly.
(LOAD cl-mw.examples.argument-processing FAIL) ASDF:LOAD-SYSTEM-DEFINITION-ERROR : Error while trying to load definition for system iolib from pathname /home/testgrid/cl-test-grid/work-dir/agent/quicklisp/dists/quicklisp/software/iolib-20150302-git/iolib.asd: You need ASDF >= 2.31.1 to load this system correctly.
(LOAD cl-mw FAIL) ASDF:LOAD-SYSTEM-DEFINITION-ERROR : Error while trying to load definition for system iolib from pathname /home/testgrid/cl-test-grid/work-dir/agent/quicklisp/dists/quicklisp/software/iolib-20150302-git/iolib.asd: You need ASDF >= 2.31.1 to load this system correctly.
(LOAD cl-mw.examples.with-task-policy FAIL) ASDF:LOAD-SYSTEM-DEFINITION-ERROR : Error while trying to load definition for system iolib from pathname /home/testgrid/cl-test-grid/work-dir/agent/quicklisp/dists/quicklisp/software/iolib-20150302-git/iolib.asd: You need ASDF >= 2.31.1 to load this system correctly.
(LOAD cl-mw.examples.ping FAIL) ASDF:LOAD-SYSTEM-DEFINITION-ERROR : Error while trying to load definition for system iolib from pathname /home/testgrid/cl-test-grid/work-dir/agent/quicklisp/dists/quicklisp/software/iolib-20150302-git/iolib.asd: You need ASDF >= 2.31.1 to load this system correctly.
(LOAD cl-mw.examples.monte-carlo-pi FAIL) ASDF:LOAD-SYSTEM-DEFINITION-ERROR : Error while trying to load definition for system iolib from pathname /home/testgrid/cl-test-grid/work-dir/agent/quicklisp/dists/quicklisp/software/iolib-20150302-git/iolib.asd: You need ASDF >= 2.31.1 to load this system correctly.
(LOAD cl-mw.examples.higher-order FAIL) ASDF:LOAD-SYSTEM-DEFINITION-ERROR : Error while trying to load definition for system iolib from pathname /home/testgrid/cl-test-grid/work-dir/agent/quicklisp/dists/quicklisp/software/iolib-20150302-git/iolib.asd: You need ASDF >= 2.31.1 to load this system correctly.
(LOAD cl-mw.examples.hello-world FAIL) ASDF:LOAD-SYSTEM-DEFINITION-ERROR : Error while trying to load definition for system iolib from pathname /home/testgrid/cl-test-grid/work-dir/agent/quicklisp/dists/quicklisp/software/iolib-20150302-git/iolib.asd: You need ASDF >= 2.31.1 to load this system correctly.
(LOAD cl-mw.examples.argument-processing FAIL) ASDF:LOAD-SYSTEM-DEFINITION-ERROR : Error while trying to load definition for system iolib from pathname /home/testgrid/cl-test-grid/work-dir/agent/quicklisp/dists/quicklisp/software/iolib-20150302-git/iolib.asd: You need ASDF >= 2.31.1 to load this system correctly.
(LOAD cl-mw FAIL) ASDF:LOAD-SYSTEM-DEFINITION-ERROR : Error while trying to load definition for system iolib from pathname /home/testgrid/cl-test-grid/work-dir/agent/quicklisp/dists/quicklisp/software/iolib-20150302-git/iolib.asd: You need ASDF >= 2.31.1 to load this system correctly.
sbcl-1.1.11-linux-x86
(LOAD cl-mw.examples.with-task-policy FAIL) needs newer ASDF, ASDF/FIND-SYSTEM:LOAD-SYSTEM-DEFINITION-ERROR : Error while trying to load definition for system hu.dwim.serializer from pathname /home/testgrid/cl-test-grid/work-dir/agent/quicklisp/dists/quicklisp/software/hu.dwim.serializer-20150608-darcs/hu.dwim.serializer.asd: no symbol named "NON-PROPAGATING-OPERATION" in "ASDF/INTERFACE"
(LOAD cl-mw.examples.ping FAIL) needs newer ASDF, ASDF/FIND-SYSTEM:LOAD-SYSTEM-DEFINITION-ERROR : Error while trying to load definition for system hu.dwim.serializer from pathname /home/testgrid/cl-test-grid/work-dir/agent/quicklisp/dists/quicklisp/software/hu.dwim.serializer-20150608-darcs/hu.dwim.serializer.asd: no symbol named "NON-PROPAGATING-OPERATION" in "ASDF/INTERFACE"
(LOAD cl-mw.examples.monte-carlo-pi FAIL) needs newer ASDF, ASDF/FIND-SYSTEM:LOAD-SYSTEM-DEFINITION-ERROR : Error while trying to load definition for system hu.dwim.serializer from pathname /home/testgrid/cl-test-grid/work-dir/agent/quicklisp/dists/quicklisp/software/hu.dwim.serializer-20150608-darcs/hu.dwim.serializer.asd: no symbol named "NON-PROPAGATING-OPERATION" in "ASDF/INTERFACE"
(LOAD cl-mw.examples.higher-order FAIL) needs newer ASDF, ASDF/FIND-SYSTEM:LOAD-SYSTEM-DEFINITION-ERROR : Error while trying to load definition for system hu.dwim.serializer from pathname /home/testgrid/cl-test-grid/work-dir/agent/quicklisp/dists/quicklisp/software/hu.dwim.serializer-20150608-darcs/hu.dwim.serializer.asd: no symbol named "NON-PROPAGATING-OPERATION" in "ASDF/INTERFACE"
(LOAD cl-mw.examples.hello-world FAIL) needs newer ASDF, ASDF/FIND-SYSTEM:LOAD-SYSTEM-DEFINITION-ERROR : Error while trying to load definition for system hu.dwim.serializer from pathname /home/testgrid/cl-test-grid/work-dir/agent/quicklisp/dists/quicklisp/software/hu.dwim.serializer-20150608-darcs/hu.dwim.serializer.asd: no symbol named "NON-PROPAGATING-OPERATION" in "ASDF/INTERFACE"
(LOAD cl-mw.examples.argument-processing FAIL) needs newer ASDF, ASDF/FIND-SYSTEM:LOAD-SYSTEM-DEFINITION-ERROR : Error while trying to load definition for system hu.dwim.serializer from pathname /home/testgrid/cl-test-grid/work-dir/agent/quicklisp/dists/quicklisp/software/hu.dwim.serializer-20150608-darcs/hu.dwim.serializer.asd: no symbol named "NON-PROPAGATING-OPERATION" in "ASDF/INTERFACE"
(LOAD cl-mw FAIL) needs newer ASDF, ASDF/FIND-SYSTEM:LOAD-SYSTEM-DEFINITION-ERROR : Error while trying to load definition for system hu.dwim.serializer from pathname /home/testgrid/cl-test-grid/work-dir/agent/quicklisp/dists/quicklisp/software/hu.dwim.serializer-20150608-darcs/hu.dwim.serializer.asd: no symbol named "NON-PROPAGATING-OPERATION" in "ASDF/INTERFACE"
(LOAD cl-mw.examples.with-task-policy FAIL) QUICKLISP-CLIENT:SYSTEM-NOT-FOUND : System "sb-sprof" not found
(LOAD cl-mw.examples.ping FAIL) QUICKLISP-CLIENT:SYSTEM-NOT-FOUND : System "sb-sprof" not found
(LOAD cl-mw.examples.monte-carlo-pi FAIL) QUICKLISP-CLIENT:SYSTEM-NOT-FOUND : System "sb-sprof" not found
(LOAD cl-mw.examples.higher-order FAIL) QUICKLISP-CLIENT:SYSTEM-NOT-FOUND : System "sb-sprof" not found
(LOAD cl-mw.examples.hello-world FAIL) QUICKLISP-CLIENT:SYSTEM-NOT-FOUND : System "sb-sprof" not found
(LOAD cl-mw.examples.argument-processing FAIL) QUICKLISP-CLIENT:SYSTEM-NOT-FOUND : System "sb-sprof" not found
(LOAD cl-mw FAIL) QUICKLISP-CLIENT:SYSTEM-NOT-FOUND : System "sb-sprof" not found
sbcl-1.1.16-linux-x86
(LOAD cl-mw.examples.with-task-policy FAIL) needs newer ASDF, ASDF/FIND-SYSTEM:LOAD-SYSTEM-DEFINITION-ERROR : Error while trying to load definition for system hu.dwim.serializer from pathname /home/testgrid/cl-test-grid/work-dir/agent/quicklisp/dists/quicklisp/software/hu.dwim.serializer-20150608-darcs/hu.dwim.serializer.asd: no symbol named "NON-PROPAGATING-OPERATION" in "ASDF/INTERFACE"
(LOAD cl-mw.examples.ping FAIL) needs newer ASDF, ASDF/FIND-SYSTEM:LOAD-SYSTEM-DEFINITION-ERROR : Error while trying to load definition for system hu.dwim.serializer from pathname /home/testgrid/cl-test-grid/work-dir/agent/quicklisp/dists/quicklisp/software/hu.dwim.serializer-20150608-darcs/hu.dwim.serializer.asd: no symbol named "NON-PROPAGATING-OPERATION" in "ASDF/INTERFACE"
(LOAD cl-mw.examples.monte-carlo-pi FAIL) needs newer ASDF, ASDF/FIND-SYSTEM:LOAD-SYSTEM-DEFINITION-ERROR : Error while trying to load definition for system hu.dwim.serializer from pathname /home/testgrid/cl-test-grid/work-dir/agent/quicklisp/dists/quicklisp/software/hu.dwim.serializer-20150608-darcs/hu.dwim.serializer.asd: no symbol named "NON-PROPAGATING-OPERATION" in "ASDF/INTERFACE"
(LOAD cl-mw.examples.higher-order FAIL) needs newer ASDF, ASDF/FIND-SYSTEM:LOAD-SYSTEM-DEFINITION-ERROR : Error while trying to load definition for system hu.dwim.serializer from pathname /home/testgrid/cl-test-grid/work-dir/agent/quicklisp/dists/quicklisp/software/hu.dwim.serializer-20150608-darcs/hu.dwim.serializer.asd: no symbol named "NON-PROPAGATING-OPERATION" in "ASDF/INTERFACE"
(LOAD cl-mw.examples.hello-world FAIL) needs newer ASDF, ASDF/FIND-SYSTEM:LOAD-SYSTEM-DEFINITION-ERROR : Error while trying to load definition for system hu.dwim.serializer from pathname /home/testgrid/cl-test-grid/work-dir/agent/quicklisp/dists/quicklisp/software/hu.dwim.serializer-20150608-darcs/hu.dwim.serializer.asd: no symbol named "NON-PROPAGATING-OPERATION" in "ASDF/INTERFACE"
(LOAD cl-mw.examples.argument-processing FAIL) needs newer ASDF, ASDF/FIND-SYSTEM:LOAD-SYSTEM-DEFINITION-ERROR : Error while trying to load definition for system hu.dwim.serializer from pathname /home/testgrid/cl-test-grid/work-dir/agent/quicklisp/dists/quicklisp/software/hu.dwim.serializer-20150608-darcs/hu.dwim.serializer.asd: no symbol named "NON-PROPAGATING-OPERATION" in "ASDF/INTERFACE"
(LOAD cl-mw FAIL) needs newer ASDF, ASDF/FIND-SYSTEM:LOAD-SYSTEM-DEFINITION-ERROR : Error while trying to load definition for system hu.dwim.serializer from pathname /home/testgrid/cl-test-grid/work-dir/agent/quicklisp/dists/quicklisp/software/hu.dwim.serializer-20150608-darcs/hu.dwim.serializer.asd: no symbol named "NON-PROPAGATING-OPERATION" in "ASDF/INTERFACE"
sbcl-1.2.3-linux-x64
(LOAD cl-mw.examples.with-task-policy FAIL) COMMON-LISP:SIMPLE-ERROR : External process exited with code 1. Command was: "g++" "-m64" "-Wno-write-strings" "-I/home/hijarian/systems/cl-test-grid/work-dir/agent/quicklisp/dists/quicklisp/software/iolib-20150302-git/src/grovel/" "-o" "/home/hijarian/systems/cl-test-grid/work-dir/agent/test-runs/20150609131809-sbcl-1.2.3-linux-x64/fasl/ql/dists/quicklisp/software/iolib-20150302-git/src/syscalls/ffi-types-unix" "/home/hijarian/systems/cl-test-grid/work-dir/agent/test-runs/20150609131809-sbcl-1.2.3-linux-x64/fasl/ql/dists/quicklisp/software/iolib-20150302-git/src/syscalls/ffi-types-unix.c" Output was: /home/hijarian/systems/cl-test-grid/work-dir/agent/test-runs/20150609131809-sbcl-1.2.3-linux-x64/fasl/ql/dists/quicklisp/software/iolib-20150302-git/src/syscalls/ffi-types-unix.c:14:17: fatal error: lfp.h: Нет такого файла или каталога #include <lfp.h> ^ compilation terminated.
(LOAD cl-mw.examples.ping FAIL) COMMON-LISP:SIMPLE-ERROR : External process exited with code 1. Command was: "g++" "-m64" "-Wno-write-strings" "-I/home/hijarian/systems/cl-test-grid/work-dir/agent/quicklisp/dists/quicklisp/software/iolib-20150302-git/src/grovel/" "-o" "/home/hijarian/systems/cl-test-grid/work-dir/agent/test-runs/20150609131809-sbcl-1.2.3-linux-x64/fasl/ql/dists/quicklisp/software/iolib-20150302-git/src/syscalls/ffi-types-unix" "/home/hijarian/systems/cl-test-grid/work-dir/agent/test-runs/20150609131809-sbcl-1.2.3-linux-x64/fasl/ql/dists/quicklisp/software/iolib-20150302-git/src/syscalls/ffi-types-unix.c" Output was: /home/hijarian/systems/cl-test-grid/work-dir/agent/test-runs/20150609131809-sbcl-1.2.3-linux-x64/fasl/ql/dists/quicklisp/software/iolib-20150302-git/src/syscalls/ffi-types-unix.c:14:17: fatal error: lfp.h: Нет такого файла или каталога #include <lfp.h> ^ compilation terminated.
(LOAD cl-mw.examples.monte-carlo-pi FAIL) COMMON-LISP:SIMPLE-ERROR : External process exited with code 1. Command was: "g++" "-m64" "-Wno-write-strings" "-I/home/hijarian/systems/cl-test-grid/work-dir/agent/quicklisp/dists/quicklisp/software/iolib-20150302-git/src/grovel/" "-o" "/home/hijarian/systems/cl-test-grid/work-dir/agent/test-runs/20150609131809-sbcl-1.2.3-linux-x64/fasl/ql/dists/quicklisp/software/iolib-20150302-git/src/syscalls/ffi-types-unix" "/home/hijarian/systems/cl-test-grid/work-dir/agent/test-runs/20150609131809-sbcl-1.2.3-linux-x64/fasl/ql/dists/quicklisp/software/iolib-20150302-git/src/syscalls/ffi-types-unix.c" Output was: /home/hijarian/systems/cl-test-grid/work-dir/agent/test-runs/20150609131809-sbcl-1.2.3-linux-x64/fasl/ql/dists/quicklisp/software/iolib-20150302-git/src/syscalls/ffi-types-unix.c:14:17: fatal error: lfp.h: Нет такого файла или каталога #include <lfp.h> ^ compilation terminated.
(LOAD cl-mw.examples.higher-order FAIL) COMMON-LISP:SIMPLE-ERROR : External process exited with code 1. Command was: "g++" "-m64" "-Wno-write-strings" "-I/home/hijarian/systems/cl-test-grid/work-dir/agent/quicklisp/dists/quicklisp/software/iolib-20150302-git/src/grovel/" "-o" "/home/hijarian/systems/cl-test-grid/work-dir/agent/test-runs/20150609131809-sbcl-1.2.3-linux-x64/fasl/ql/dists/quicklisp/software/iolib-20150302-git/src/syscalls/ffi-types-unix" "/home/hijarian/systems/cl-test-grid/work-dir/agent/test-runs/20150609131809-sbcl-1.2.3-linux-x64/fasl/ql/dists/quicklisp/software/iolib-20150302-git/src/syscalls/ffi-types-unix.c" Output was: /home/hijarian/systems/cl-test-grid/work-dir/agent/test-runs/20150609131809-sbcl-1.2.3-linux-x64/fasl/ql/dists/quicklisp/software/iolib-20150302-git/src/syscalls/ffi-types-unix.c:14:17: fatal error: lfp.h: Нет такого файла или каталога #include <lfp.h> ^ compilation terminated.
(LOAD cl-mw.examples.hello-world FAIL) COMMON-LISP:SIMPLE-ERROR : External process exited with code 1. Command was: "g++" "-m64" "-Wno-write-strings" "-I/home/hijarian/systems/cl-test-grid/work-dir/agent/quicklisp/dists/quicklisp/software/iolib-20150302-git/src/grovel/" "-o" "/home/hijarian/systems/cl-test-grid/work-dir/agent/test-runs/20150609131809-sbcl-1.2.3-linux-x64/fasl/ql/dists/quicklisp/software/iolib-20150302-git/src/syscalls/ffi-types-unix" "/home/hijarian/systems/cl-test-grid/work-dir/agent/test-runs/20150609131809-sbcl-1.2.3-linux-x64/fasl/ql/dists/quicklisp/software/iolib-20150302-git/src/syscalls/ffi-types-unix.c" Output was: /home/hijarian/systems/cl-test-grid/work-dir/agent/test-runs/20150609131809-sbcl-1.2.3-linux-x64/fasl/ql/dists/quicklisp/software/iolib-20150302-git/src/syscalls/ffi-types-unix.c:14:17: fatal error: lfp.h: Нет такого файла или каталога #include <lfp.h> ^ compilation terminated.
(LOAD cl-mw.examples.argument-processing FAIL) COMMON-LISP:SIMPLE-ERROR : External process exited with code 1. Command was: "g++" "-m64" "-Wno-write-strings" "-I/home/hijarian/systems/cl-test-grid/work-dir/agent/quicklisp/dists/quicklisp/software/iolib-20150302-git/src/grovel/" "-o" "/home/hijarian/systems/cl-test-grid/work-dir/agent/test-runs/20150609131809-sbcl-1.2.3-linux-x64/fasl/ql/dists/quicklisp/software/iolib-20150302-git/src/syscalls/ffi-types-unix" "/home/hijarian/systems/cl-test-grid/work-dir/agent/test-runs/20150609131809-sbcl-1.2.3-linux-x64/fasl/ql/dists/quicklisp/software/iolib-20150302-git/src/syscalls/ffi-types-unix.c" Output was: /home/hijarian/systems/cl-test-grid/work-dir/agent/test-runs/20150609131809-sbcl-1.2.3-linux-x64/fasl/ql/dists/quicklisp/software/iolib-20150302-git/src/syscalls/ffi-types-unix.c:14:17: fatal error: lfp.h: Нет такого файла или каталога #include <lfp.h> ^ compilation terminated.
(LOAD cl-mw FAIL) COMMON-LISP:SIMPLE-ERROR : External process exited with code 1. Command was: "g++" "-m64" "-Wno-write-strings" "-I/home/hijarian/systems/cl-test-grid/work-dir/agent/quicklisp/dists/quicklisp/software/iolib-20150302-git/src/grovel/" "-o" "/home/hijarian/systems/cl-test-grid/work-dir/agent/test-runs/20150609131809-sbcl-1.2.3-linux-x64/fasl/ql/dists/quicklisp/software/iolib-20150302-git/src/syscalls/ffi-types-unix" "/home/hijarian/systems/cl-test-grid/work-dir/agent/test-runs/20150609131809-sbcl-1.2.3-linux-x64/fasl/ql/dists/quicklisp/software/iolib-20150302-git/src/syscalls/ffi-types-unix.c" Output was: /home/hijarian/systems/cl-test-grid/work-dir/agent/test-runs/20150609131809-sbcl-1.2.3-linux-x64/fasl/ql/dists/quicklisp/software/iolib-20150302-git/src/syscalls/ffi-types-unix.c:14:17: fatal error: lfp.h: Нет такого файла или каталога #include <lfp.h> ^ compilation terminated.
(LOAD cl-mw.examples.with-task-policy FAIL) COMMON-LISP:SIMPLE-ERROR : External process exited with code 1. Command was: "g++" "-m64" "-Wno-write-strings" "-I/home/hijarian/systems/cl-test-grid/work-dir/agent/quicklisp/dists/quicklisp/software/iolib-20150302-git/src/grovel/" "-o" "/home/hijarian/systems/cl-test-grid/work-dir/agent/test-runs/20150518190329-sbcl-1.2.3-linux-x64/fasl/ql/dists/quicklisp/software/iolib-20150302-git/src/syscalls/ffi-types-unix" "/home/hijarian/systems/cl-test-grid/work-dir/agent/test-runs/20150518190329-sbcl-1.2.3-linux-x64/fasl/ql/dists/quicklisp/software/iolib-20150302-git/src/syscalls/ffi-types-unix.c" Output was: /home/hijarian/systems/cl-test-grid/work-dir/agent/test-runs/20150518190329-sbcl-1.2.3-linux-x64/fasl/ql/dists/quicklisp/software/iolib-20150302-git/src/syscalls/ffi-types-unix.c:14:17: fatal error: lfp.h: Нет такого файла или каталога #include <lfp.h> ^ compilation terminated.
(LOAD cl-mw.examples.ping FAIL) COMMON-LISP:SIMPLE-ERROR : External process exited with code 1. Command was: "g++" "-m64" "-Wno-write-strings" "-I/home/hijarian/systems/cl-test-grid/work-dir/agent/quicklisp/dists/quicklisp/software/iolib-20150302-git/src/grovel/" "-o" "/home/hijarian/systems/cl-test-grid/work-dir/agent/test-runs/20150518190329-sbcl-1.2.3-linux-x64/fasl/ql/dists/quicklisp/software/iolib-20150302-git/src/syscalls/ffi-types-unix" "/home/hijarian/systems/cl-test-grid/work-dir/agent/test-runs/20150518190329-sbcl-1.2.3-linux-x64/fasl/ql/dists/quicklisp/software/iolib-20150302-git/src/syscalls/ffi-types-unix.c" Output was: /home/hijarian/systems/cl-test-grid/work-dir/agent/test-runs/20150518190329-sbcl-1.2.3-linux-x64/fasl/ql/dists/quicklisp/software/iolib-20150302-git/src/syscalls/ffi-types-unix.c:14:17: fatal error: lfp.h: Нет такого файла или каталога #include <lfp.h> ^ compilation terminated.
(LOAD cl-mw.examples.monte-carlo-pi FAIL) COMMON-LISP:SIMPLE-ERROR : External process exited with code 1. Command was: "g++" "-m64" "-Wno-write-strings" "-I/home/hijarian/systems/cl-test-grid/work-dir/agent/quicklisp/dists/quicklisp/software/iolib-20150302-git/src/grovel/" "-o" "/home/hijarian/systems/cl-test-grid/work-dir/agent/test-runs/20150518190329-sbcl-1.2.3-linux-x64/fasl/ql/dists/quicklisp/software/iolib-20150302-git/src/syscalls/ffi-types-unix" "/home/hijarian/systems/cl-test-grid/work-dir/agent/test-runs/20150518190329-sbcl-1.2.3-linux-x64/fasl/ql/dists/quicklisp/software/iolib-20150302-git/src/syscalls/ffi-types-unix.c" Output was: /home/hijarian/systems/cl-test-grid/work-dir/agent/test-runs/20150518190329-sbcl-1.2.3-linux-x64/fasl/ql/dists/quicklisp/software/iolib-20150302-git/src/syscalls/ffi-types-unix.c:14:17: fatal error: lfp.h: Нет такого файла или каталога #include <lfp.h> ^ compilation terminated.
(LOAD cl-mw.examples.higher-order FAIL) COMMON-LISP:SIMPLE-ERROR : External process exited with code 1. Command was: "g++" "-m64" "-Wno-write-strings" "-I/home/hijarian/systems/cl-test-grid/work-dir/agent/quicklisp/dists/quicklisp/software/iolib-20150302-git/src/grovel/" "-o" "/home/hijarian/systems/cl-test-grid/work-dir/agent/test-runs/20150518190329-sbcl-1.2.3-linux-x64/fasl/ql/dists/quicklisp/software/iolib-20150302-git/src/syscalls/ffi-types-unix" "/home/hijarian/systems/cl-test-grid/work-dir/agent/test-runs/20150518190329-sbcl-1.2.3-linux-x64/fasl/ql/dists/quicklisp/software/iolib-20150302-git/src/syscalls/ffi-types-unix.c" Output was: /home/hijarian/systems/cl-test-grid/work-dir/agent/test-runs/20150518190329-sbcl-1.2.3-linux-x64/fasl/ql/dists/quicklisp/software/iolib-20150302-git/src/syscalls/ffi-types-unix.c:14:17: fatal error: lfp.h: Нет такого файла или каталога #include <lfp.h> ^ compilation terminated.
(LOAD cl-mw.examples.hello-world FAIL) COMMON-LISP:SIMPLE-ERROR : External process exited with code 1. Command was: "g++" "-m64" "-Wno-write-strings" "-I/home/hijarian/systems/cl-test-grid/work-dir/agent/quicklisp/dists/quicklisp/software/iolib-20150302-git/src/grovel/" "-o" "/home/hijarian/systems/cl-test-grid/work-dir/agent/test-runs/20150518190329-sbcl-1.2.3-linux-x64/fasl/ql/dists/quicklisp/software/iolib-20150302-git/src/syscalls/ffi-types-unix" "/home/hijarian/systems/cl-test-grid/work-dir/agent/test-runs/20150518190329-sbcl-1.2.3-linux-x64/fasl/ql/dists/quicklisp/software/iolib-20150302-git/src/syscalls/ffi-types-unix.c" Output was: /home/hijarian/systems/cl-test-grid/work-dir/agent/test-runs/20150518190329-sbcl-1.2.3-linux-x64/fasl/ql/dists/quicklisp/software/iolib-20150302-git/src/syscalls/ffi-types-unix.c:14:17: fatal error: lfp.h: Нет такого файла или каталога #include <lfp.h> ^ compilation terminated.
(LOAD cl-mw.examples.argument-processing FAIL) COMMON-LISP:SIMPLE-ERROR : External process exited with code 1. Command was: "g++" "-m64" "-Wno-write-strings" "-I/home/hijarian/systems/cl-test-grid/work-dir/agent/quicklisp/dists/quicklisp/software/iolib-20150302-git/src/grovel/" "-o" "/home/hijarian/systems/cl-test-grid/work-dir/agent/test-runs/20150518190329-sbcl-1.2.3-linux-x64/fasl/ql/dists/quicklisp/software/iolib-20150302-git/src/syscalls/ffi-types-unix" "/home/hijarian/systems/cl-test-grid/work-dir/agent/test-runs/20150518190329-sbcl-1.2.3-linux-x64/fasl/ql/dists/quicklisp/software/iolib-20150302-git/src/syscalls/ffi-types-unix.c" Output was: /home/hijarian/systems/cl-test-grid/work-dir/agent/test-runs/20150518190329-sbcl-1.2.3-linux-x64/fasl/ql/dists/quicklisp/software/iolib-20150302-git/src/syscalls/ffi-types-unix.c:14:17: fatal error: lfp.h: Нет такого файла или каталога #include <lfp.h> ^ compilation terminated.
(LOAD cl-mw FAIL) COMMON-LISP:SIMPLE-ERROR : External process exited with code 1. Command was: "g++" "-m64" "-Wno-write-strings" "-I/home/hijarian/systems/cl-test-grid/work-dir/agent/quicklisp/dists/quicklisp/software/iolib-20150302-git/src/grovel/" "-o" "/home/hijarian/systems/cl-test-grid/work-dir/agent/test-runs/20150518190329-sbcl-1.2.3-linux-x64/fasl/ql/dists/quicklisp/software/iolib-20150302-git/src/syscalls/ffi-types-unix" "/home/hijarian/systems/cl-test-grid/work-dir/agent/test-runs/20150518190329-sbcl-1.2.3-linux-x64/fasl/ql/dists/quicklisp/software/iolib-20150302-git/src/syscalls/ffi-types-unix.c" Output was: /home/hijarian/systems/cl-test-grid/work-dir/agent/test-runs/20150518190329-sbcl-1.2.3-linux-x64/fasl/ql/dists/quicklisp/software/iolib-20150302-git/src/syscalls/ffi-types-unix.c:14:17: fatal error: lfp.h: Нет такого файла или каталога #include <lfp.h> ^ compilation terminated.
sbcl-1.2.6-linux-x86

Breakdown by testcases: for every failed testcase the lisp implmentations it fails on

The library does not have a testsuite adapter for CL Test Grid.

To reports overview

Generated at: 2015-06-20 14:25:32 GMT.