cl-glfw3 results collected by cl-test-grid

Results on the last two Quicklisp distributions

 quicklisp 2015-12-18quicklisp 2015-10-31
abcl-1.2.1-fasl42-linux-x86
(LOAD cl-glfw3-examples FAIL) ffi, CFFI:LOAD-FOREIGN-LIBRARY-ERROR : Unable to load any of the alternatives: ("libglfw.so.3.0" "libglfw.so.3")
(LOAD cl-glfw3 FAIL) ffi, CFFI:LOAD-FOREIGN-LIBRARY-ERROR : Unable to load any of the alternatives: ("libglfw.so.3.0" "libglfw.so.3")
(LOAD cl-glfw3-examples FAIL) ffi, CFFI:LOAD-FOREIGN-LIBRARY-ERROR : Unable to load any of the alternatives: ("libglfw.so.3.0" "libglfw.so.3")
(LOAD cl-glfw3 FAIL) ffi, CFFI:LOAD-FOREIGN-LIBRARY-ERROR : Unable to load any of the alternatives: ("libglfw.so.3.0" "libglfw.so.3")
abcl-1.3.0-fasl42-linux-x86
(LOAD cl-glfw3-examples FAIL) ffi, CFFI:LOAD-FOREIGN-LIBRARY-ERROR : Unable to load any of the alternatives: ("libglfw.so.3.0" "libglfw.so.3")
(LOAD cl-glfw3 FAIL) ffi, CFFI:LOAD-FOREIGN-LIBRARY-ERROR : Unable to load any of the alternatives: ("libglfw.so.3.0" "libglfw.so.3")
(LOAD cl-glfw3-examples FAIL) ffi, CFFI:LOAD-FOREIGN-LIBRARY-ERROR : Unable to load any of the alternatives: ("libglfw.so.3.0" "libglfw.so.3")
(LOAD cl-glfw3 FAIL) ffi, CFFI:LOAD-FOREIGN-LIBRARY-ERROR : Unable to load any of the alternatives: ("libglfw.so.3.0" "libglfw.so.3")
abcl-1.3.1-fasl42-linux-x86
(LOAD cl-glfw3-examples FAIL) ffi, CFFI:LOAD-FOREIGN-LIBRARY-ERROR : Unable to load any of the alternatives: ("libglfw.so.3.0" "libglfw.so.3")
(LOAD cl-glfw3 FAIL) ffi, CFFI:LOAD-FOREIGN-LIBRARY-ERROR : Unable to load any of the alternatives: ("libglfw.so.3.0" "libglfw.so.3")
(LOAD cl-glfw3-examples FAIL) ffi, CFFI:LOAD-FOREIGN-LIBRARY-ERROR : Unable to load any of the alternatives: ("libglfw.so.3.0" "libglfw.so.3")
(LOAD cl-glfw3 FAIL) ffi, CFFI:LOAD-FOREIGN-LIBRARY-ERROR : Unable to load any of the alternatives: ("libglfw.so.3.0" "libglfw.so.3")
abcl-1.3.1-fasl42-macosx-x64
(LOAD cl-glfw3-examples FAIL) ASDF/FIND-SYSTEM:LOAD-SYSTEM-DEFINITION-ERROR : Error while trying to load definition for system cffi-libffi from pathname /Users/testgrid/cl-test-grid/work-dir/agent/quicklisp/dists/quicklisp/software/cffi_0.16.1/cffi-libffi.asd: The file http does not exist.
(LOAD cl-glfw3 FAIL) ASDF/FIND-SYSTEM:LOAD-SYSTEM-DEFINITION-ERROR : Error while trying to load definition for system cffi-libffi from pathname /Users/testgrid/cl-test-grid/work-dir/agent/quicklisp/dists/quicklisp/software/cffi_0.16.1/cffi-libffi.asd: The file http does not exist.
abcl-1.3.2-fasl42-linux-x86
(LOAD cl-glfw3-examples FAIL) ffi, CFFI:LOAD-FOREIGN-LIBRARY-ERROR : Unable to load any of the alternatives: ("libglfw.so.3.0" "libglfw.so.3")
(LOAD cl-glfw3 FAIL) ffi, CFFI:LOAD-FOREIGN-LIBRARY-ERROR : Unable to load any of the alternatives: ("libglfw.so.3.0" "libglfw.so.3")
(LOAD cl-glfw3-examples FAIL) ffi, CFFI:LOAD-FOREIGN-LIBRARY-ERROR : Unable to load any of the alternatives: ("libglfw.so.3.0" "libglfw.so.3")
(LOAD cl-glfw3 FAIL) ffi, CFFI:LOAD-FOREIGN-LIBRARY-ERROR : Unable to load any of the alternatives: ("libglfw.so.3.0" "libglfw.so.3")
ccl-1.10-r16196-f101-linux-arm
(LOAD cl-glfw3-examples FAIL) ffi-grovel, CFFI-GROVEL:GROVEL-ERROR : External process exited with code 1. Command was: "cc" "-marm" "-I/home/testgrid/cl-test-grid/work-dir/agent/quicklisp/dists/quicklisp/software/cffi_0.16.1/" "-o" "/home/testgrid/cl-test-grid/work-dir/agent/test-runs/20151221221845-ccl-1.10-r16196-f101-linux-arm/fasl/ql/dists/quicklisp/software/cffi_0.16.1/libffi/libffi-unix" "/home/testgrid/cl-test-grid/work-dir/agent/test-runs/20151221221845-ccl-1.10-r16196-f101-linux-arm/fasl/ql/dists/quicklisp/software/cffi_0.16.1/libffi/libffi-unix.c" Output was: /home/testgrid/cl-test-grid/work-dir/agent/test-runs/20151221221845-ccl-1.10-r16196-f101-linux-arm/fasl/ql/dists/quicklisp/software/cffi_0.16.1/libffi/libffi-unix.c: In function ‘main’: /home/testgrid/cl-test-grid/work-dir/agent/test-runs/20151221221845-ccl-1.10-r16196-f101-linux-arm/fasl/ql/dists/quicklisp/software/cffi_0.16.1/libffi/libffi-unix.c:82:41: error: ‘FFI_UNIX64’ undeclared (first use in this function) fprintf(output, "%"PRIiMAX, (intmax_t)FFI_UNIX64); ^ /home/testgrid/cl-test-grid/work-dir/agent/test-runs/20151221221845-ccl-1.10-r16196-f101-linux-arm/fasl/ql/dists/quicklisp/software/cffi_0.16.1/libffi/libffi-unix.c:82:41: note: each undeclared identifier is reported only once for each function it appears in In file included from /usr/include/string.h:32:0, from /home/testgrid/cl-test-grid/work-dir/agent/quicklisp/dists/quicklisp/software/cffi_0.16.1/grovel/common.h:4, from /home/testgrid/cl-test-grid/work-dir/agent/test-runs/20151221221845-ccl-1.10-r16196-f101-linux-arm/fasl/ql/dists/quicklisp/software/cffi_0.16.1/libffi/libffi-unix.c:9: /home/testgrid/cl-test-grid/work-dir/agent/test-runs/20151221221845-ccl-1.10-r16196-f101-linux-arm/fasl/ql/dists/quicklisp/software/cffi_0.16.1/libffi/libffi-unix.c:146:52: warning: format ‘%li’ expects argument of type ‘long int’, but argument 3 has type ‘unsigned int’ [-Wformat=] fprintf(output, " :offset %li)", offsetof(struct _ffi_type, size)); ^ /home/testgrid/cl-test-grid/work-dir/agent/test-runs/20151221221845-ccl-1.10-r16196-f101-linux-arm/fasl/ql/dists/quicklisp/software/cffi_0.16.1/libffi/libffi-unix.c:151:52: warning: format ‘%li’ expects argument of type ‘long int’, but argument 3 has type ‘unsigned int’ [-Wformat=] fprintf(output, " :offset %li)", offsetof(struct _ffi_type, alignment)); ^ /home/testgrid/cl-test-grid/work-dir/agent/test-runs/20151221221845-ccl-1.10-r16196-f101-linux-arm/fasl/ql/dists/quicklisp/software/cffi_0.16.1/libffi/libffi-unix.c:156:52: warning: format ‘%li’ expects argument of type ‘long int’, but argument 3 has type ‘unsigned int’ [-Wformat=] fprintf(output, " :offset %li)", offsetof(struct _ffi_type, type)); ^ /home/testgrid/cl-test-grid/work-dir/agent/test-runs/20151221221845-ccl-1.10-r16196-f101-linux-arm/fasl/ql/dists/quicklisp/software/cffi_0.16.1/libffi/libffi-unix.c:161:52: warning: format ‘%li’ expects argument of type ‘long int’, but argument 3 has type ‘unsigned int’ [-Wformat=] fprintf(output, " :offset %li)", offsetof(struct _ffi_type, elements)); ^
(LOAD cl-glfw3 FAIL) ffi-grovel, CFFI-GROVEL:GROVEL-ERROR : External process exited with code 1. Command was: "cc" "-marm" "-I/home/testgrid/cl-test-grid/work-dir/agent/quicklisp/dists/quicklisp/software/cffi_0.16.1/" "-o" "/home/testgrid/cl-test-grid/work-dir/agent/test-runs/20151221221845-ccl-1.10-r16196-f101-linux-arm/fasl/ql/dists/quicklisp/software/cffi_0.16.1/libffi/libffi-unix" "/home/testgrid/cl-test-grid/work-dir/agent/test-runs/20151221221845-ccl-1.10-r16196-f101-linux-arm/fasl/ql/dists/quicklisp/software/cffi_0.16.1/libffi/libffi-unix.c" Output was: /home/testgrid/cl-test-grid/work-dir/agent/test-runs/20151221221845-ccl-1.10-r16196-f101-linux-arm/fasl/ql/dists/quicklisp/software/cffi_0.16.1/libffi/libffi-unix.c: In function ‘main’: /home/testgrid/cl-test-grid/work-dir/agent/test-runs/20151221221845-ccl-1.10-r16196-f101-linux-arm/fasl/ql/dists/quicklisp/software/cffi_0.16.1/libffi/libffi-unix.c:82:41: error: ‘FFI_UNIX64’ undeclared (first use in this function) fprintf(output, "%"PRIiMAX, (intmax_t)FFI_UNIX64); ^ /home/testgrid/cl-test-grid/work-dir/agent/test-runs/20151221221845-ccl-1.10-r16196-f101-linux-arm/fasl/ql/dists/quicklisp/software/cffi_0.16.1/libffi/libffi-unix.c:82:41: note: each undeclared identifier is reported only once for each function it appears in In file included from /usr/include/string.h:32:0, from /home/testgrid/cl-test-grid/work-dir/agent/quicklisp/dists/quicklisp/software/cffi_0.16.1/grovel/common.h:4, from /home/testgrid/cl-test-grid/work-dir/agent/test-runs/20151221221845-ccl-1.10-r16196-f101-linux-arm/fasl/ql/dists/quicklisp/software/cffi_0.16.1/libffi/libffi-unix.c:9: /home/testgrid/cl-test-grid/work-dir/agent/test-runs/20151221221845-ccl-1.10-r16196-f101-linux-arm/fasl/ql/dists/quicklisp/software/cffi_0.16.1/libffi/libffi-unix.c:146:52: warning: format ‘%li’ expects argument of type ‘long int’, but argument 3 has type ‘unsigned int’ [-Wformat=] fprintf(output, " :offset %li)", offsetof(struct _ffi_type, size)); ^ /home/testgrid/cl-test-grid/work-dir/agent/test-runs/20151221221845-ccl-1.10-r16196-f101-linux-arm/fasl/ql/dists/quicklisp/software/cffi_0.16.1/libffi/libffi-unix.c:151:52: warning: format ‘%li’ expects argument of type ‘long int’, but argument 3 has type ‘unsigned int’ [-Wformat=] fprintf(output, " :offset %li)", offsetof(struct _ffi_type, alignment)); ^ /home/testgrid/cl-test-grid/work-dir/agent/test-runs/20151221221845-ccl-1.10-r16196-f101-linux-arm/fasl/ql/dists/quicklisp/software/cffi_0.16.1/libffi/libffi-unix.c:156:52: warning: format ‘%li’ expects argument of type ‘long int’, but argument 3 has type ‘unsigned int’ [-Wformat=] fprintf(output, " :offset %li)", offsetof(struct _ffi_type, type)); ^ /home/testgrid/cl-test-grid/work-dir/agent/test-runs/20151221221845-ccl-1.10-r16196-f101-linux-arm/fasl/ql/dists/quicklisp/software/cffi_0.16.1/libffi/libffi-unix.c:161:52: warning: format ‘%li’ expects argument of type ‘long int’, but argument 3 has type ‘unsigned int’ [-Wformat=] fprintf(output, " :offset %li)", offsetof(struct _ffi_type, elements)); ^
(LOAD cl-glfw3-examples FAIL) ffi-grovel, CFFI-GROVEL:GROVEL-ERROR : External process exited with code 1. Command was: "cc" "-marm" "-I/home/testgrid/cl-test-grid/work-dir/agent/quicklisp/dists/quicklisp/software/cffi_0.16.1/" "-o" "/home/testgrid/cl-test-grid/work-dir/agent/test-runs/20151104042657-ccl-1.10-r16196-f101-linux-arm/fasl/ql/dists/quicklisp/software/cffi_0.16.1/libffi/libffi-unix" "/home/testgrid/cl-test-grid/work-dir/agent/test-runs/20151104042657-ccl-1.10-r16196-f101-linux-arm/fasl/ql/dists/quicklisp/software/cffi_0.16.1/libffi/libffi-unix.c" Output was: /home/testgrid/cl-test-grid/work-dir/agent/test-runs/20151104042657-ccl-1.10-r16196-f101-linux-arm/fasl/ql/dists/quicklisp/software/cffi_0.16.1/libffi/libffi-unix.c: In function ‘main’: /home/testgrid/cl-test-grid/work-dir/agent/test-runs/20151104042657-ccl-1.10-r16196-f101-linux-arm/fasl/ql/dists/quicklisp/software/cffi_0.16.1/libffi/libffi-unix.c:82:41: error: ‘FFI_UNIX64’ undeclared (first use in this function) fprintf(output, "%"PRIiMAX, (intmax_t)FFI_UNIX64); ^ /home/testgrid/cl-test-grid/work-dir/agent/test-runs/20151104042657-ccl-1.10-r16196-f101-linux-arm/fasl/ql/dists/quicklisp/software/cffi_0.16.1/libffi/libffi-unix.c:82:41: note: each undeclared identifier is reported only once for each function it appears in In file included from /usr/include/string.h:32:0, from /home/testgrid/cl-test-grid/work-dir/agent/quicklisp/dists/quicklisp/software/cffi_0.16.1/grovel/common.h:4, from /home/testgrid/cl-test-grid/work-dir/agent/test-runs/20151104042657-ccl-1.10-r16196-f101-linux-arm/fasl/ql/dists/quicklisp/software/cffi_0.16.1/libffi/libffi-unix.c:9: /home/testgrid/cl-test-grid/work-dir/agent/test-runs/20151104042657-ccl-1.10-r16196-f101-linux-arm/fasl/ql/dists/quicklisp/software/cffi_0.16.1/libffi/libffi-unix.c:146:52: warning: format ‘%li’ expects argument of type ‘long int’, but argument 3 has type ‘unsigned int’ [-Wformat=] fprintf(output, " :offset %li)", offsetof(struct _ffi_type, size)); ^ /home/testgrid/cl-test-grid/work-dir/agent/test-runs/20151104042657-ccl-1.10-r16196-f101-linux-arm/fasl/ql/dists/quicklisp/software/cffi_0.16.1/libffi/libffi-unix.c:151:52: warning: format ‘%li’ expects argument of type ‘long int’, but argument 3 has type ‘unsigned int’ [-Wformat=] fprintf(output, " :offset %li)", offsetof(struct _ffi_type, alignment)); ^ /home/testgrid/cl-test-grid/work-dir/agent/test-runs/20151104042657-ccl-1.10-r16196-f101-linux-arm/fasl/ql/dists/quicklisp/software/cffi_0.16.1/libffi/libffi-unix.c:156:52: warning: format ‘%li’ expects argument of type ‘long int’, but argument 3 has type ‘unsigned int’ [-Wformat=] fprintf(output, " :offset %li)", offsetof(struct _ffi_type, type)); ^ /home/testgrid/cl-test-grid/work-dir/agent/test-runs/20151104042657-ccl-1.10-r16196-f101-linux-arm/fasl/ql/dists/quicklisp/software/cffi_0.16.1/libffi/libffi-unix.c:161:52: warning: format ‘%li’ expects argument of type ‘long int’, but argument 3 has type ‘unsigned int’ [-Wformat=] fprintf(output, " :offset %li)", offsetof(struct _ffi_type, elements)); ^
(LOAD cl-glfw3 FAIL) ffi-grovel, CFFI-GROVEL:GROVEL-ERROR : External process exited with code 1. Command was: "cc" "-marm" "-I/home/testgrid/cl-test-grid/work-dir/agent/quicklisp/dists/quicklisp/software/cffi_0.16.1/" "-o" "/home/testgrid/cl-test-grid/work-dir/agent/test-runs/20151104042657-ccl-1.10-r16196-f101-linux-arm/fasl/ql/dists/quicklisp/software/cffi_0.16.1/libffi/libffi-unix" "/home/testgrid/cl-test-grid/work-dir/agent/test-runs/20151104042657-ccl-1.10-r16196-f101-linux-arm/fasl/ql/dists/quicklisp/software/cffi_0.16.1/libffi/libffi-unix.c" Output was: /home/testgrid/cl-test-grid/work-dir/agent/test-runs/20151104042657-ccl-1.10-r16196-f101-linux-arm/fasl/ql/dists/quicklisp/software/cffi_0.16.1/libffi/libffi-unix.c: In function ‘main’: /home/testgrid/cl-test-grid/work-dir/agent/test-runs/20151104042657-ccl-1.10-r16196-f101-linux-arm/fasl/ql/dists/quicklisp/software/cffi_0.16.1/libffi/libffi-unix.c:82:41: error: ‘FFI_UNIX64’ undeclared (first use in this function) fprintf(output, "%"PRIiMAX, (intmax_t)FFI_UNIX64); ^ /home/testgrid/cl-test-grid/work-dir/agent/test-runs/20151104042657-ccl-1.10-r16196-f101-linux-arm/fasl/ql/dists/quicklisp/software/cffi_0.16.1/libffi/libffi-unix.c:82:41: note: each undeclared identifier is reported only once for each function it appears in In file included from /usr/include/string.h:32:0, from /home/testgrid/cl-test-grid/work-dir/agent/quicklisp/dists/quicklisp/software/cffi_0.16.1/grovel/common.h:4, from /home/testgrid/cl-test-grid/work-dir/agent/test-runs/20151104042657-ccl-1.10-r16196-f101-linux-arm/fasl/ql/dists/quicklisp/software/cffi_0.16.1/libffi/libffi-unix.c:9: /home/testgrid/cl-test-grid/work-dir/agent/test-runs/20151104042657-ccl-1.10-r16196-f101-linux-arm/fasl/ql/dists/quicklisp/software/cffi_0.16.1/libffi/libffi-unix.c:146:52: warning: format ‘%li’ expects argument of type ‘long int’, but argument 3 has type ‘unsigned int’ [-Wformat=] fprintf(output, " :offset %li)", offsetof(struct _ffi_type, size)); ^ /home/testgrid/cl-test-grid/work-dir/agent/test-runs/20151104042657-ccl-1.10-r16196-f101-linux-arm/fasl/ql/dists/quicklisp/software/cffi_0.16.1/libffi/libffi-unix.c:151:52: warning: format ‘%li’ expects argument of type ‘long int’, but argument 3 has type ‘unsigned int’ [-Wformat=] fprintf(output, " :offset %li)", offsetof(struct _ffi_type, alignment)); ^ /home/testgrid/cl-test-grid/work-dir/agent/test-runs/20151104042657-ccl-1.10-r16196-f101-linux-arm/fasl/ql/dists/quicklisp/software/cffi_0.16.1/libffi/libffi-unix.c:156:52: warning: format ‘%li’ expects argument of type ‘long int’, but argument 3 has type ‘unsigned int’ [-Wformat=] fprintf(output, " :offset %li)", offsetof(struct _ffi_type, type)); ^ /home/testgrid/cl-test-grid/work-dir/agent/test-runs/20151104042657-ccl-1.10-r16196-f101-linux-arm/fasl/ql/dists/quicklisp/software/cffi_0.16.1/libffi/libffi-unix.c:161:52: warning: format ‘%li’ expects argument of type ‘long int’, but argument 3 has type ‘unsigned int’ [-Wformat=] fprintf(output, " :offset %li)", offsetof(struct _ffi_type, elements)); ^
ccl-1.10-r16196-f96-linux-x64
(LOAD cl-glfw3-examples FAIL) ffi, CFFI:LOAD-FOREIGN-LIBRARY-ERROR : Unable to load any of the alternatives: ("libglfw.so.3.0" "libglfw.so.3")
(LOAD cl-glfw3 FAIL) ffi, CFFI:LOAD-FOREIGN-LIBRARY-ERROR : Unable to load any of the alternatives: ("libglfw.so.3.0" "libglfw.so.3")
(LOAD cl-glfw3-examples FAIL) ffi, CFFI:LOAD-FOREIGN-LIBRARY-ERROR : Unable to load any of the alternatives: ("libglfw.so.3.0" "libglfw.so.3")
(LOAD cl-glfw3 FAIL) ffi, CFFI:LOAD-FOREIGN-LIBRARY-ERROR : Unable to load any of the alternatives: ("libglfw.so.3.0" "libglfw.so.3")
ccl-1.10-r16196-f96-linux-x86
(LOAD cl-glfw3-examples FAIL) ffi, CFFI:LOAD-FOREIGN-LIBRARY-ERROR : Unable to load any of the alternatives: ("libglfw.so.3.0" "libglfw.so.3")
(LOAD cl-glfw3 FAIL) ffi, CFFI:LOAD-FOREIGN-LIBRARY-ERROR : Unable to load any of the alternatives: ("libglfw.so.3.0" "libglfw.so.3")
(LOAD cl-glfw3-examples FAIL) ffi, CFFI:LOAD-FOREIGN-LIBRARY-ERROR : Unable to load any of the alternatives: ("libglfw.so.3.0" "libglfw.so.3")
(LOAD cl-glfw3 FAIL) ffi, CFFI:LOAD-FOREIGN-LIBRARY-ERROR : Unable to load any of the alternatives: ("libglfw.so.3.0" "libglfw.so.3")
ccl-1.10-r16196-f96-macosx-x86
(LOAD cl-glfw3-examples FAIL) ffi, CFFI:LOAD-FOREIGN-LIBRARY-ERROR : Unable to load any of the alternatives: ("libglfw.so.3.0" "libglfw.so.3")
(LOAD cl-glfw3 FAIL) ffi, CFFI:LOAD-FOREIGN-LIBRARY-ERROR : Unable to load any of the alternatives: ("libglfw.so.3.0" "libglfw.so.3")
ccl-1.10-r16393-f96-macosx-x64
(LOAD cl-glfw3-examples FAIL) ffi, CFFI:LOAD-FOREIGN-LIBRARY-ERROR : Unable to load any of the alternatives: ("libglfw.so.3.0" "libglfw.so.3")
(LOAD cl-glfw3 FAIL) ffi, CFFI:LOAD-FOREIGN-LIBRARY-ERROR : Unable to load any of the alternatives: ("libglfw.so.3.0" "libglfw.so.3")
ccl-1.11-r16635-f96-linux-x86
(LOAD cl-glfw3-examples FAIL) ffi, CFFI:LOAD-FOREIGN-LIBRARY-ERROR : Unable to load any of the alternatives: ("libglfw.so.3.0" "libglfw.so.3")
(LOAD cl-glfw3 FAIL) ffi, CFFI:LOAD-FOREIGN-LIBRARY-ERROR : Unable to load any of the alternatives: ("libglfw.so.3.0" "libglfw.so.3")
(LOAD cl-glfw3-examples FAIL) ffi, CFFI:LOAD-FOREIGN-LIBRARY-ERROR : Unable to load any of the alternatives: ("libglfw.so.3.0" "libglfw.so.3")
(LOAD cl-glfw3 FAIL) ffi, CFFI:LOAD-FOREIGN-LIBRARY-ERROR : Unable to load any of the alternatives: ("libglfw.so.3.0" "libglfw.so.3")
ccl-1.11-rc1-r16536-f101-linux-arm
(LOAD cl-glfw3-examples FAIL) ffi-grovel, CFFI-GROVEL:GROVEL-ERROR : External process exited with code 1. Command was: "cc" "-marm" "-I/home/testgrid/cl-test-grid/work-dir/agent/quicklisp/dists/quicklisp/software/cffi_0.16.1/" "-o" "/home/testgrid/cl-test-grid/work-dir/agent/test-runs/20151224090851-ccl-1.11-rc1-r16536-f101-linux-arm/fasl/ql/dists/quicklisp/software/cffi_0.16.1/libffi/libffi-unix" "/home/testgrid/cl-test-grid/work-dir/agent/test-runs/20151224090851-ccl-1.11-rc1-r16536-f101-linux-arm/fasl/ql/dists/quicklisp/software/cffi_0.16.1/libffi/libffi-unix.c" Output was: /home/testgrid/cl-test-grid/work-dir/agent/test-runs/20151224090851-ccl-1.11-rc1-r16536-f101-linux-arm/fasl/ql/dists/quicklisp/software/cffi_0.16.1/libffi/libffi-unix.c: In function ‘main’: /home/testgrid/cl-test-grid/work-dir/agent/test-runs/20151224090851-ccl-1.11-rc1-r16536-f101-linux-arm/fasl/ql/dists/quicklisp/software/cffi_0.16.1/libffi/libffi-unix.c:82:41: error: ‘FFI_UNIX64’ undeclared (first use in this function) fprintf(output, "%"PRIiMAX, (intmax_t)FFI_UNIX64); ^ /home/testgrid/cl-test-grid/work-dir/agent/test-runs/20151224090851-ccl-1.11-rc1-r16536-f101-linux-arm/fasl/ql/dists/quicklisp/software/cffi_0.16.1/libffi/libffi-unix.c:82:41: note: each undeclared identifier is reported only once for each function it appears in In file included from /usr/include/string.h:32:0, from /home/testgrid/cl-test-grid/work-dir/agent/quicklisp/dists/quicklisp/software/cffi_0.16.1/grovel/common.h:4, from /home/testgrid/cl-test-grid/work-dir/agent/test-runs/20151224090851-ccl-1.11-rc1-r16536-f101-linux-arm/fasl/ql/dists/quicklisp/software/cffi_0.16.1/libffi/libffi-unix.c:9: /home/testgrid/cl-test-grid/work-dir/agent/test-runs/20151224090851-ccl-1.11-rc1-r16536-f101-linux-arm/fasl/ql/dists/quicklisp/software/cffi_0.16.1/libffi/libffi-unix.c:146:52: warning: format ‘%li’ expects argument of type ‘long int’, but argument 3 has type ‘unsigned int’ [-Wformat=] fprintf(output, " :offset %li)", offsetof(struct _ffi_type, size)); ^ /home/testgrid/cl-test-grid/work-dir/agent/test-runs/20151224090851-ccl-1.11-rc1-r16536-f101-linux-arm/fasl/ql/dists/quicklisp/software/cffi_0.16.1/libffi/libffi-unix.c:151:52: warning: format ‘%li’ expects argument of type ‘long int’, but argument 3 has type ‘unsigned int’ [-Wformat=] fprintf(output, " :offset %li)", offsetof(struct _ffi_type, alignment)); ^ /home/testgrid/cl-test-grid/work-dir/agent/test-runs/20151224090851-ccl-1.11-rc1-r16536-f101-linux-arm/fasl/ql/dists/quicklisp/software/cffi_0.16.1/libffi/libffi-unix.c:156:52: warning: format ‘%li’ expects argument of type ‘long int’, but argument 3 has type ‘unsigned int’ [-Wformat=] fprintf(output, " :offset %li)", offsetof(struct _ffi_type, type)); ^ /home/testgrid/cl-test-grid/work-dir/agent/test-runs/20151224090851-ccl-1.11-rc1-r16536-f101-linux-arm/fasl/ql/dists/quicklisp/software/cffi_0.16.1/libffi/libffi-unix.c:161:52: warning: format ‘%li’ expects argument of type ‘long int’, but argument 3 has type ‘unsigned int’ [-Wformat=] fprintf(output, " :offset %li)", offsetof(struct _ffi_type, elements)); ^
(LOAD cl-glfw3 FAIL) ffi-grovel, CFFI-GROVEL:GROVEL-ERROR : External process exited with code 1. Command was: "cc" "-marm" "-I/home/testgrid/cl-test-grid/work-dir/agent/quicklisp/dists/quicklisp/software/cffi_0.16.1/" "-o" "/home/testgrid/cl-test-grid/work-dir/agent/test-runs/20151224090851-ccl-1.11-rc1-r16536-f101-linux-arm/fasl/ql/dists/quicklisp/software/cffi_0.16.1/libffi/libffi-unix" "/home/testgrid/cl-test-grid/work-dir/agent/test-runs/20151224090851-ccl-1.11-rc1-r16536-f101-linux-arm/fasl/ql/dists/quicklisp/software/cffi_0.16.1/libffi/libffi-unix.c" Output was: /home/testgrid/cl-test-grid/work-dir/agent/test-runs/20151224090851-ccl-1.11-rc1-r16536-f101-linux-arm/fasl/ql/dists/quicklisp/software/cffi_0.16.1/libffi/libffi-unix.c: In function ‘main’: /home/testgrid/cl-test-grid/work-dir/agent/test-runs/20151224090851-ccl-1.11-rc1-r16536-f101-linux-arm/fasl/ql/dists/quicklisp/software/cffi_0.16.1/libffi/libffi-unix.c:82:41: error: ‘FFI_UNIX64’ undeclared (first use in this function) fprintf(output, "%"PRIiMAX, (intmax_t)FFI_UNIX64); ^ /home/testgrid/cl-test-grid/work-dir/agent/test-runs/20151224090851-ccl-1.11-rc1-r16536-f101-linux-arm/fasl/ql/dists/quicklisp/software/cffi_0.16.1/libffi/libffi-unix.c:82:41: note: each undeclared identifier is reported only once for each function it appears in In file included from /usr/include/string.h:32:0, from /home/testgrid/cl-test-grid/work-dir/agent/quicklisp/dists/quicklisp/software/cffi_0.16.1/grovel/common.h:4, from /home/testgrid/cl-test-grid/work-dir/agent/test-runs/20151224090851-ccl-1.11-rc1-r16536-f101-linux-arm/fasl/ql/dists/quicklisp/software/cffi_0.16.1/libffi/libffi-unix.c:9: /home/testgrid/cl-test-grid/work-dir/agent/test-runs/20151224090851-ccl-1.11-rc1-r16536-f101-linux-arm/fasl/ql/dists/quicklisp/software/cffi_0.16.1/libffi/libffi-unix.c:146:52: warning: format ‘%li’ expects argument of type ‘long int’, but argument 3 has type ‘unsigned int’ [-Wformat=] fprintf(output, " :offset %li)", offsetof(struct _ffi_type, size)); ^ /home/testgrid/cl-test-grid/work-dir/agent/test-runs/20151224090851-ccl-1.11-rc1-r16536-f101-linux-arm/fasl/ql/dists/quicklisp/software/cffi_0.16.1/libffi/libffi-unix.c:151:52: warning: format ‘%li’ expects argument of type ‘long int’, but argument 3 has type ‘unsigned int’ [-Wformat=] fprintf(output, " :offset %li)", offsetof(struct _ffi_type, alignment)); ^ /home/testgrid/cl-test-grid/work-dir/agent/test-runs/20151224090851-ccl-1.11-rc1-r16536-f101-linux-arm/fasl/ql/dists/quicklisp/software/cffi_0.16.1/libffi/libffi-unix.c:156:52: warning: format ‘%li’ expects argument of type ‘long int’, but argument 3 has type ‘unsigned int’ [-Wformat=] fprintf(output, " :offset %li)", offsetof(struct _ffi_type, type)); ^ /home/testgrid/cl-test-grid/work-dir/agent/test-runs/20151224090851-ccl-1.11-rc1-r16536-f101-linux-arm/fasl/ql/dists/quicklisp/software/cffi_0.16.1/libffi/libffi-unix.c:161:52: warning: format ‘%li’ expects argument of type ‘long int’, but argument 3 has type ‘unsigned int’ [-Wformat=] fprintf(output, " :offset %li)", offsetof(struct _ffi_type, elements)); ^
(LOAD cl-glfw3-examples FAIL) ffi-grovel, CFFI-GROVEL:GROVEL-ERROR : External process exited with code 1. Command was: "cc" "-marm" "-I/home/testgrid/cl-test-grid/work-dir/agent/quicklisp/dists/quicklisp/software/cffi_0.16.1/" "-o" "/home/testgrid/cl-test-grid/work-dir/agent/test-runs/20151105151907-ccl-1.11-rc1-r16536-f101-linux-arm/fasl/ql/dists/quicklisp/software/cffi_0.16.1/libffi/libffi-unix" "/home/testgrid/cl-test-grid/work-dir/agent/test-runs/20151105151907-ccl-1.11-rc1-r16536-f101-linux-arm/fasl/ql/dists/quicklisp/software/cffi_0.16.1/libffi/libffi-unix.c" Output was: /home/testgrid/cl-test-grid/work-dir/agent/test-runs/20151105151907-ccl-1.11-rc1-r16536-f101-linux-arm/fasl/ql/dists/quicklisp/software/cffi_0.16.1/libffi/libffi-unix.c: In function ‘main’: /home/testgrid/cl-test-grid/work-dir/agent/test-runs/20151105151907-ccl-1.11-rc1-r16536-f101-linux-arm/fasl/ql/dists/quicklisp/software/cffi_0.16.1/libffi/libffi-unix.c:82:41: error: ‘FFI_UNIX64’ undeclared (first use in this function) fprintf(output, "%"PRIiMAX, (intmax_t)FFI_UNIX64); ^ /home/testgrid/cl-test-grid/work-dir/agent/test-runs/20151105151907-ccl-1.11-rc1-r16536-f101-linux-arm/fasl/ql/dists/quicklisp/software/cffi_0.16.1/libffi/libffi-unix.c:82:41: note: each undeclared identifier is reported only once for each function it appears in In file included from /usr/include/string.h:32:0, from /home/testgrid/cl-test-grid/work-dir/agent/quicklisp/dists/quicklisp/software/cffi_0.16.1/grovel/common.h:4, from /home/testgrid/cl-test-grid/work-dir/agent/test-runs/20151105151907-ccl-1.11-rc1-r16536-f101-linux-arm/fasl/ql/dists/quicklisp/software/cffi_0.16.1/libffi/libffi-unix.c:9: /home/testgrid/cl-test-grid/work-dir/agent/test-runs/20151105151907-ccl-1.11-rc1-r16536-f101-linux-arm/fasl/ql/dists/quicklisp/software/cffi_0.16.1/libffi/libffi-unix.c:146:52: warning: format ‘%li’ expects argument of type ‘long int’, but argument 3 has type ‘unsigned int’ [-Wformat=] fprintf(output, " :offset %li)", offsetof(struct _ffi_type, size)); ^ /home/testgrid/cl-test-grid/work-dir/agent/test-runs/20151105151907-ccl-1.11-rc1-r16536-f101-linux-arm/fasl/ql/dists/quicklisp/software/cffi_0.16.1/libffi/libffi-unix.c:151:52: warning: format ‘%li’ expects argument of type ‘long int’, but argument 3 has type ‘unsigned int’ [-Wformat=] fprintf(output, " :offset %li)", offsetof(struct _ffi_type, alignment)); ^ /home/testgrid/cl-test-grid/work-dir/agent/test-runs/20151105151907-ccl-1.11-rc1-r16536-f101-linux-arm/fasl/ql/dists/quicklisp/software/cffi_0.16.1/libffi/libffi-unix.c:156:52: warning: format ‘%li’ expects argument of type ‘long int’, but argument 3 has type ‘unsigned int’ [-Wformat=] fprintf(output, " :offset %li)", offsetof(struct _ffi_type, type)); ^ /home/testgrid/cl-test-grid/work-dir/agent/test-runs/20151105151907-ccl-1.11-rc1-r16536-f101-linux-arm/fasl/ql/dists/quicklisp/software/cffi_0.16.1/libffi/libffi-unix.c:161:52: warning: format ‘%li’ expects argument of type ‘long int’, but argument 3 has type ‘unsigned int’ [-Wformat=] fprintf(output, " :offset %li)", offsetof(struct _ffi_type, elements)); ^
(LOAD cl-glfw3 FAIL) ffi-grovel, CFFI-GROVEL:GROVEL-ERROR : External process exited with code 1. Command was: "cc" "-marm" "-I/home/testgrid/cl-test-grid/work-dir/agent/quicklisp/dists/quicklisp/software/cffi_0.16.1/" "-o" "/home/testgrid/cl-test-grid/work-dir/agent/test-runs/20151105151907-ccl-1.11-rc1-r16536-f101-linux-arm/fasl/ql/dists/quicklisp/software/cffi_0.16.1/libffi/libffi-unix" "/home/testgrid/cl-test-grid/work-dir/agent/test-runs/20151105151907-ccl-1.11-rc1-r16536-f101-linux-arm/fasl/ql/dists/quicklisp/software/cffi_0.16.1/libffi/libffi-unix.c" Output was: /home/testgrid/cl-test-grid/work-dir/agent/test-runs/20151105151907-ccl-1.11-rc1-r16536-f101-linux-arm/fasl/ql/dists/quicklisp/software/cffi_0.16.1/libffi/libffi-unix.c: In function ‘main’: /home/testgrid/cl-test-grid/work-dir/agent/test-runs/20151105151907-ccl-1.11-rc1-r16536-f101-linux-arm/fasl/ql/dists/quicklisp/software/cffi_0.16.1/libffi/libffi-unix.c:82:41: error: ‘FFI_UNIX64’ undeclared (first use in this function) fprintf(output, "%"PRIiMAX, (intmax_t)FFI_UNIX64); ^ /home/testgrid/cl-test-grid/work-dir/agent/test-runs/20151105151907-ccl-1.11-rc1-r16536-f101-linux-arm/fasl/ql/dists/quicklisp/software/cffi_0.16.1/libffi/libffi-unix.c:82:41: note: each undeclared identifier is reported only once for each function it appears in In file included from /usr/include/string.h:32:0, from /home/testgrid/cl-test-grid/work-dir/agent/quicklisp/dists/quicklisp/software/cffi_0.16.1/grovel/common.h:4, from /home/testgrid/cl-test-grid/work-dir/agent/test-runs/20151105151907-ccl-1.11-rc1-r16536-f101-linux-arm/fasl/ql/dists/quicklisp/software/cffi_0.16.1/libffi/libffi-unix.c:9: /home/testgrid/cl-test-grid/work-dir/agent/test-runs/20151105151907-ccl-1.11-rc1-r16536-f101-linux-arm/fasl/ql/dists/quicklisp/software/cffi_0.16.1/libffi/libffi-unix.c:146:52: warning: format ‘%li’ expects argument of type ‘long int’, but argument 3 has type ‘unsigned int’ [-Wformat=] fprintf(output, " :offset %li)", offsetof(struct _ffi_type, size)); ^ /home/testgrid/cl-test-grid/work-dir/agent/test-runs/20151105151907-ccl-1.11-rc1-r16536-f101-linux-arm/fasl/ql/dists/quicklisp/software/cffi_0.16.1/libffi/libffi-unix.c:151:52: warning: format ‘%li’ expects argument of type ‘long int’, but argument 3 has type ‘unsigned int’ [-Wformat=] fprintf(output, " :offset %li)", offsetof(struct _ffi_type, alignment)); ^ /home/testgrid/cl-test-grid/work-dir/agent/test-runs/20151105151907-ccl-1.11-rc1-r16536-f101-linux-arm/fasl/ql/dists/quicklisp/software/cffi_0.16.1/libffi/libffi-unix.c:156:52: warning: format ‘%li’ expects argument of type ‘long int’, but argument 3 has type ‘unsigned int’ [-Wformat=] fprintf(output, " :offset %li)", offsetof(struct _ffi_type, type)); ^ /home/testgrid/cl-test-grid/work-dir/agent/test-runs/20151105151907-ccl-1.11-rc1-r16536-f101-linux-arm/fasl/ql/dists/quicklisp/software/cffi_0.16.1/libffi/libffi-unix.c:161:52: warning: format ‘%li’ expects argument of type ‘long int’, but argument 3 has type ‘unsigned int’ [-Wformat=] fprintf(output, " :offset %li)", offsetof(struct _ffi_type, elements)); ^
ccl-1.11-rc1-r16536-f96-linux-x86
(LOAD cl-glfw3-examples FAIL) ffi, CFFI:LOAD-FOREIGN-LIBRARY-ERROR : Unable to load any of the alternatives: ("libglfw.so.3.0" "libglfw.so.3")
(LOAD cl-glfw3 FAIL) ffi, CFFI:LOAD-FOREIGN-LIBRARY-ERROR : Unable to load any of the alternatives: ("libglfw.so.3.0" "libglfw.so.3")
(LOAD cl-glfw3-examples FAIL) ffi, CFFI:LOAD-FOREIGN-LIBRARY-ERROR : Unable to load any of the alternatives: ("libglfw.so.3.0" "libglfw.so.3")
(LOAD cl-glfw3 FAIL) ffi, CFFI:LOAD-FOREIGN-LIBRARY-ERROR : Unable to load any of the alternatives: ("libglfw.so.3.0" "libglfw.so.3")
ccl-1.11-rc1-r16536-f96-macosx-x86
(LOAD cl-glfw3-examples FAIL) ffi, CFFI:LOAD-FOREIGN-LIBRARY-ERROR : Unable to load any of the alternatives: ("libglfw.so.3.0" "libglfw.so.3")
(LOAD cl-glfw3 FAIL) ffi, CFFI:LOAD-FOREIGN-LIBRARY-ERROR : Unable to load any of the alternatives: ("libglfw.so.3.0" "libglfw.so.3")
ccl-1.11-rc1-r16540-f96-macosx-x64
(LOAD cl-glfw3-examples FAIL) ffi, CFFI:LOAD-FOREIGN-LIBRARY-ERROR : Unable to load any of the alternatives: ("libglfw.so.3.0" "libglfw.so.3")
(LOAD cl-glfw3 FAIL) ffi, CFFI:LOAD-FOREIGN-LIBRARY-ERROR : Unable to load any of the alternatives: ("libglfw.so.3.0" "libglfw.so.3")
(LOAD cl-glfw3-examples FAIL) ffi, CFFI:LOAD-FOREIGN-LIBRARY-ERROR : Unable to load any of the alternatives: ("libglfw.so.3.0" "libglfw.so.3")
(LOAD cl-glfw3 FAIL) ffi, CFFI:LOAD-FOREIGN-LIBRARY-ERROR : Unable to load any of the alternatives: ("libglfw.so.3.0" "libglfw.so.3")
(LOAD cl-glfw3-examples FAIL) ffi, CFFI:LOAD-FOREIGN-LIBRARY-ERROR : Unable to load any of the alternatives: ("libglfw.so.3.0" "libglfw.so.3")
(LOAD cl-glfw3 FAIL) ffi, CFFI:LOAD-FOREIGN-LIBRARY-ERROR : Unable to load any of the alternatives: ("libglfw.so.3.0" "libglfw.so.3")
ccl-1.11-rc1-r16542m-f101-linux-arm
(LOAD cl-glfw3-examples FAIL) ffi-grovel, CFFI-GROVEL:GROVEL-ERROR : External process exited with code 1. Command was: "cc" "-marm" "-I/home/testgrid/cl-test-grid/work-dir/agent/quicklisp/dists/quicklisp/software/cffi_0.16.1/" "-o" "/home/testgrid/cl-test-grid/work-dir/agent/test-runs/20151229150230-ccl-1.11-rc1-r16542m-f101-linux-arm/fasl/ql/dists/quicklisp/software/cffi_0.16.1/libffi/libffi-unix" "/home/testgrid/cl-test-grid/work-dir/agent/test-runs/20151229150230-ccl-1.11-rc1-r16542m-f101-linux-arm/fasl/ql/dists/quicklisp/software/cffi_0.16.1/libffi/libffi-unix.c" Output was: /home/testgrid/cl-test-grid/work-dir/agent/test-runs/20151229150230-ccl-1.11-rc1-r16542m-f101-linux-arm/fasl/ql/dists/quicklisp/software/cffi_0.16.1/libffi/libffi-unix.c:7:17: fatal error: ffi.h: No such file or directory compilation terminated.
(LOAD cl-glfw3 FAIL) ffi-grovel, CFFI-GROVEL:GROVEL-ERROR : External process exited with code 1. Command was: "cc" "-marm" "-I/home/testgrid/cl-test-grid/work-dir/agent/quicklisp/dists/quicklisp/software/cffi_0.16.1/" "-o" "/home/testgrid/cl-test-grid/work-dir/agent/test-runs/20151229150230-ccl-1.11-rc1-r16542m-f101-linux-arm/fasl/ql/dists/quicklisp/software/cffi_0.16.1/libffi/libffi-unix" "/home/testgrid/cl-test-grid/work-dir/agent/test-runs/20151229150230-ccl-1.11-rc1-r16542m-f101-linux-arm/fasl/ql/dists/quicklisp/software/cffi_0.16.1/libffi/libffi-unix.c" Output was: /home/testgrid/cl-test-grid/work-dir/agent/test-runs/20151229150230-ccl-1.11-rc1-r16542m-f101-linux-arm/fasl/ql/dists/quicklisp/software/cffi_0.16.1/libffi/libffi-unix.c:7:17: fatal error: ffi.h: No such file or directory compilation terminated.
(LOAD cl-glfw3-examples FAIL) ffi-grovel, CFFI-GROVEL:GROVEL-ERROR : External process exited with code 1. Command was: "cc" "-marm" "-I/home/testgrid/cl-test-grid/work-dir/agent/quicklisp/dists/quicklisp/software/cffi_0.16.1/" "-o" "/home/testgrid/cl-test-grid/work-dir/agent/test-runs/20151102175618-ccl-1.11-rc1-r16542m-f101-linux-arm/fasl/ql/dists/quicklisp/software/cffi_0.16.1/libffi/libffi-unix" "/home/testgrid/cl-test-grid/work-dir/agent/test-runs/20151102175618-ccl-1.11-rc1-r16542m-f101-linux-arm/fasl/ql/dists/quicklisp/software/cffi_0.16.1/libffi/libffi-unix.c" Output was: /home/testgrid/cl-test-grid/work-dir/agent/test-runs/20151102175618-ccl-1.11-rc1-r16542m-f101-linux-arm/fasl/ql/dists/quicklisp/software/cffi_0.16.1/libffi/libffi-unix.c:7:17: fatal error: ffi.h: No such file or directory compilation terminated.
(LOAD cl-glfw3 FAIL) ffi-grovel, CFFI-GROVEL:GROVEL-ERROR : External process exited with code 1. Command was: "cc" "-marm" "-I/home/testgrid/cl-test-grid/work-dir/agent/quicklisp/dists/quicklisp/software/cffi_0.16.1/" "-o" "/home/testgrid/cl-test-grid/work-dir/agent/test-runs/20151102175618-ccl-1.11-rc1-r16542m-f101-linux-arm/fasl/ql/dists/quicklisp/software/cffi_0.16.1/libffi/libffi-unix" "/home/testgrid/cl-test-grid/work-dir/agent/test-runs/20151102175618-ccl-1.11-rc1-r16542m-f101-linux-arm/fasl/ql/dists/quicklisp/software/cffi_0.16.1/libffi/libffi-unix.c" Output was: /home/testgrid/cl-test-grid/work-dir/agent/test-runs/20151102175618-ccl-1.11-rc1-r16542m-f101-linux-arm/fasl/ql/dists/quicklisp/software/cffi_0.16.1/libffi/libffi-unix.c:7:17: fatal error: ffi.h: No such file or directory compilation terminated.
ccl-1.8-r15286m-f95-linux-x86
(LOAD cl-glfw3-examples FAIL) needs newer ASDF, ASDF:LOAD-SYSTEM-DEFINITION-ERROR : Error while trying to load definition for system trivial-main-thread from pathname /home/testgrid/cl-test-grid/work-dir/agent/quicklisp/dists/quicklisp/software/trivial-main-thread-20150709-git/trivial-main-thread.asd: :HOMEPAGE is an invalid initarg to REINITIALIZE-INSTANCE for #<STANDARD-CLASS ASDF:SYSTEM>. Valid initargs: (:NAME :VERSION :DESCRIPTION :LONG-DESCRIPTION :IN-ORDER-TO :DO-FIRST :PARENT :PATHNAME :AROUND-COMPILE :ENCODING :PROPERTIES :COMPONENTS :IF-COMPONENT-DEP-FAILS :DEFAULT-COMPONENT-CLASS :AUTHOR :MAINTAINER :LICENCE :LICENSE :SOURCE-FILE :DEFSYSTEM-DEPENDS-ON).
(LOAD cl-glfw3 FAIL) ffi, CFFI:LOAD-FOREIGN-LIBRARY-ERROR : Unable to load any of the alternatives: ("libglfw.so.3.0" "libglfw.so.3")
(LOAD cl-glfw3-examples FAIL) needs newer ASDF, ASDF:LOAD-SYSTEM-DEFINITION-ERROR : Error while trying to load definition for system trivial-main-thread from pathname /home/testgrid/cl-test-grid/work-dir/agent/quicklisp/dists/quicklisp/software/trivial-main-thread-20150709-git/trivial-main-thread.asd: :HOMEPAGE is an invalid initarg to REINITIALIZE-INSTANCE for #<STANDARD-CLASS ASDF:SYSTEM>. Valid initargs: (:NAME :VERSION :DESCRIPTION :LONG-DESCRIPTION :IN-ORDER-TO :DO-FIRST :PARENT :PATHNAME :AROUND-COMPILE :ENCODING :PROPERTIES :COMPONENTS :IF-COMPONENT-DEP-FAILS :DEFAULT-COMPONENT-CLASS :AUTHOR :MAINTAINER :LICENCE :LICENSE :SOURCE-FILE :DEFSYSTEM-DEPENDS-ON).
(LOAD cl-glfw3 FAIL) ffi, CFFI:LOAD-FOREIGN-LIBRARY-ERROR : Unable to load any of the alternatives: ("libglfw.so.3.0" "libglfw.so.3")
ccl-1.8-r15286m-f97-linux-arm
(LOAD cl-glfw3-examples FAIL) needs newer ASDF, ASDF:LOAD-SYSTEM-DEFINITION-ERROR : Error while trying to load definition for system trivial-main-thread from pathname /home/testgrid/cl-test-grid/work-dir/agent/quicklisp/dists/quicklisp/software/trivial-main-thread-20150709-git/trivial-main-thread.asd: :HOMEPAGE is an invalid initarg to REINITIALIZE-INSTANCE for #<STANDARD-CLASS ASDF:SYSTEM>. Valid initargs: (:NAME :VERSION :DESCRIPTION :LONG-DESCRIPTION :IN-ORDER-TO :DO-FIRST :PARENT :PATHNAME :AROUND-COMPILE :ENCODING :PROPERTIES :COMPONENTS :IF-COMPONENT-DEP-FAILS :DEFAULT-COMPONENT-CLASS :AUTHOR :MAINTAINER :LICENCE :LICENSE :SOURCE-FILE :DEFSYSTEM-DEPENDS-ON).
(LOAD cl-glfw3 FAIL) ffi-grovel, CFFI-GROVEL:GROVEL-ERROR : External process exited with code 1. Command was: "cc" "-marm" "-I/home/testgrid/cl-test-grid/work-dir/agent/quicklisp/dists/quicklisp/software/cffi_0.16.1/" "-o" "/home/testgrid/cl-test-grid/work-dir/agent/test-runs/20151224014118-ccl-1.8-r15286m-f97-linux-arm/fasl/ql/dists/quicklisp/software/cffi_0.16.1/libffi/libffi-unix" "/home/testgrid/cl-test-grid/work-dir/agent/test-runs/20151224014118-ccl-1.8-r15286m-f97-linux-arm/fasl/ql/dists/quicklisp/software/cffi_0.16.1/libffi/libffi-unix.c" Output was: /home/testgrid/cl-test-grid/work-dir/agent/test-runs/20151224014118-ccl-1.8-r15286m-f97-linux-arm/fasl/ql/dists/quicklisp/software/cffi_0.16.1/libffi/libffi-unix.c: In function ‘main’: /home/testgrid/cl-test-grid/work-dir/agent/test-runs/20151224014118-ccl-1.8-r15286m-f97-linux-arm/fasl/ql/dists/quicklisp/software/cffi_0.16.1/libffi/libffi-unix.c:82:41: error: ‘FFI_UNIX64’ undeclared (first use in this function) fprintf(output, "%"PRIiMAX, (intmax_t)FFI_UNIX64); ^ /home/testgrid/cl-test-grid/work-dir/agent/test-runs/20151224014118-ccl-1.8-r15286m-f97-linux-arm/fasl/ql/dists/quicklisp/software/cffi_0.16.1/libffi/libffi-unix.c:82:41: note: each undeclared identifier is reported only once for each function it appears in In file included from /usr/include/string.h:32:0, from /home/testgrid/cl-test-grid/work-dir/agent/quicklisp/dists/quicklisp/software/cffi_0.16.1/grovel/common.h:4, from /home/testgrid/cl-test-grid/work-dir/agent/test-runs/20151224014118-ccl-1.8-r15286m-f97-linux-arm/fasl/ql/dists/quicklisp/software/cffi_0.16.1/libffi/libffi-unix.c:9: /home/testgrid/cl-test-grid/work-dir/agent/test-runs/20151224014118-ccl-1.8-r15286m-f97-linux-arm/fasl/ql/dists/quicklisp/software/cffi_0.16.1/libffi/libffi-unix.c:146:52: warning: format ‘%li’ expects argument of type ‘long int’, but argument 3 has type ‘unsigned int’ [-Wformat=] fprintf(output, " :offset %li)", offsetof(struct _ffi_type, size)); ^ /home/testgrid/cl-test-grid/work-dir/agent/test-runs/20151224014118-ccl-1.8-r15286m-f97-linux-arm/fasl/ql/dists/quicklisp/software/cffi_0.16.1/libffi/libffi-unix.c:151:52: warning: format ‘%li’ expects argument of type ‘long int’, but argument 3 has type ‘unsigned int’ [-Wformat=] fprintf(output, " :offset %li)", offsetof(struct _ffi_type, alignment)); ^ /home/testgrid/cl-test-grid/work-dir/agent/test-runs/20151224014118-ccl-1.8-r15286m-f97-linux-arm/fasl/ql/dists/quicklisp/software/cffi_0.16.1/libffi/libffi-unix.c:156:52: warning: format ‘%li’ expects argument of type ‘long int’, but argument 3 has type ‘unsigned int’ [-Wformat=] fprintf(output, " :offset %li)", offsetof(struct _ffi_type, type)); ^ /home/testgrid/cl-test-grid/work-dir/agent/test-runs/20151224014118-ccl-1.8-r15286m-f97-linux-arm/fasl/ql/dists/quicklisp/software/cffi_0.16.1/libffi/libffi-unix.c:161:52: warning: format ‘%li’ expects argument of type ‘long int’, but argument 3 has type ‘unsigned int’ [-Wformat=] fprintf(output, " :offset %li)", offsetof(struct _ffi_type, elements)); ^
(LOAD cl-glfw3-examples FAIL) needs newer ASDF, ASDF:LOAD-SYSTEM-DEFINITION-ERROR : Error while trying to load definition for system trivial-main-thread from pathname /home/testgrid/cl-test-grid/work-dir/agent/quicklisp/dists/quicklisp/software/trivial-main-thread-20150709-git/trivial-main-thread.asd: :HOMEPAGE is an invalid initarg to REINITIALIZE-INSTANCE for #<STANDARD-CLASS ASDF:SYSTEM>. Valid initargs: (:NAME :VERSION :DESCRIPTION :LONG-DESCRIPTION :IN-ORDER-TO :DO-FIRST :PARENT :PATHNAME :AROUND-COMPILE :ENCODING :PROPERTIES :COMPONENTS :IF-COMPONENT-DEP-FAILS :DEFAULT-COMPONENT-CLASS :AUTHOR :MAINTAINER :LICENCE :LICENSE :SOURCE-FILE :DEFSYSTEM-DEPENDS-ON).
(LOAD cl-glfw3 FAIL) ffi-grovel, CFFI-GROVEL:GROVEL-ERROR : External process exited with code 1. Command was: "cc" "-marm" "-I/home/testgrid/cl-test-grid/work-dir/agent/quicklisp/dists/quicklisp/software/cffi_0.16.1/" "-o" "/home/testgrid/cl-test-grid/work-dir/agent/test-runs/20151223021134-ccl-1.8-r15286m-f97-linux-arm/fasl/ql/dists/quicklisp/software/cffi_0.16.1/libffi/libffi-unix" "/home/testgrid/cl-test-grid/work-dir/agent/test-runs/20151223021134-ccl-1.8-r15286m-f97-linux-arm/fasl/ql/dists/quicklisp/software/cffi_0.16.1/libffi/libffi-unix.c" Output was: /home/testgrid/cl-test-grid/work-dir/agent/test-runs/20151223021134-ccl-1.8-r15286m-f97-linux-arm/fasl/ql/dists/quicklisp/software/cffi_0.16.1/libffi/libffi-unix.c: In function ‘main’: /home/testgrid/cl-test-grid/work-dir/agent/test-runs/20151223021134-ccl-1.8-r15286m-f97-linux-arm/fasl/ql/dists/quicklisp/software/cffi_0.16.1/libffi/libffi-unix.c:82:41: error: ‘FFI_UNIX64’ undeclared (first use in this function) fprintf(output, "%"PRIiMAX, (intmax_t)FFI_UNIX64); ^ /home/testgrid/cl-test-grid/work-dir/agent/test-runs/20151223021134-ccl-1.8-r15286m-f97-linux-arm/fasl/ql/dists/quicklisp/software/cffi_0.16.1/libffi/libffi-unix.c:82:41: note: each undeclared identifier is reported only once for each function it appears in In file included from /usr/include/string.h:32:0, from /home/testgrid/cl-test-grid/work-dir/agent/quicklisp/dists/quicklisp/software/cffi_0.16.1/grovel/common.h:4, from /home/testgrid/cl-test-grid/work-dir/agent/test-runs/20151223021134-ccl-1.8-r15286m-f97-linux-arm/fasl/ql/dists/quicklisp/software/cffi_0.16.1/libffi/libffi-unix.c:9: /home/testgrid/cl-test-grid/work-dir/agent/test-runs/20151223021134-ccl-1.8-r15286m-f97-linux-arm/fasl/ql/dists/quicklisp/software/cffi_0.16.1/libffi/libffi-unix.c:146:52: warning: format ‘%li’ expects argument of type ‘long int’, but argument 3 has type ‘unsigned int’ [-Wformat=] fprintf(output, " :offset %li)", offsetof(struct _ffi_type, size)); ^ /home/testgrid/cl-test-grid/work-dir/agent/test-runs/20151223021134-ccl-1.8-r15286m-f97-linux-arm/fasl/ql/dists/quicklisp/software/cffi_0.16.1/libffi/libffi-unix.c:151:52: warning: format ‘%li’ expects argument of type ‘long int’, but argument 3 has type ‘unsigned int’ [-Wformat=] fprintf(output, " :offset %li)", offsetof(struct _ffi_type, alignment)); ^ /home/testgrid/cl-test-grid/work-dir/agent/test-runs/20151223021134-ccl-1.8-r15286m-f97-linux-arm/fasl/ql/dists/quicklisp/software/cffi_0.16.1/libffi/libffi-unix.c:156:52: warning: format ‘%li’ expects argument of type ‘long int’, but argument 3 has type ‘unsigned int’ [-Wformat=] fprintf(output, " :offset %li)", offsetof(struct _ffi_type, type)); ^ /home/testgrid/cl-test-grid/work-dir/agent/test-runs/20151223021134-ccl-1.8-r15286m-f97-linux-arm/fasl/ql/dists/quicklisp/software/cffi_0.16.1/libffi/libffi-unix.c:161:52: warning: format ‘%li’ expects argument of type ‘long int’, but argument 3 has type ‘unsigned int’ [-Wformat=] fprintf(output, " :offset %li)", offsetof(struct _ffi_type, elements)); ^
(LOAD cl-glfw3-examples FAIL) needs newer ASDF, ASDF:LOAD-SYSTEM-DEFINITION-ERROR : Error while trying to load definition for system trivial-main-thread from pathname /home/testgrid/cl-test-grid/work-dir/agent/quicklisp/dists/quicklisp/software/trivial-main-thread-20150709-git/trivial-main-thread.asd: :HOMEPAGE is an invalid initarg to REINITIALIZE-INSTANCE for #<STANDARD-CLASS ASDF:SYSTEM>. Valid initargs: (:NAME :VERSION :DESCRIPTION :LONG-DESCRIPTION :IN-ORDER-TO :DO-FIRST :PARENT :PATHNAME :AROUND-COMPILE :ENCODING :PROPERTIES :COMPONENTS :IF-COMPONENT-DEP-FAILS :DEFAULT-COMPONENT-CLASS :AUTHOR :MAINTAINER :LICENCE :LICENSE :SOURCE-FILE :DEFSYSTEM-DEPENDS-ON).
(LOAD cl-glfw3 FAIL) ffi-grovel, CFFI-GROVEL:GROVEL-ERROR : External process exited with code 1. Command was: "cc" "-marm" "-I/home/testgrid/cl-test-grid/work-dir/agent/quicklisp/dists/quicklisp/software/cffi_0.16.1/" "-o" "/home/testgrid/cl-test-grid/work-dir/agent/test-runs/20151223021134-ccl-1.8-r15286m-f97-linux-arm/fasl/ql/dists/quicklisp/software/cffi_0.16.1/libffi/libffi-unix" "/home/testgrid/cl-test-grid/work-dir/agent/test-runs/20151223021134-ccl-1.8-r15286m-f97-linux-arm/fasl/ql/dists/quicklisp/software/cffi_0.16.1/libffi/libffi-unix.c" Output was: /home/testgrid/cl-test-grid/work-dir/agent/test-runs/20151223021134-ccl-1.8-r15286m-f97-linux-arm/fasl/ql/dists/quicklisp/software/cffi_0.16.1/libffi/libffi-unix.c: In function ‘main’: /home/testgrid/cl-test-grid/work-dir/agent/test-runs/20151223021134-ccl-1.8-r15286m-f97-linux-arm/fasl/ql/dists/quicklisp/software/cffi_0.16.1/libffi/libffi-unix.c:82:41: error: ‘FFI_UNIX64’ undeclared (first use in this function) fprintf(output, "%"PRIiMAX, (intmax_t)FFI_UNIX64); ^ /home/testgrid/cl-test-grid/work-dir/agent/test-runs/20151223021134-ccl-1.8-r15286m-f97-linux-arm/fasl/ql/dists/quicklisp/software/cffi_0.16.1/libffi/libffi-unix.c:82:41: note: each undeclared identifier is reported only once for each function it appears in In file included from /usr/include/string.h:32:0, from /home/testgrid/cl-test-grid/work-dir/agent/quicklisp/dists/quicklisp/software/cffi_0.16.1/grovel/common.h:4, from /home/testgrid/cl-test-grid/work-dir/agent/test-runs/20151223021134-ccl-1.8-r15286m-f97-linux-arm/fasl/ql/dists/quicklisp/software/cffi_0.16.1/libffi/libffi-unix.c:9: /home/testgrid/cl-test-grid/work-dir/agent/test-runs/20151223021134-ccl-1.8-r15286m-f97-linux-arm/fasl/ql/dists/quicklisp/software/cffi_0.16.1/libffi/libffi-unix.c:146:52: warning: format ‘%li’ expects argument of type ‘long int’, but argument 3 has type ‘unsigned int’ [-Wformat=] fprintf(output, " :offset %li)", offsetof(struct _ffi_type, size)); ^ /home/testgrid/cl-test-grid/work-dir/agent/test-runs/20151223021134-ccl-1.8-r15286m-f97-linux-arm/fasl/ql/dists/quicklisp/software/cffi_0.16.1/libffi/libffi-unix.c:151:52: warning: format ‘%li’ expects argument of type ‘long int’, but argument 3 has type ‘unsigned int’ [-Wformat=] fprintf(output, " :offset %li)", offsetof(struct _ffi_type, alignment)); ^ /home/testgrid/cl-test-grid/work-dir/agent/test-runs/20151223021134-ccl-1.8-r15286m-f97-linux-arm/fasl/ql/dists/quicklisp/software/cffi_0.16.1/libffi/libffi-unix.c:156:52: warning: format ‘%li’ expects argument of type ‘long int’, but argument 3 has type ‘unsigned int’ [-Wformat=] fprintf(output, " :offset %li)", offsetof(struct _ffi_type, type)); ^ /home/testgrid/cl-test-grid/work-dir/agent/test-runs/20151223021134-ccl-1.8-r15286m-f97-linux-arm/fasl/ql/dists/quicklisp/software/cffi_0.16.1/libffi/libffi-unix.c:161:52: warning: format ‘%li’ expects argument of type ‘long int’, but argument 3 has type ‘unsigned int’ [-Wformat=] fprintf(output, " :offset %li)", offsetof(struct _ffi_type, elements)); ^
(LOAD cl-glfw3-examples FAIL) needs newer ASDF, ASDF:LOAD-SYSTEM-DEFINITION-ERROR : Error while trying to load definition for system trivial-main-thread from pathname /home/testgrid/cl-test-grid/work-dir/agent/quicklisp/dists/quicklisp/software/trivial-main-thread-20150709-git/trivial-main-thread.asd: :HOMEPAGE is an invalid initarg to REINITIALIZE-INSTANCE for #<STANDARD-CLASS ASDF:SYSTEM>. Valid initargs: (:NAME :VERSION :DESCRIPTION :LONG-DESCRIPTION :IN-ORDER-TO :DO-FIRST :PARENT :PATHNAME :AROUND-COMPILE :ENCODING :PROPERTIES :COMPONENTS :IF-COMPONENT-DEP-FAILS :DEFAULT-COMPONENT-CLASS :AUTHOR :MAINTAINER :LICENCE :LICENSE :SOURCE-FILE :DEFSYSTEM-DEPENDS-ON).
(LOAD cl-glfw3 FAIL) ffi-grovel, CFFI-GROVEL:GROVEL-ERROR : External process exited with code 1. Command was: "cc" "-marm" "-I/home/testgrid/cl-test-grid/work-dir/agent/quicklisp/dists/quicklisp/software/cffi_0.16.1/" "-o" "/home/testgrid/cl-test-grid/work-dir/agent/test-runs/20151105072100-ccl-1.8-r15286m-f97-linux-arm/fasl/ql/dists/quicklisp/software/cffi_0.16.1/libffi/libffi-unix" "/home/testgrid/cl-test-grid/work-dir/agent/test-runs/20151105072100-ccl-1.8-r15286m-f97-linux-arm/fasl/ql/dists/quicklisp/software/cffi_0.16.1/libffi/libffi-unix.c" Output was: /home/testgrid/cl-test-grid/work-dir/agent/test-runs/20151105072100-ccl-1.8-r15286m-f97-linux-arm/fasl/ql/dists/quicklisp/software/cffi_0.16.1/libffi/libffi-unix.c: In function ‘main’: /home/testgrid/cl-test-grid/work-dir/agent/test-runs/20151105072100-ccl-1.8-r15286m-f97-linux-arm/fasl/ql/dists/quicklisp/software/cffi_0.16.1/libffi/libffi-unix.c:82:41: error: ‘FFI_UNIX64’ undeclared (first use in this function) fprintf(output, "%"PRIiMAX, (intmax_t)FFI_UNIX64); ^ /home/testgrid/cl-test-grid/work-dir/agent/test-runs/20151105072100-ccl-1.8-r15286m-f97-linux-arm/fasl/ql/dists/quicklisp/software/cffi_0.16.1/libffi/libffi-unix.c:82:41: note: each undeclared identifier is reported only once for each function it appears in In file included from /usr/include/string.h:32:0, from /home/testgrid/cl-test-grid/work-dir/agent/quicklisp/dists/quicklisp/software/cffi_0.16.1/grovel/common.h:4, from /home/testgrid/cl-test-grid/work-dir/agent/test-runs/20151105072100-ccl-1.8-r15286m-f97-linux-arm/fasl/ql/dists/quicklisp/software/cffi_0.16.1/libffi/libffi-unix.c:9: /home/testgrid/cl-test-grid/work-dir/agent/test-runs/20151105072100-ccl-1.8-r15286m-f97-linux-arm/fasl/ql/dists/quicklisp/software/cffi_0.16.1/libffi/libffi-unix.c:146:52: warning: format ‘%li’ expects argument of type ‘long int’, but argument 3 has type ‘unsigned int’ [-Wformat=] fprintf(output, " :offset %li)", offsetof(struct _ffi_type, size)); ^ /home/testgrid/cl-test-grid/work-dir/agent/test-runs/20151105072100-ccl-1.8-r15286m-f97-linux-arm/fasl/ql/dists/quicklisp/software/cffi_0.16.1/libffi/libffi-unix.c:151:52: warning: format ‘%li’ expects argument of type ‘long int’, but argument 3 has type ‘unsigned int’ [-Wformat=] fprintf(output, " :offset %li)", offsetof(struct _ffi_type, alignment)); ^ /home/testgrid/cl-test-grid/work-dir/agent/test-runs/20151105072100-ccl-1.8-r15286m-f97-linux-arm/fasl/ql/dists/quicklisp/software/cffi_0.16.1/libffi/libffi-unix.c:156:52: warning: format ‘%li’ expects argument of type ‘long int’, but argument 3 has type ‘unsigned int’ [-Wformat=] fprintf(output, " :offset %li)", offsetof(struct _ffi_type, type)); ^ /home/testgrid/cl-test-grid/work-dir/agent/test-runs/20151105072100-ccl-1.8-r15286m-f97-linux-arm/fasl/ql/dists/quicklisp/software/cffi_0.16.1/libffi/libffi-unix.c:161:52: warning: format ‘%li’ expects argument of type ‘long int’, but argument 3 has type ‘unsigned int’ [-Wformat=] fprintf(output, " :offset %li)", offsetof(struct _ffi_type, elements)); ^
ccl-1.9-r15756-f96-linux-x86
(LOAD cl-glfw3-examples FAIL) ffi, CFFI:LOAD-FOREIGN-LIBRARY-ERROR : Unable to load any of the alternatives: ("libglfw.so.3.0" "libglfw.so.3")
(LOAD cl-glfw3 FAIL) ffi, CFFI:LOAD-FOREIGN-LIBRARY-ERROR : Unable to load any of the alternatives: ("libglfw.so.3.0" "libglfw.so.3")
(LOAD cl-glfw3-examples FAIL) ffi, CFFI:LOAD-FOREIGN-LIBRARY-ERROR : Unable to load any of the alternatives: ("libglfw.so.3.0" "libglfw.so.3")
(LOAD cl-glfw3 FAIL) ffi, CFFI:LOAD-FOREIGN-LIBRARY-ERROR : Unable to load any of the alternatives: ("libglfw.so.3.0" "libglfw.so.3")
ccl-1.9-r15767-f99-linux-arm
(LOAD cl-glfw3-examples FAIL) ffi-grovel, CFFI-GROVEL:GROVEL-ERROR : External process exited with code 1. Command was: "cc" "-marm" "-I/home/testgrid/cl-test-grid/work-dir/agent/quicklisp/dists/quicklisp/software/cffi_0.16.1/" "-o" "/home/testgrid/cl-test-grid/work-dir/agent/test-runs/20151222132702-ccl-1.9-r15767-f99-linux-arm/fasl/ql/dists/quicklisp/software/cffi_0.16.1/libffi/libffi-unix" "/home/testgrid/cl-test-grid/work-dir/agent/test-runs/20151222132702-ccl-1.9-r15767-f99-linux-arm/fasl/ql/dists/quicklisp/software/cffi_0.16.1/libffi/libffi-unix.c" Output was: /home/testgrid/cl-test-grid/work-dir/agent/test-runs/20151222132702-ccl-1.9-r15767-f99-linux-arm/fasl/ql/dists/quicklisp/software/cffi_0.16.1/libffi/libffi-unix.c: In function ‘main’: /home/testgrid/cl-test-grid/work-dir/agent/test-runs/20151222132702-ccl-1.9-r15767-f99-linux-arm/fasl/ql/dists/quicklisp/software/cffi_0.16.1/libffi/libffi-unix.c:82:41: error: ‘FFI_UNIX64’ undeclared (first use in this function) fprintf(output, "%"PRIiMAX, (intmax_t)FFI_UNIX64); ^ /home/testgrid/cl-test-grid/work-dir/agent/test-runs/20151222132702-ccl-1.9-r15767-f99-linux-arm/fasl/ql/dists/quicklisp/software/cffi_0.16.1/libffi/libffi-unix.c:82:41: note: each undeclared identifier is reported only once for each function it appears in In file included from /usr/include/string.h:32:0, from /home/testgrid/cl-test-grid/work-dir/agent/quicklisp/dists/quicklisp/software/cffi_0.16.1/grovel/common.h:4, from /home/testgrid/cl-test-grid/work-dir/agent/test-runs/20151222132702-ccl-1.9-r15767-f99-linux-arm/fasl/ql/dists/quicklisp/software/cffi_0.16.1/libffi/libffi-unix.c:9: /home/testgrid/cl-test-grid/work-dir/agent/test-runs/20151222132702-ccl-1.9-r15767-f99-linux-arm/fasl/ql/dists/quicklisp/software/cffi_0.16.1/libffi/libffi-unix.c:146:52: warning: format ‘%li’ expects argument of type ‘long int’, but argument 3 has type ‘unsigned int’ [-Wformat=] fprintf(output, " :offset %li)", offsetof(struct _ffi_type, size)); ^ /home/testgrid/cl-test-grid/work-dir/agent/test-runs/20151222132702-ccl-1.9-r15767-f99-linux-arm/fasl/ql/dists/quicklisp/software/cffi_0.16.1/libffi/libffi-unix.c:151:52: warning: format ‘%li’ expects argument of type ‘long int’, but argument 3 has type ‘unsigned int’ [-Wformat=] fprintf(output, " :offset %li)", offsetof(struct _ffi_type, alignment)); ^ /home/testgrid/cl-test-grid/work-dir/agent/test-runs/20151222132702-ccl-1.9-r15767-f99-linux-arm/fasl/ql/dists/quicklisp/software/cffi_0.16.1/libffi/libffi-unix.c:156:52: warning: format ‘%li’ expects argument of type ‘long int’, but argument 3 has type ‘unsigned int’ [-Wformat=] fprintf(output, " :offset %li)", offsetof(struct _ffi_type, type)); ^ /home/testgrid/cl-test-grid/work-dir/agent/test-runs/20151222132702-ccl-1.9-r15767-f99-linux-arm/fasl/ql/dists/quicklisp/software/cffi_0.16.1/libffi/libffi-unix.c:161:52: warning: format ‘%li’ expects argument of type ‘long int’, but argument 3 has type ‘unsigned int’ [-Wformat=] fprintf(output, " :offset %li)", offsetof(struct _ffi_type, elements)); ^
(LOAD cl-glfw3 FAIL) ffi-grovel, CFFI-GROVEL:GROVEL-ERROR : External process exited with code 1. Command was: "cc" "-marm" "-I/home/testgrid/cl-test-grid/work-dir/agent/quicklisp/dists/quicklisp/software/cffi_0.16.1/" "-o" "/home/testgrid/cl-test-grid/work-dir/agent/test-runs/20151222132702-ccl-1.9-r15767-f99-linux-arm/fasl/ql/dists/quicklisp/software/cffi_0.16.1/libffi/libffi-unix" "/home/testgrid/cl-test-grid/work-dir/agent/test-runs/20151222132702-ccl-1.9-r15767-f99-linux-arm/fasl/ql/dists/quicklisp/software/cffi_0.16.1/libffi/libffi-unix.c" Output was: /home/testgrid/cl-test-grid/work-dir/agent/test-runs/20151222132702-ccl-1.9-r15767-f99-linux-arm/fasl/ql/dists/quicklisp/software/cffi_0.16.1/libffi/libffi-unix.c: In function ‘main’: /home/testgrid/cl-test-grid/work-dir/agent/test-runs/20151222132702-ccl-1.9-r15767-f99-linux-arm/fasl/ql/dists/quicklisp/software/cffi_0.16.1/libffi/libffi-unix.c:82:41: error: ‘FFI_UNIX64’ undeclared (first use in this function) fprintf(output, "%"PRIiMAX, (intmax_t)FFI_UNIX64); ^ /home/testgrid/cl-test-grid/work-dir/agent/test-runs/20151222132702-ccl-1.9-r15767-f99-linux-arm/fasl/ql/dists/quicklisp/software/cffi_0.16.1/libffi/libffi-unix.c:82:41: note: each undeclared identifier is reported only once for each function it appears in In file included from /usr/include/string.h:32:0, from /home/testgrid/cl-test-grid/work-dir/agent/quicklisp/dists/quicklisp/software/cffi_0.16.1/grovel/common.h:4, from /home/testgrid/cl-test-grid/work-dir/agent/test-runs/20151222132702-ccl-1.9-r15767-f99-linux-arm/fasl/ql/dists/quicklisp/software/cffi_0.16.1/libffi/libffi-unix.c:9: /home/testgrid/cl-test-grid/work-dir/agent/test-runs/20151222132702-ccl-1.9-r15767-f99-linux-arm/fasl/ql/dists/quicklisp/software/cffi_0.16.1/libffi/libffi-unix.c:146:52: warning: format ‘%li’ expects argument of type ‘long int’, but argument 3 has type ‘unsigned int’ [-Wformat=] fprintf(output, " :offset %li)", offsetof(struct _ffi_type, size)); ^ /home/testgrid/cl-test-grid/work-dir/agent/test-runs/20151222132702-ccl-1.9-r15767-f99-linux-arm/fasl/ql/dists/quicklisp/software/cffi_0.16.1/libffi/libffi-unix.c:151:52: warning: format ‘%li’ expects argument of type ‘long int’, but argument 3 has type ‘unsigned int’ [-Wformat=] fprintf(output, " :offset %li)", offsetof(struct _ffi_type, alignment)); ^ /home/testgrid/cl-test-grid/work-dir/agent/test-runs/20151222132702-ccl-1.9-r15767-f99-linux-arm/fasl/ql/dists/quicklisp/software/cffi_0.16.1/libffi/libffi-unix.c:156:52: warning: format ‘%li’ expects argument of type ‘long int’, but argument 3 has type ‘unsigned int’ [-Wformat=] fprintf(output, " :offset %li)", offsetof(struct _ffi_type, type)); ^ /home/testgrid/cl-test-grid/work-dir/agent/test-runs/20151222132702-ccl-1.9-r15767-f99-linux-arm/fasl/ql/dists/quicklisp/software/cffi_0.16.1/libffi/libffi-unix.c:161:52: warning: format ‘%li’ expects argument of type ‘long int’, but argument 3 has type ‘unsigned int’ [-Wformat=] fprintf(output, " :offset %li)", offsetof(struct _ffi_type, elements)); ^
(LOAD cl-glfw3-examples FAIL) ffi-grovel, CFFI-GROVEL:GROVEL-ERROR : External process exited with code 1. Command was: "cc" "-marm" "-I/home/testgrid/cl-test-grid/work-dir/agent/quicklisp/dists/quicklisp/software/cffi_0.16.1/" "-o" "/home/testgrid/cl-test-grid/work-dir/agent/test-runs/20151104185430-ccl-1.9-r15767-f99-linux-arm/fasl/ql/dists/quicklisp/software/cffi_0.16.1/libffi/libffi-unix" "/home/testgrid/cl-test-grid/work-dir/agent/test-runs/20151104185430-ccl-1.9-r15767-f99-linux-arm/fasl/ql/dists/quicklisp/software/cffi_0.16.1/libffi/libffi-unix.c" Output was: /home/testgrid/cl-test-grid/work-dir/agent/test-runs/20151104185430-ccl-1.9-r15767-f99-linux-arm/fasl/ql/dists/quicklisp/software/cffi_0.16.1/libffi/libffi-unix.c: In function ‘main’: /home/testgrid/cl-test-grid/work-dir/agent/test-runs/20151104185430-ccl-1.9-r15767-f99-linux-arm/fasl/ql/dists/quicklisp/software/cffi_0.16.1/libffi/libffi-unix.c:82:41: error: ‘FFI_UNIX64’ undeclared (first use in this function) fprintf(output, "%"PRIiMAX, (intmax_t)FFI_UNIX64); ^ /home/testgrid/cl-test-grid/work-dir/agent/test-runs/20151104185430-ccl-1.9-r15767-f99-linux-arm/fasl/ql/dists/quicklisp/software/cffi_0.16.1/libffi/libffi-unix.c:82:41: note: each undeclared identifier is reported only once for each function it appears in In file included from /usr/include/string.h:32:0, from /home/testgrid/cl-test-grid/work-dir/agent/quicklisp/dists/quicklisp/software/cffi_0.16.1/grovel/common.h:4, from /home/testgrid/cl-test-grid/work-dir/agent/test-runs/20151104185430-ccl-1.9-r15767-f99-linux-arm/fasl/ql/dists/quicklisp/software/cffi_0.16.1/libffi/libffi-unix.c:9: /home/testgrid/cl-test-grid/work-dir/agent/test-runs/20151104185430-ccl-1.9-r15767-f99-linux-arm/fasl/ql/dists/quicklisp/software/cffi_0.16.1/libffi/libffi-unix.c:146:52: warning: format ‘%li’ expects argument of type ‘long int’, but argument 3 has type ‘unsigned int’ [-Wformat=] fprintf(output, " :offset %li)", offsetof(struct _ffi_type, size)); ^ /home/testgrid/cl-test-grid/work-dir/agent/test-runs/20151104185430-ccl-1.9-r15767-f99-linux-arm/fasl/ql/dists/quicklisp/software/cffi_0.16.1/libffi/libffi-unix.c:151:52: warning: format ‘%li’ expects argument of type ‘long int’, but argument 3 has type ‘unsigned int’ [-Wformat=] fprintf(output, " :offset %li)", offsetof(struct _ffi_type, alignment)); ^ /home/testgrid/cl-test-grid/work-dir/agent/test-runs/20151104185430-ccl-1.9-r15767-f99-linux-arm/fasl/ql/dists/quicklisp/software/cffi_0.16.1/libffi/libffi-unix.c:156:52: warning: format ‘%li’ expects argument of type ‘long int’, but argument 3 has type ‘unsigned int’ [-Wformat=] fprintf(output, " :offset %li)", offsetof(struct _ffi_type, type)); ^ /home/testgrid/cl-test-grid/work-dir/agent/test-runs/20151104185430-ccl-1.9-r15767-f99-linux-arm/fasl/ql/dists/quicklisp/software/cffi_0.16.1/libffi/libffi-unix.c:161:52: warning: format ‘%li’ expects argument of type ‘long int’, but argument 3 has type ‘unsigned int’ [-Wformat=] fprintf(output, " :offset %li)", offsetof(struct _ffi_type, elements)); ^
(LOAD cl-glfw3 FAIL) ffi-grovel, CFFI-GROVEL:GROVEL-ERROR : External process exited with code 1. Command was: "cc" "-marm" "-I/home/testgrid/cl-test-grid/work-dir/agent/quicklisp/dists/quicklisp/software/cffi_0.16.1/" "-o" "/home/testgrid/cl-test-grid/work-dir/agent/test-runs/20151104185430-ccl-1.9-r15767-f99-linux-arm/fasl/ql/dists/quicklisp/software/cffi_0.16.1/libffi/libffi-unix" "/home/testgrid/cl-test-grid/work-dir/agent/test-runs/20151104185430-ccl-1.9-r15767-f99-linux-arm/fasl/ql/dists/quicklisp/software/cffi_0.16.1/libffi/libffi-unix.c" Output was: /home/testgrid/cl-test-grid/work-dir/agent/test-runs/20151104185430-ccl-1.9-r15767-f99-linux-arm/fasl/ql/dists/quicklisp/software/cffi_0.16.1/libffi/libffi-unix.c: In function ‘main’: /home/testgrid/cl-test-grid/work-dir/agent/test-runs/20151104185430-ccl-1.9-r15767-f99-linux-arm/fasl/ql/dists/quicklisp/software/cffi_0.16.1/libffi/libffi-unix.c:82:41: error: ‘FFI_UNIX64’ undeclared (first use in this function) fprintf(output, "%"PRIiMAX, (intmax_t)FFI_UNIX64); ^ /home/testgrid/cl-test-grid/work-dir/agent/test-runs/20151104185430-ccl-1.9-r15767-f99-linux-arm/fasl/ql/dists/quicklisp/software/cffi_0.16.1/libffi/libffi-unix.c:82:41: note: each undeclared identifier is reported only once for each function it appears in In file included from /usr/include/string.h:32:0, from /home/testgrid/cl-test-grid/work-dir/agent/quicklisp/dists/quicklisp/software/cffi_0.16.1/grovel/common.h:4, from /home/testgrid/cl-test-grid/work-dir/agent/test-runs/20151104185430-ccl-1.9-r15767-f99-linux-arm/fasl/ql/dists/quicklisp/software/cffi_0.16.1/libffi/libffi-unix.c:9: /home/testgrid/cl-test-grid/work-dir/agent/test-runs/20151104185430-ccl-1.9-r15767-f99-linux-arm/fasl/ql/dists/quicklisp/software/cffi_0.16.1/libffi/libffi-unix.c:146:52: warning: format ‘%li’ expects argument of type ‘long int’, but argument 3 has type ‘unsigned int’ [-Wformat=] fprintf(output, " :offset %li)", offsetof(struct _ffi_type, size)); ^ /home/testgrid/cl-test-grid/work-dir/agent/test-runs/20151104185430-ccl-1.9-r15767-f99-linux-arm/fasl/ql/dists/quicklisp/software/cffi_0.16.1/libffi/libffi-unix.c:151:52: warning: format ‘%li’ expects argument of type ‘long int’, but argument 3 has type ‘unsigned int’ [-Wformat=] fprintf(output, " :offset %li)", offsetof(struct _ffi_type, alignment)); ^ /home/testgrid/cl-test-grid/work-dir/agent/test-runs/20151104185430-ccl-1.9-r15767-f99-linux-arm/fasl/ql/dists/quicklisp/software/cffi_0.16.1/libffi/libffi-unix.c:156:52: warning: format ‘%li’ expects argument of type ‘long int’, but argument 3 has type ‘unsigned int’ [-Wformat=] fprintf(output, " :offset %li)", offsetof(struct _ffi_type, type)); ^ /home/testgrid/cl-test-grid/work-dir/agent/test-runs/20151104185430-ccl-1.9-r15767-f99-linux-arm/fasl/ql/dists/quicklisp/software/cffi_0.16.1/libffi/libffi-unix.c:161:52: warning: format ‘%li’ expects argument of type ‘long int’, but argument 3 has type ‘unsigned int’ [-Wformat=] fprintf(output, " :offset %li)", offsetof(struct _ffi_type, elements)); ^
clisp-2.49-unix-armv7l
(LOAD cl-glfw3-examples FAIL) needs newer ASDF, ASDF:LOAD-SYSTEM-DEFINITION-ERROR : Error while trying to load definition for system trivial-main-thread from pathname /home/testgrid/cl-test-grid/work-dir/agent/quicklisp/dists/quicklisp/software/trivial-main-thread-20150709-git/trivial-main-thread.asd: REINITIALIZE-INSTANCE: illegal keyword/value pair :HOMEPAGE, "https://github.com/Shinmera/trivial-main-thread" in argument list. The allowed keywords are (:NAME :VERSION :IN-ORDER-TO :DO-FIRST :PARENT :PATHNAME :AROUND-COMPILE :ENCODING :PROPERTIES :COMPONENTS :IF-COMPONENT-DEP-FAILS :DEFAULT-COMPONENT-CLASS :DESCRIPTION :LONG-DESCRIPTION :AUTHOR :MAINTAINER :LICENCE :LICENSE :SOURCE-FILE :DEFSYSTEM-DEPENDS-ON)
(LOAD cl-glfw3 FAIL) ffi-grovel, CFFI-GROVEL:GROVEL-ERROR : External process exited with code 1. Command was: "cc" "-m32" "-I/home/testgrid/cl-test-grid/work-dir/agent/quicklisp/dists/quicklisp/software/cffi_0.16.1/" "-o" "/home/testgrid/cl-test-grid/work-dir/agent/test-runs/20151225004057-clisp-2.49-unix-armv7l/fasl/ql/dists/quicklisp/software/cffi_0.16.1/libffi/libffi-unix" "/home/testgrid/cl-test-grid/work-dir/agent/test-runs/20151225004057-clisp-2.49-unix-armv7l/fasl/ql/dists/quicklisp/software/cffi_0.16.1/libffi/libffi-unix.c" Output was:
(LOAD cl-glfw3-examples FAIL) needs newer ASDF, ASDF:LOAD-SYSTEM-DEFINITION-ERROR : Error while trying to load definition for system trivial-main-thread from pathname /home/testgrid/cl-test-grid/work-dir/agent/quicklisp/dists/quicklisp/software/trivial-main-thread-20150709-git/trivial-main-thread.asd: REINITIALIZE-INSTANCE: illegal keyword/value pair :HOMEPAGE, "https://github.com/Shinmera/trivial-main-thread" in argument list. The allowed keywords are (:NAME :VERSION :IN-ORDER-TO :DO-FIRST :PARENT :PATHNAME :AROUND-COMPILE :ENCODING :PROPERTIES :COMPONENTS :IF-COMPONENT-DEP-FAILS :DEFAULT-COMPONENT-CLASS :DESCRIPTION :LONG-DESCRIPTION :AUTHOR :MAINTAINER :LICENCE :LICENSE :SOURCE-FILE :DEFSYSTEM-DEPENDS-ON)
(LOAD cl-glfw3 FAIL) ffi-grovel, CFFI-GROVEL:GROVEL-ERROR : External process exited with code 1. Command was: "cc" "-m32" "-I/home/testgrid/cl-test-grid/work-dir/agent/quicklisp/dists/quicklisp/software/cffi_0.16.1/" "-o" "/home/testgrid/cl-test-grid/work-dir/agent/test-runs/20151106062908-clisp-2.49-unix-armv7l/fasl/ql/dists/quicklisp/software/cffi_0.16.1/libffi/libffi-unix" "/home/testgrid/cl-test-grid/work-dir/agent/test-runs/20151106062908-clisp-2.49-unix-armv7l/fasl/ql/dists/quicklisp/software/cffi_0.16.1/libffi/libffi-unix.c" Output was:
clisp-2.49-unix-x86
(LOAD cl-glfw3-examples FAIL) needs newer ASDF, ASDF:LOAD-SYSTEM-DEFINITION-ERROR : Error while trying to load definition for system trivial-main-thread from pathname /home/testgrid/cl-test-grid/work-dir/agent/quicklisp/dists/quicklisp/software/trivial-main-thread-20150709-git/trivial-main-thread.asd: REINITIALIZE-INSTANCE: illegal keyword/value pair :HOMEPAGE, "https://github.com/Shinmera/trivial-main-thread" in argument list. The allowed keywords are (:NAME :VERSION :IN-ORDER-TO :DO-FIRST :PARENT :PATHNAME :AROUND-COMPILE :ENCODING :PROPERTIES :COMPONENTS :IF-COMPONENT-DEP-FAILS :DEFAULT-COMPONENT-CLASS :DESCRIPTION :LONG-DESCRIPTION :AUTHOR :MAINTAINER :LICENCE :LICENSE :SOURCE-FILE :DEFSYSTEM-DEPENDS-ON)
(LOAD cl-glfw3 FAIL) ffi, CFFI:LOAD-FOREIGN-LIBRARY-ERROR : Unable to load any of the alternatives: ("libglfw.so.3.0" "libglfw.so.3")
(LOAD cl-glfw3-examples FAIL) needs newer ASDF, ASDF:LOAD-SYSTEM-DEFINITION-ERROR : Error while trying to load definition for system trivial-main-thread from pathname /home/testgrid/cl-test-grid/work-dir/agent/quicklisp/dists/quicklisp/software/trivial-main-thread-20150709-git/trivial-main-thread.asd: REINITIALIZE-INSTANCE: illegal keyword/value pair :HOMEPAGE, "https://github.com/Shinmera/trivial-main-thread" in argument list. The allowed keywords are (:NAME :VERSION :IN-ORDER-TO :DO-FIRST :PARENT :PATHNAME :AROUND-COMPILE :ENCODING :PROPERTIES :COMPONENTS :IF-COMPONENT-DEP-FAILS :DEFAULT-COMPONENT-CLASS :DESCRIPTION :LONG-DESCRIPTION :AUTHOR :MAINTAINER :LICENCE :LICENSE :SOURCE-FILE :DEFSYSTEM-DEPENDS-ON)
(LOAD cl-glfw3 FAIL) ffi, CFFI:LOAD-FOREIGN-LIBRARY-ERROR : Unable to load any of the alternatives: ("libglfw.so.3.0" "libglfw.so.3")
cmu-snapshot-2013-04__20d_unicode_-linux-x86
(LOAD cl-glfw3-examples FAIL) ffi, CFFI:LOAD-FOREIGN-LIBRARY-ERROR : Error in function CFFI::FL-ERROR: Unable to load any of the alternatives: ("libglfw.so.3.0" "libglfw.so.3")
(LOAD cl-glfw3 FAIL) ffi, CFFI:LOAD-FOREIGN-LIBRARY-ERROR : Error in function CFFI::FL-ERROR: Unable to load any of the alternatives: ("libglfw.so.3.0" "libglfw.so.3")
(LOAD cl-glfw3-examples FAIL) ffi, CFFI:LOAD-FOREIGN-LIBRARY-ERROR : Error in function CFFI::FL-ERROR: Unable to load any of the alternatives: ("libglfw.so.3.0" "libglfw.so.3")
(LOAD cl-glfw3 FAIL) ffi, CFFI:LOAD-FOREIGN-LIBRARY-ERROR : Error in function CFFI::FL-ERROR: Unable to load any of the alternatives: ("libglfw.so.3.0" "libglfw.so.3")
cmu-snapshot-2014-01__20e_unicode_-linux-x86
(LOAD cl-glfw3-examples FAIL) ffi, CFFI:LOAD-FOREIGN-LIBRARY-ERROR : Error in function CFFI::FL-ERROR: Unable to load any of the alternatives: ("libglfw.so.3.0" "libglfw.so.3")
(LOAD cl-glfw3 FAIL) ffi, CFFI:LOAD-FOREIGN-LIBRARY-ERROR : Error in function CFFI::FL-ERROR: Unable to load any of the alternatives: ("libglfw.so.3.0" "libglfw.so.3")
(LOAD cl-glfw3-examples FAIL) ffi, CFFI:LOAD-FOREIGN-LIBRARY-ERROR : Error in function CFFI::FL-ERROR: Unable to load any of the alternatives: ("libglfw.so.3.0" "libglfw.so.3")
(LOAD cl-glfw3 FAIL) ffi, CFFI:LOAD-FOREIGN-LIBRARY-ERROR : Error in function CFFI::FL-ERROR: Unable to load any of the alternatives: ("libglfw.so.3.0" "libglfw.so.3")
cmu-snapshot-2014-05-dirty__20e_unicode_-linux-x86
(LOAD cl-glfw3-examples FAIL) ffi, CFFI:LOAD-FOREIGN-LIBRARY-ERROR : Error in function CFFI::FL-ERROR: Unable to load any of the alternatives: ("libglfw.so.3.0" "libglfw.so.3")
(LOAD cl-glfw3 FAIL) ffi, CFFI:LOAD-FOREIGN-LIBRARY-ERROR : Error in function CFFI::FL-ERROR: Unable to load any of the alternatives: ("libglfw.so.3.0" "libglfw.so.3")
(LOAD cl-glfw3-examples FAIL) ffi, CFFI:LOAD-FOREIGN-LIBRARY-ERROR : Error in function CFFI::FL-ERROR: Unable to load any of the alternatives: ("libglfw.so.3.0" "libglfw.so.3")
(LOAD cl-glfw3 FAIL) ffi, CFFI:LOAD-FOREIGN-LIBRARY-ERROR : Error in function CFFI::FL-ERROR: Unable to load any of the alternatives: ("libglfw.so.3.0" "libglfw.so.3")
cmu-snapshot-2014-12___20f_unicode_-linux-x86
(LOAD cl-glfw3-examples FAIL) ffi, CFFI:LOAD-FOREIGN-LIBRARY-ERROR : Error in function CFFI::FL-ERROR: Unable to load any of the alternatives: ("libglfw.so.3.0" "libglfw.so.3")
(LOAD cl-glfw3 FAIL) ffi, CFFI:LOAD-FOREIGN-LIBRARY-ERROR : Error in function CFFI::FL-ERROR: Unable to load any of the alternatives: ("libglfw.so.3.0" "libglfw.so.3")
(LOAD cl-glfw3-examples FAIL) ffi, CFFI:LOAD-FOREIGN-LIBRARY-ERROR : Error in function CFFI::FL-ERROR: Unable to load any of the alternatives: ("libglfw.so.3.0" "libglfw.so.3")
(LOAD cl-glfw3 FAIL) ffi, CFFI:LOAD-FOREIGN-LIBRARY-ERROR : Error in function CFFI::FL-ERROR: Unable to load any of the alternatives: ("libglfw.so.3.0" "libglfw.so.3")
ecl-13.5.1-44c86e08-macosx-x86-bytecode
(LOAD cl-glfw3-examples FAIL) ASDF/FIND-SYSTEM:LOAD-SYSTEM-DEFINITION-ERROR : Error while trying to load definition for system cffi-libffi from pathname /Users/testgrid/cl-test-grid/work-dir/agent/quicklisp/dists/quicklisp/software/cffi_0.16.1/cffi-libffi.asd: The variable C::*CC-FLAGS* is unbound.
(LOAD cl-glfw3 FAIL) ASDF/FIND-SYSTEM:LOAD-SYSTEM-DEFINITION-ERROR : Error while trying to load definition for system cffi-libffi from pathname /Users/testgrid/cl-test-grid/work-dir/agent/quicklisp/dists/quicklisp/software/cffi_0.16.1/cffi-libffi.asd: The variable C::*CC-FLAGS* is unbound.
ecl-13.5.1-44c86e08-macosx-x86-lisp-to-c
(LOAD cl-glfw3-examples FAIL) ffi, CFFI:LOAD-FOREIGN-LIBRARY-ERROR : Unable to load any of the alternatives: ("libglfw.so.3.0" "libglfw.so.3")
(LOAD cl-glfw3 FAIL) ffi, CFFI:LOAD-FOREIGN-LIBRARY-ERROR : Unable to load any of the alternatives: ("libglfw.so.3.0" "libglfw.so.3")
ecl-13.5.1-unknown-linux-i686-bytecode
(LOAD cl-glfw3-examples FAIL) ASDF/FIND-SYSTEM:LOAD-SYSTEM-DEFINITION-ERROR : Error while trying to load definition for system cffi-libffi from pathname /home/testgrid/cl-test-grid/work-dir/agent/quicklisp/dists/quicklisp/software/cffi_0.16.1/cffi-libffi.asd: The variable C::*CC-FLAGS* is unbound.
(LOAD cl-glfw3 FAIL) ASDF/FIND-SYSTEM:LOAD-SYSTEM-DEFINITION-ERROR : Error while trying to load definition for system cffi-libffi from pathname /home/testgrid/cl-test-grid/work-dir/agent/quicklisp/dists/quicklisp/software/cffi_0.16.1/cffi-libffi.asd: The variable C::*CC-FLAGS* is unbound.
(LOAD cl-glfw3-examples FAIL) ASDF/FIND-SYSTEM:LOAD-SYSTEM-DEFINITION-ERROR : Error while trying to load definition for system cffi-libffi from pathname /home/testgrid/cl-test-grid/work-dir/agent/quicklisp/dists/quicklisp/software/cffi_0.16.1/cffi-libffi.asd: The variable C::*CC-FLAGS* is unbound.
(LOAD cl-glfw3 FAIL) ASDF/FIND-SYSTEM:LOAD-SYSTEM-DEFINITION-ERROR : Error while trying to load definition for system cffi-libffi from pathname /home/testgrid/cl-test-grid/work-dir/agent/quicklisp/dists/quicklisp/software/cffi_0.16.1/cffi-libffi.asd: The variable C::*CC-FLAGS* is unbound.
ecl-13.5.1-unknown-linux-i686-lisp-to-c
(LOAD cl-glfw3-examples FAIL) ffi, CFFI:LOAD-FOREIGN-LIBRARY-ERROR : Unable to load any of the alternatives: ("libglfw.so.3.0" "libglfw.so.3")
(LOAD cl-glfw3 FAIL) ffi, CFFI:LOAD-FOREIGN-LIBRARY-ERROR : Unable to load any of the alternatives: ("libglfw.so.3.0" "libglfw.so.3")
(LOAD cl-glfw3-examples FAIL) ffi, CFFI:LOAD-FOREIGN-LIBRARY-ERROR : Unable to load any of the alternatives: ("libglfw.so.3.0" "libglfw.so.3")
(LOAD cl-glfw3 FAIL) ffi, CFFI:LOAD-FOREIGN-LIBRARY-ERROR : Unable to load any of the alternatives: ("libglfw.so.3.0" "libglfw.so.3")
ecl-15.2.21-ee989b97-linux-i686-bytecode
(LOAD cl-glfw3-examples FAIL) ASDF/FIND-SYSTEM:LOAD-SYSTEM-DEFINITION-ERROR : Error while trying to load definition for system cffi-libffi from pathname /home/testgrid/cl-test-grid/work-dir/agent/quicklisp/dists/quicklisp/software/cffi_0.16.1/cffi-libffi.asd: The variable C::*CC-FLAGS* is unbound.
(LOAD cl-glfw3 FAIL) ASDF/FIND-SYSTEM:LOAD-SYSTEM-DEFINITION-ERROR : Error while trying to load definition for system cffi-libffi from pathname /home/testgrid/cl-test-grid/work-dir/agent/quicklisp/dists/quicklisp/software/cffi_0.16.1/cffi-libffi.asd: The variable C::*CC-FLAGS* is unbound.
(LOAD cl-glfw3-examples FAIL) ASDF/FIND-SYSTEM:LOAD-SYSTEM-DEFINITION-ERROR : Error while trying to load definition for system cffi-libffi from pathname /home/testgrid/cl-test-grid/work-dir/agent/quicklisp/dists/quicklisp/software/cffi_0.16.1/cffi-libffi.asd: The variable C::*CC-FLAGS* is unbound.
(LOAD cl-glfw3 FAIL) ASDF/FIND-SYSTEM:LOAD-SYSTEM-DEFINITION-ERROR : Error while trying to load definition for system cffi-libffi from pathname /home/testgrid/cl-test-grid/work-dir/agent/quicklisp/dists/quicklisp/software/cffi_0.16.1/cffi-libffi.asd: The variable C::*CC-FLAGS* is unbound.
ecl-15.2.21-ee989b97-linux-i686-lisp-to-c
(LOAD cl-glfw3-examples FAIL) ffi, CFFI:LOAD-FOREIGN-LIBRARY-ERROR : Unable to load any of the alternatives: ("libglfw.so.3.0" "libglfw.so.3")
(LOAD cl-glfw3 FAIL) ffi, CFFI:LOAD-FOREIGN-LIBRARY-ERROR : Unable to load any of the alternatives: ("libglfw.so.3.0" "libglfw.so.3")
(LOAD cl-glfw3-examples FAIL) ffi, CFFI:LOAD-FOREIGN-LIBRARY-ERROR : Unable to load any of the alternatives: ("libglfw.so.3.0" "libglfw.so.3")
(LOAD cl-glfw3 FAIL) ffi, CFFI:LOAD-FOREIGN-LIBRARY-ERROR : Unable to load any of the alternatives: ("libglfw.so.3.0" "libglfw.so.3")
ecl-15.2.21-ee989b97-linux-x64-bytecode
(LOAD cl-glfw3-examples FAIL) ASDF/FIND-SYSTEM:LOAD-SYSTEM-DEFINITION-ERROR : Error while trying to load definition for system cffi-libffi from pathname /home/hijarian/systems/cl-test-grid/work-dir/agent/quicklisp/dists/quicklisp/software/cffi_0.16.1/cffi-libffi.asd: The variable C::*CC-FLAGS* is unbound.
(LOAD cl-glfw3 FAIL) ASDF/FIND-SYSTEM:LOAD-SYSTEM-DEFINITION-ERROR : Error while trying to load definition for system cffi-libffi from pathname /home/hijarian/systems/cl-test-grid/work-dir/agent/quicklisp/dists/quicklisp/software/cffi_0.16.1/cffi-libffi.asd: The variable C::*CC-FLAGS* is unbound.
(LOAD cl-glfw3-examples FAIL) ASDF/FIND-SYSTEM:LOAD-SYSTEM-DEFINITION-ERROR : Error while trying to load definition for system cffi-libffi from pathname /home/hijarian/systems/cl-test-grid/work-dir/agent/quicklisp/dists/quicklisp/software/cffi_0.16.1/cffi-libffi.asd: The variable C::*CC-FLAGS* is unbound.
(LOAD cl-glfw3 FAIL) ASDF/FIND-SYSTEM:LOAD-SYSTEM-DEFINITION-ERROR : Error while trying to load definition for system cffi-libffi from pathname /home/hijarian/systems/cl-test-grid/work-dir/agent/quicklisp/dists/quicklisp/software/cffi_0.16.1/cffi-libffi.asd: The variable C::*CC-FLAGS* is unbound.
ecl-15.2.21-ee989b97-linux-x64-lisp-to-c
(LOAD cl-glfw3-examples FAIL) ffi, CFFI:LOAD-FOREIGN-LIBRARY-ERROR : Unable to load any of the alternatives: ("libglfw.so.3.0" "libglfw.so.3")
(LOAD cl-glfw3 FAIL) ffi, CFFI:LOAD-FOREIGN-LIBRARY-ERROR : Unable to load any of the alternatives: ("libglfw.so.3.0" "libglfw.so.3")
(LOAD cl-glfw3-examples FAIL) ffi, CFFI:LOAD-FOREIGN-LIBRARY-ERROR : Unable to load any of the alternatives: ("libglfw.so.3.0" "libglfw.so.3")
(LOAD cl-glfw3 FAIL) ffi, CFFI:LOAD-FOREIGN-LIBRARY-ERROR : Unable to load any of the alternatives: ("libglfw.so.3.0" "libglfw.so.3")
ecl-16.0.0-98fc12d3-linux-i686-bytecode
(LOAD cl-glfw3-examples FAIL) ASDF/FIND-SYSTEM:LOAD-SYSTEM-DEFINITION-ERROR : Error while trying to load definition for system cffi-libffi from pathname /home/testgrid/cl-test-grid/work-dir/agent/quicklisp/dists/quicklisp/software/cffi_0.16.1/cffi-libffi.asd: The variable C::*CC-FLAGS* is unbound.
(LOAD cl-glfw3 FAIL) ASDF/FIND-SYSTEM:LOAD-SYSTEM-DEFINITION-ERROR : Error while trying to load definition for system cffi-libffi from pathname /home/testgrid/cl-test-grid/work-dir/agent/quicklisp/dists/quicklisp/software/cffi_0.16.1/cffi-libffi.asd: The variable C::*CC-FLAGS* is unbound.
(LOAD cl-glfw3-examples FAIL) ASDF/FIND-SYSTEM:LOAD-SYSTEM-DEFINITION-ERROR : Error while trying to load definition for system cffi-libffi from pathname /home/testgrid/cl-test-grid/work-dir/agent/quicklisp/dists/quicklisp/software/cffi_0.16.1/cffi-libffi.asd: The variable C::*CC-FLAGS* is unbound.
(LOAD cl-glfw3 FAIL) ASDF/FIND-SYSTEM:LOAD-SYSTEM-DEFINITION-ERROR : Error while trying to load definition for system cffi-libffi from pathname /home/testgrid/cl-test-grid/work-dir/agent/quicklisp/dists/quicklisp/software/cffi_0.16.1/cffi-libffi.asd: The variable C::*CC-FLAGS* is unbound.
ecl-16.0.0-98fc12d3-linux-i686-lisp-to-c
(LOAD cl-glfw3-examples FAIL) ffi, CFFI:LOAD-FOREIGN-LIBRARY-ERROR : Unable to load any of the alternatives: ("libglfw.so.3.0" "libglfw.so.3")
(LOAD cl-glfw3 FAIL) ffi, CFFI:LOAD-FOREIGN-LIBRARY-ERROR : Unable to load any of the alternatives: ("libglfw.so.3.0" "libglfw.so.3")
(LOAD cl-glfw3-examples FAIL) ffi, CFFI:LOAD-FOREIGN-LIBRARY-ERROR : Unable to load any of the alternatives: ("libglfw.so.3.0" "libglfw.so.3")
(LOAD cl-glfw3 FAIL) ffi, CFFI:LOAD-FOREIGN-LIBRARY-ERROR : Unable to load any of the alternatives: ("libglfw.so.3.0" "libglfw.so.3")
ecl-16.1.2-093ba0ab-linux-x64-bytecode
(LOAD cl-glfw3-examples FAIL) ASDF/FIND-SYSTEM:LOAD-SYSTEM-DEFINITION-ERROR : Error while trying to load definition for system cffi-libffi from pathname /home/jack/quicklisp/local-projects/cl-test-grid/work-dir/agent/quicklisp/dists/quicklisp/software/cffi_0.16.1/cffi-libffi.asd: The variable C::*CC-FLAGS* is unbound.
(LOAD cl-glfw3 FAIL) ASDF/FIND-SYSTEM:LOAD-SYSTEM-DEFINITION-ERROR : Error while trying to load definition for system cffi-libffi from pathname /home/jack/quicklisp/local-projects/cl-test-grid/work-dir/agent/quicklisp/dists/quicklisp/software/cffi_0.16.1/cffi-libffi.asd: The variable C::*CC-FLAGS* is unbound.
ecl-16.1.2-093ba0ab-linux-x64-lisp-to-c
(LOAD cl-glfw3-examples FAIL) ffi, CFFI:LOAD-FOREIGN-LIBRARY-ERROR : Unable to load any of the alternatives: ("libglfw.so.3.0" "libglfw.so.3")
(LOAD cl-glfw3 FAIL) ffi, CFFI:LOAD-FOREIGN-LIBRARY-ERROR : Unable to load any of the alternatives: ("libglfw.so.3.0" "libglfw.so.3")
ecl-16.1.2-093ba0ab-linux-x86-bytecode
(LOAD cl-glfw3-examples FAIL) ASDF/FIND-SYSTEM:LOAD-SYSTEM-DEFINITION-ERROR : Error while trying to load definition for system cffi-libffi from pathname /home/dk/Workspace/cl-test-grid/work-dir/agent/quicklisp/dists/quicklisp/software/cffi_0.16.1/cffi-libffi.asd: The variable C::*CC-FLAGS* is unbound.
(LOAD cl-glfw3 FAIL) ASDF/FIND-SYSTEM:LOAD-SYSTEM-DEFINITION-ERROR : Error while trying to load definition for system cffi-libffi from pathname /home/dk/Workspace/cl-test-grid/work-dir/agent/quicklisp/dists/quicklisp/software/cffi_0.16.1/cffi-libffi.asd: The variable C::*CC-FLAGS* is unbound.
ecl-16.1.2-093ba0ab-win-x86-bytecode
sbcl-1.0.58-linux-x86
(LOAD cl-glfw3-examples FAIL) ASDF:LOAD-SYSTEM-DEFINITION-ERROR : Error while trying to load definition for system trivial-main-thread from pathname /home/testgrid/cl-test-grid/work-dir/agent/quicklisp/dists/quicklisp/software/trivial-main-thread-20150709-git/trivial-main-thread.asd: Invalid initialization argument: :HOMEPAGE in call for class #<STANDARD-CLASS ASDF:SYSTEM>. See also: The ANSI Standard, Section 7.1.2
(LOAD cl-glfw3 FAIL) ASDF:LOAD-SYSTEM-DEFINITION-ERROR : Error while trying to load definition for system cffi-libffi from pathname /home/testgrid/cl-test-grid/work-dir/agent/quicklisp/dists/quicklisp/software/cffi_0.16.1/cffi-libffi.asd: Error while invoking #<COMPILE-OP NIL {B561EB1}> on #<CL-SOURCE-FILE "uiop" "image">
(LOAD cl-glfw3-examples FAIL) ASDF:LOAD-SYSTEM-DEFINITION-ERROR : Error while trying to load definition for system trivial-main-thread from pathname /home/testgrid/cl-test-grid/work-dir/agent/quicklisp/dists/quicklisp/software/trivial-main-thread-20150709-git/trivial-main-thread.asd: Invalid initialization argument: :HOMEPAGE in call for class #<STANDARD-CLASS ASDF:SYSTEM>. See also: The ANSI Standard, Section 7.1.2
(LOAD cl-glfw3 FAIL) ASDF:LOAD-SYSTEM-DEFINITION-ERROR : Error while trying to load definition for system cffi-libffi from pathname /home/testgrid/cl-test-grid/work-dir/agent/quicklisp/dists/quicklisp/software/cffi_0.16.1/cffi-libffi.asd: Error while invoking #<COMPILE-OP NIL {B560EB1}> on #<CL-SOURCE-FILE "uiop" "image">
sbcl-1.1.11-linux-x86
(LOAD cl-glfw3-examples FAIL) ffi, CFFI:LOAD-FOREIGN-LIBRARY-ERROR : Unable to load any of the alternatives: ("libglfw.so.3.0" "libglfw.so.3")
(LOAD cl-glfw3 FAIL) ffi, CFFI:LOAD-FOREIGN-LIBRARY-ERROR : Unable to load any of the alternatives: ("libglfw.so.3.0" "libglfw.so.3")
(LOAD cl-glfw3-examples FAIL) ffi, CFFI:LOAD-FOREIGN-LIBRARY-ERROR : Unable to load any of the alternatives: ("libglfw.so.3.0" "libglfw.so.3")
(LOAD cl-glfw3 FAIL) ffi, CFFI:LOAD-FOREIGN-LIBRARY-ERROR : Unable to load any of the alternatives: ("libglfw.so.3.0" "libglfw.so.3")
sbcl-1.1.16-linux-x86
(LOAD cl-glfw3-examples FAIL) ffi, CFFI:LOAD-FOREIGN-LIBRARY-ERROR : Unable to load any of the alternatives: ("libglfw.so.3.0" "libglfw.so.3")
(LOAD cl-glfw3 FAIL) ffi, CFFI:LOAD-FOREIGN-LIBRARY-ERROR : Unable to load any of the alternatives: ("libglfw.so.3.0" "libglfw.so.3")
(LOAD cl-glfw3-examples FAIL) ffi, CFFI:LOAD-FOREIGN-LIBRARY-ERROR : Unable to load any of the alternatives: ("libglfw.so.3.0" "libglfw.so.3")
(LOAD cl-glfw3 FAIL) ffi, CFFI:LOAD-FOREIGN-LIBRARY-ERROR : Unable to load any of the alternatives: ("libglfw.so.3.0" "libglfw.so.3")
sbcl-1.2.14-linux-arm
(LOAD cl-glfw3-examples FAIL) ffi-grovel, CFFI-GROVEL:GROVEL-ERROR : External process exited with code 1. Command was: "cc" "-marm" "-I/home/testgrid/cl-test-grid/work-dir/agent/quicklisp/dists/quicklisp/software/cffi_0.16.1/" "-o" "/home/testgrid/cl-test-grid/work-dir/agent/test-runs/20160104153451-sbcl-1.2.14-linux-arm/fasl/ql/dists/quicklisp/software/cffi_0.16.1/libffi/libffi-unix" "/home/testgrid/cl-test-grid/work-dir/agent/test-runs/20160104153451-sbcl-1.2.14-linux-arm/fasl/ql/dists/quicklisp/software/cffi_0.16.1/libffi/libffi-unix.c" Output was: /home/testgrid/cl-test-grid/work-dir/agent/test-runs/20160104153451-sbcl-1.2.14-linux-arm/fasl/ql/dists/quicklisp/software/cffi_0.16.1/libffi/libffi-unix.c:7:17: fatal error: ffi.h: No such file or directory compilation terminated.
(LOAD cl-glfw3 FAIL) ffi-grovel, CFFI-GROVEL:GROVEL-ERROR : External process exited with code 1. Command was: "cc" "-marm" "-I/home/testgrid/cl-test-grid/work-dir/agent/quicklisp/dists/quicklisp/software/cffi_0.16.1/" "-o" "/home/testgrid/cl-test-grid/work-dir/agent/test-runs/20160104153451-sbcl-1.2.14-linux-arm/fasl/ql/dists/quicklisp/software/cffi_0.16.1/libffi/libffi-unix" "/home/testgrid/cl-test-grid/work-dir/agent/test-runs/20160104153451-sbcl-1.2.14-linux-arm/fasl/ql/dists/quicklisp/software/cffi_0.16.1/libffi/libffi-unix.c" Output was: /home/testgrid/cl-test-grid/work-dir/agent/test-runs/20160104153451-sbcl-1.2.14-linux-arm/fasl/ql/dists/quicklisp/software/cffi_0.16.1/libffi/libffi-unix.c:7:17: fatal error: ffi.h: No such file or directory compilation terminated.
(LOAD cl-glfw3-examples FAIL) ffi-grovel, CFFI-GROVEL:GROVEL-ERROR : External process exited with code 1. Command was: "cc" "-marm" "-I/home/testgrid/cl-test-grid/work-dir/agent/quicklisp/dists/quicklisp/software/cffi_0.16.1/" "-o" "/home/testgrid/cl-test-grid/work-dir/agent/test-runs/20151220100748-sbcl-1.2.14-linux-arm/fasl/ql/dists/quicklisp/software/cffi_0.16.1/libffi/libffi-unix" "/home/testgrid/cl-test-grid/work-dir/agent/test-runs/20151220100748-sbcl-1.2.14-linux-arm/fasl/ql/dists/quicklisp/software/cffi_0.16.1/libffi/libffi-unix.c" Output was: /home/testgrid/cl-test-grid/work-dir/agent/test-runs/20151220100748-sbcl-1.2.14-linux-arm/fasl/ql/dists/quicklisp/software/cffi_0.16.1/libffi/libffi-unix.c: In function ‘main’: /home/testgrid/cl-test-grid/work-dir/agent/test-runs/20151220100748-sbcl-1.2.14-linux-arm/fasl/ql/dists/quicklisp/software/cffi_0.16.1/libffi/libffi-unix.c:82:41: error: ‘FFI_UNIX64’ undeclared (first use in this function) fprintf(output, "%"PRIiMAX, (intmax_t)FFI_UNIX64); ^ /home/testgrid/cl-test-grid/work-dir/agent/test-runs/20151220100748-sbcl-1.2.14-linux-arm/fasl/ql/dists/quicklisp/software/cffi_0.16.1/libffi/libffi-unix.c:82:41: note: each undeclared identifier is reported only once for each function it appears in In file included from /usr/include/string.h:32:0, from /home/testgrid/cl-test-grid/work-dir/agent/quicklisp/dists/quicklisp/software/cffi_0.16.1/grovel/common.h:4, from /home/testgrid/cl-test-grid/work-dir/agent/test-runs/20151220100748-sbcl-1.2.14-linux-arm/fasl/ql/dists/quicklisp/software/cffi_0.16.1/libffi/libffi-unix.c:9: /home/testgrid/cl-test-grid/work-dir/agent/test-runs/20151220100748-sbcl-1.2.14-linux-arm/fasl/ql/dists/quicklisp/software/cffi_0.16.1/libffi/libffi-unix.c:146:52: warning: format ‘%li’ expects argument of type ‘long int’, but argument 3 has type ‘unsigned int’ [-Wformat=] fprintf(output, " :offset %li)", offsetof(struct _ffi_type, size)); ^ /home/testgrid/cl-test-grid/work-dir/agent/test-runs/20151220100748-sbcl-1.2.14-linux-arm/fasl/ql/dists/quicklisp/software/cffi_0.16.1/libffi/libffi-unix.c:151:52: warning: format ‘%li’ expects argument of type ‘long int’, but argument 3 has type ‘unsigned int’ [-Wformat=] fprintf(output, " :offset %li)", offsetof(struct _ffi_type, alignment)); ^ /home/testgrid/cl-test-grid/work-dir/agent/test-runs/20151220100748-sbcl-1.2.14-linux-arm/fasl/ql/dists/quicklisp/software/cffi_0.16.1/libffi/libffi-unix.c:156:52: warning: format ‘%li’ expects argument of type ‘long int’, but argument 3 has type ‘unsigned int’ [-Wformat=] fprintf(output, " :offset %li)", offsetof(struct _ffi_type, type)); ^ /home/testgrid/cl-test-grid/work-dir/agent/test-runs/20151220100748-sbcl-1.2.14-linux-arm/fasl/ql/dists/quicklisp/software/cffi_0.16.1/libffi/libffi-unix.c:161:52: warning: format ‘%li’ expects argument of type ‘long int’, but argument 3 has type ‘unsigned int’ [-Wformat=] fprintf(output, " :offset %li)", offsetof(struct _ffi_type, elements)); ^
(LOAD cl-glfw3 FAIL) ffi-grovel, CFFI-GROVEL:GROVEL-ERROR : External process exited with code 1. Command was: "cc" "-marm" "-I/home/testgrid/cl-test-grid/work-dir/agent/quicklisp/dists/quicklisp/software/cffi_0.16.1/" "-o" "/home/testgrid/cl-test-grid/work-dir/agent/test-runs/20151220100748-sbcl-1.2.14-linux-arm/fasl/ql/dists/quicklisp/software/cffi_0.16.1/libffi/libffi-unix" "/home/testgrid/cl-test-grid/work-dir/agent/test-runs/20151220100748-sbcl-1.2.14-linux-arm/fasl/ql/dists/quicklisp/software/cffi_0.16.1/libffi/libffi-unix.c" Output was: /home/testgrid/cl-test-grid/work-dir/agent/test-runs/20151220100748-sbcl-1.2.14-linux-arm/fasl/ql/dists/quicklisp/software/cffi_0.16.1/libffi/libffi-unix.c: In function ‘main’: /home/testgrid/cl-test-grid/work-dir/agent/test-runs/20151220100748-sbcl-1.2.14-linux-arm/fasl/ql/dists/quicklisp/software/cffi_0.16.1/libffi/libffi-unix.c:82:41: error: ‘FFI_UNIX64’ undeclared (first use in this function) fprintf(output, "%"PRIiMAX, (intmax_t)FFI_UNIX64); ^ /home/testgrid/cl-test-grid/work-dir/agent/test-runs/20151220100748-sbcl-1.2.14-linux-arm/fasl/ql/dists/quicklisp/software/cffi_0.16.1/libffi/libffi-unix.c:82:41: note: each undeclared identifier is reported only once for each function it appears in In file included from /usr/include/string.h:32:0, from /home/testgrid/cl-test-grid/work-dir/agent/quicklisp/dists/quicklisp/software/cffi_0.16.1/grovel/common.h:4, from /home/testgrid/cl-test-grid/work-dir/agent/test-runs/20151220100748-sbcl-1.2.14-linux-arm/fasl/ql/dists/quicklisp/software/cffi_0.16.1/libffi/libffi-unix.c:9: /home/testgrid/cl-test-grid/work-dir/agent/test-runs/20151220100748-sbcl-1.2.14-linux-arm/fasl/ql/dists/quicklisp/software/cffi_0.16.1/libffi/libffi-unix.c:146:52: warning: format ‘%li’ expects argument of type ‘long int’, but argument 3 has type ‘unsigned int’ [-Wformat=] fprintf(output, " :offset %li)", offsetof(struct _ffi_type, size)); ^ /home/testgrid/cl-test-grid/work-dir/agent/test-runs/20151220100748-sbcl-1.2.14-linux-arm/fasl/ql/dists/quicklisp/software/cffi_0.16.1/libffi/libffi-unix.c:151:52: warning: format ‘%li’ expects argument of type ‘long int’, but argument 3 has type ‘unsigned int’ [-Wformat=] fprintf(output, " :offset %li)", offsetof(struct _ffi_type, alignment)); ^ /home/testgrid/cl-test-grid/work-dir/agent/test-runs/20151220100748-sbcl-1.2.14-linux-arm/fasl/ql/dists/quicklisp/software/cffi_0.16.1/libffi/libffi-unix.c:156:52: warning: format ‘%li’ expects argument of type ‘long int’, but argument 3 has type ‘unsigned int’ [-Wformat=] fprintf(output, " :offset %li)", offsetof(struct _ffi_type, type)); ^ /home/testgrid/cl-test-grid/work-dir/agent/test-runs/20151220100748-sbcl-1.2.14-linux-arm/fasl/ql/dists/quicklisp/software/cffi_0.16.1/libffi/libffi-unix.c:161:52: warning: format ‘%li’ expects argument of type ‘long int’, but argument 3 has type ‘unsigned int’ [-Wformat=] fprintf(output, " :offset %li)", offsetof(struct _ffi_type, elements)); ^
(LOAD cl-glfw3-examples FAIL) ffi-grovel, CFFI-GROVEL:GROVEL-ERROR : External process exited with code 1. Command was: "cc" "-marm" "-I/home/testgrid/cl-test-grid/work-dir/agent/quicklisp/dists/quicklisp/software/cffi_0.16.1/" "-o" "/home/testgrid/cl-test-grid/work-dir/agent/test-runs/20151103184057-sbcl-1.2.14-linux-arm/fasl/ql/dists/quicklisp/software/cffi_0.16.1/libffi/libffi-unix" "/home/testgrid/cl-test-grid/work-dir/agent/test-runs/20151103184057-sbcl-1.2.14-linux-arm/fasl/ql/dists/quicklisp/software/cffi_0.16.1/libffi/libffi-unix.c" Output was: /home/testgrid/cl-test-grid/work-dir/agent/test-runs/20151103184057-sbcl-1.2.14-linux-arm/fasl/ql/dists/quicklisp/software/cffi_0.16.1/libffi/libffi-unix.c:7:17: fatal error: ffi.h: No such file or directory compilation terminated.
(LOAD cl-glfw3 FAIL) ffi-grovel, CFFI-GROVEL:GROVEL-ERROR : External process exited with code 1. Command was: "cc" "-marm" "-I/home/testgrid/cl-test-grid/work-dir/agent/quicklisp/dists/quicklisp/software/cffi_0.16.1/" "-o" "/home/testgrid/cl-test-grid/work-dir/agent/test-runs/20151103184057-sbcl-1.2.14-linux-arm/fasl/ql/dists/quicklisp/software/cffi_0.16.1/libffi/libffi-unix" "/home/testgrid/cl-test-grid/work-dir/agent/test-runs/20151103184057-sbcl-1.2.14-linux-arm/fasl/ql/dists/quicklisp/software/cffi_0.16.1/libffi/libffi-unix.c" Output was: /home/testgrid/cl-test-grid/work-dir/agent/test-runs/20151103184057-sbcl-1.2.14-linux-arm/fasl/ql/dists/quicklisp/software/cffi_0.16.1/libffi/libffi-unix.c:7:17: fatal error: ffi.h: No such file or directory compilation terminated.
(LOAD cl-glfw3-examples FAIL) ffi-grovel, CFFI-GROVEL:GROVEL-ERROR : External process exited with code 1. Command was: "cc" "-marm" "-I/home/testgrid/cl-test-grid/work-dir/agent/quicklisp/dists/quicklisp/software/cffi_0.16.1/" "-o" "/home/testgrid/cl-test-grid/work-dir/agent/test-runs/20151103115317-sbcl-1.2.14-linux-arm/fasl/ql/dists/quicklisp/software/cffi_0.16.1/libffi/libffi-unix" "/home/testgrid/cl-test-grid/work-dir/agent/test-runs/20151103115317-sbcl-1.2.14-linux-arm/fasl/ql/dists/quicklisp/software/cffi_0.16.1/libffi/libffi-unix.c" Output was: /home/testgrid/cl-test-grid/work-dir/agent/test-runs/20151103115317-sbcl-1.2.14-linux-arm/fasl/ql/dists/quicklisp/software/cffi_0.16.1/libffi/libffi-unix.c: In function ‘main’: /home/testgrid/cl-test-grid/work-dir/agent/test-runs/20151103115317-sbcl-1.2.14-linux-arm/fasl/ql/dists/quicklisp/software/cffi_0.16.1/libffi/libffi-unix.c:82:41: error: ‘FFI_UNIX64’ undeclared (first use in this function) fprintf(output, "%"PRIiMAX, (intmax_t)FFI_UNIX64); ^ /home/testgrid/cl-test-grid/work-dir/agent/test-runs/20151103115317-sbcl-1.2.14-linux-arm/fasl/ql/dists/quicklisp/software/cffi_0.16.1/libffi/libffi-unix.c:82:41: note: each undeclared identifier is reported only once for each function it appears in In file included from /usr/include/string.h:32:0, from /home/testgrid/cl-test-grid/work-dir/agent/quicklisp/dists/quicklisp/software/cffi_0.16.1/grovel/common.h:4, from /home/testgrid/cl-test-grid/work-dir/agent/test-runs/20151103115317-sbcl-1.2.14-linux-arm/fasl/ql/dists/quicklisp/software/cffi_0.16.1/libffi/libffi-unix.c:9: /home/testgrid/cl-test-grid/work-dir/agent/test-runs/20151103115317-sbcl-1.2.14-linux-arm/fasl/ql/dists/quicklisp/software/cffi_0.16.1/libffi/libffi-unix.c:146:52: warning: format ‘%li’ expects argument of type ‘long int’, but argument 3 has type ‘unsigned int’ [-Wformat=] fprintf(output, " :offset %li)", offsetof(struct _ffi_type, size)); ^ /home/testgrid/cl-test-grid/work-dir/agent/test-runs/20151103115317-sbcl-1.2.14-linux-arm/fasl/ql/dists/quicklisp/software/cffi_0.16.1/libffi/libffi-unix.c:151:52: warning: format ‘%li’ expects argument of type ‘long int’, but argument 3 has type ‘unsigned int’ [-Wformat=] fprintf(output, " :offset %li)", offsetof(struct _ffi_type, alignment)); ^ /home/testgrid/cl-test-grid/work-dir/agent/test-runs/20151103115317-sbcl-1.2.14-linux-arm/fasl/ql/dists/quicklisp/software/cffi_0.16.1/libffi/libffi-unix.c:156:52: warning: format ‘%li’ expects argument of type ‘long int’, but argument 3 has type ‘unsigned int’ [-Wformat=] fprintf(output, " :offset %li)", offsetof(struct _ffi_type, type)); ^ /home/testgrid/cl-test-grid/work-dir/agent/test-runs/20151103115317-sbcl-1.2.14-linux-arm/fasl/ql/dists/quicklisp/software/cffi_0.16.1/libffi/libffi-unix.c:161:52: warning: format ‘%li’ expects argument of type ‘long int’, but argument 3 has type ‘unsigned int’ [-Wformat=] fprintf(output, " :offset %li)", offsetof(struct _ffi_type, elements)); ^
(LOAD cl-glfw3 FAIL) ffi-grovel, CFFI-GROVEL:GROVEL-ERROR : External process exited with code 1. Command was: "cc" "-marm" "-I/home/testgrid/cl-test-grid/work-dir/agent/quicklisp/dists/quicklisp/software/cffi_0.16.1/" "-o" "/home/testgrid/cl-test-grid/work-dir/agent/test-runs/20151103115317-sbcl-1.2.14-linux-arm/fasl/ql/dists/quicklisp/software/cffi_0.16.1/libffi/libffi-unix" "/home/testgrid/cl-test-grid/work-dir/agent/test-runs/20151103115317-sbcl-1.2.14-linux-arm/fasl/ql/dists/quicklisp/software/cffi_0.16.1/libffi/libffi-unix.c" Output was: /home/testgrid/cl-test-grid/work-dir/agent/test-runs/20151103115317-sbcl-1.2.14-linux-arm/fasl/ql/dists/quicklisp/software/cffi_0.16.1/libffi/libffi-unix.c: In function ‘main’: /home/testgrid/cl-test-grid/work-dir/agent/test-runs/20151103115317-sbcl-1.2.14-linux-arm/fasl/ql/dists/quicklisp/software/cffi_0.16.1/libffi/libffi-unix.c:82:41: error: ‘FFI_UNIX64’ undeclared (first use in this function) fprintf(output, "%"PRIiMAX, (intmax_t)FFI_UNIX64); ^ /home/testgrid/cl-test-grid/work-dir/agent/test-runs/20151103115317-sbcl-1.2.14-linux-arm/fasl/ql/dists/quicklisp/software/cffi_0.16.1/libffi/libffi-unix.c:82:41: note: each undeclared identifier is reported only once for each function it appears in In file included from /usr/include/string.h:32:0, from /home/testgrid/cl-test-grid/work-dir/agent/quicklisp/dists/quicklisp/software/cffi_0.16.1/grovel/common.h:4, from /home/testgrid/cl-test-grid/work-dir/agent/test-runs/20151103115317-sbcl-1.2.14-linux-arm/fasl/ql/dists/quicklisp/software/cffi_0.16.1/libffi/libffi-unix.c:9: /home/testgrid/cl-test-grid/work-dir/agent/test-runs/20151103115317-sbcl-1.2.14-linux-arm/fasl/ql/dists/quicklisp/software/cffi_0.16.1/libffi/libffi-unix.c:146:52: warning: format ‘%li’ expects argument of type ‘long int’, but argument 3 has type ‘unsigned int’ [-Wformat=] fprintf(output, " :offset %li)", offsetof(struct _ffi_type, size)); ^ /home/testgrid/cl-test-grid/work-dir/agent/test-runs/20151103115317-sbcl-1.2.14-linux-arm/fasl/ql/dists/quicklisp/software/cffi_0.16.1/libffi/libffi-unix.c:151:52: warning: format ‘%li’ expects argument of type ‘long int’, but argument 3 has type ‘unsigned int’ [-Wformat=] fprintf(output, " :offset %li)", offsetof(struct _ffi_type, alignment)); ^ /home/testgrid/cl-test-grid/work-dir/agent/test-runs/20151103115317-sbcl-1.2.14-linux-arm/fasl/ql/dists/quicklisp/software/cffi_0.16.1/libffi/libffi-unix.c:156:52: warning: format ‘%li’ expects argument of type ‘long int’, but argument 3 has type ‘unsigned int’ [-Wformat=] fprintf(output, " :offset %li)", offsetof(struct _ffi_type, type)); ^ /home/testgrid/cl-test-grid/work-dir/agent/test-runs/20151103115317-sbcl-1.2.14-linux-arm/fasl/ql/dists/quicklisp/software/cffi_0.16.1/libffi/libffi-unix.c:161:52: warning: format ‘%li’ expects argument of type ‘long int’, but argument 3 has type ‘unsigned int’ [-Wformat=] fprintf(output, " :offset %li)", offsetof(struct _ffi_type, elements)); ^
sbcl-1.2.3-linux-x64
(LOAD cl-glfw3-examples FAIL) ffi, CFFI:LOAD-FOREIGN-LIBRARY-ERROR : Unable to load any of the alternatives: ("libglfw.so.3.0" "libglfw.so.3")
(LOAD cl-glfw3 FAIL) ffi, CFFI:LOAD-FOREIGN-LIBRARY-ERROR : Unable to load any of the alternatives: ("libglfw.so.3.0" "libglfw.so.3")
(LOAD cl-glfw3-examples FAIL) ffi, CFFI:LOAD-FOREIGN-LIBRARY-ERROR : Unable to load any of the alternatives: ("libglfw.so.3.0" "libglfw.so.3")
(LOAD cl-glfw3 FAIL) ffi, CFFI:LOAD-FOREIGN-LIBRARY-ERROR : Unable to load any of the alternatives: ("libglfw.so.3.0" "libglfw.so.3")
sbcl-1.2.3.13-3446e1a-dirty-macosx-x64
(LOAD cl-glfw3-examples FAIL) ffi, CFFI:LOAD-FOREIGN-LIBRARY-ERROR : Unable to load any of the alternatives: ("libglfw.so.3.0" "libglfw.so.3")
(LOAD cl-glfw3 FAIL) ffi, CFFI:LOAD-FOREIGN-LIBRARY-ERROR : Unable to load any of the alternatives: ("libglfw.so.3.0" "libglfw.so.3")
sbcl-1.2.6-linux-x86
(LOAD cl-glfw3-examples FAIL) ffi, CFFI:LOAD-FOREIGN-LIBRARY-ERROR : Unable to load any of the alternatives: ("libglfw.so.3.0" "libglfw.so.3")
(LOAD cl-glfw3 FAIL) ffi, CFFI:LOAD-FOREIGN-LIBRARY-ERROR : Unable to load any of the alternatives: ("libglfw.so.3.0" "libglfw.so.3")
(LOAD cl-glfw3-examples FAIL) ffi, CFFI:LOAD-FOREIGN-LIBRARY-ERROR : Unable to load any of the alternatives: ("libglfw.so.3.0" "libglfw.so.3")
(LOAD cl-glfw3 FAIL) ffi, CFFI:LOAD-FOREIGN-LIBRARY-ERROR : Unable to load any of the alternatives: ("libglfw.so.3.0" "libglfw.so.3")

Breakdown by testcases: for every failed testcase the lisp implmentations it fails on

The library does not have a testsuite adapter for CL Test Grid.

To reports overview

Generated at: 2016-02-04 21:45:11 GMT.