cl-fuse-meta-fs results collected by cl-test-grid

Results on the last two Quicklisp distributions

 quicklisp 2015-12-18quicklisp 2015-10-31
abcl-1.2.1-fasl42-linux-x86
(LOAD cl-fuse-meta-fs FAIL) ASDF/FIND-SYSTEM:LOAD-SYSTEM-DEFINITION-ERROR : Error while trying to load definition for system cl-fuse from pathname /home/testgrid/cl-test-grid/work-dir/agent/quicklisp/dists/quicklisp/software/cl-fuse-20150923-git/cl-fuse.asd: External process exited with code 1. Command was: "cc" "-m32" "-I/home/testgrid/cl-test-grid/work-dir/agent/quicklisp/dists/quicklisp/software/cffi_0.16.1/" "-o" "/home/testgrid/cl-test-grid/work-dir/agent/quicklisp/dists/quicklisp/software/cl-fuse-20150923-git/fuse-grovel-result" "/home/testgrid/cl-test-grid/work-dir/agent/quicklisp/dists/quicklisp/software/cl-fuse-20150923-git/fuse-grovel-result.c" Output was: /home/testgrid/cl-test-grid/work-dir/agent/quicklisp/dists/quicklisp/software/cl-fuse-20150923-git/fuse-grovel-result.c:9:18: fatal error: fuse.h: No such file or directory compilation terminated.
(LOAD cl-fuse-meta-fs FAIL) ASDF/FIND-SYSTEM:LOAD-SYSTEM-DEFINITION-ERROR : Error while trying to load definition for system cl-fuse from pathname /home/testgrid/cl-test-grid/work-dir/agent/quicklisp/dists/quicklisp/software/cl-fuse-20150923-git/cl-fuse.asd: External process exited with code 1. Command was: "cc" "-m32" "-I/home/testgrid/cl-test-grid/work-dir/agent/quicklisp/dists/quicklisp/software/cffi_0.16.1/" "-o" "/home/testgrid/cl-test-grid/work-dir/agent/quicklisp/dists/quicklisp/software/cl-fuse-20150923-git/fuse-grovel-result" "/home/testgrid/cl-test-grid/work-dir/agent/quicklisp/dists/quicklisp/software/cl-fuse-20150923-git/fuse-grovel-result.c" Output was: /home/testgrid/cl-test-grid/work-dir/agent/quicklisp/dists/quicklisp/software/cl-fuse-20150923-git/fuse-grovel-result.c:9:18: fatal error: fuse.h: No such file or directory compilation terminated.
abcl-1.3.0-fasl42-linux-x86
(LOAD cl-fuse-meta-fs FAIL) ASDF/FIND-SYSTEM:LOAD-SYSTEM-DEFINITION-ERROR : Error while trying to load definition for system cl-fuse from pathname /home/testgrid/cl-test-grid/work-dir/agent/quicklisp/dists/quicklisp/software/cl-fuse-20150923-git/cl-fuse.asd: External process exited with code 1. Command was: "cc" "-m32" "-I/home/testgrid/cl-test-grid/work-dir/agent/quicklisp/dists/quicklisp/software/cffi_0.16.1/" "-o" "/home/testgrid/cl-test-grid/work-dir/agent/quicklisp/dists/quicklisp/software/cl-fuse-20150923-git/fuse-grovel-result" "/home/testgrid/cl-test-grid/work-dir/agent/quicklisp/dists/quicklisp/software/cl-fuse-20150923-git/fuse-grovel-result.c" Output was: /home/testgrid/cl-test-grid/work-dir/agent/quicklisp/dists/quicklisp/software/cl-fuse-20150923-git/fuse-grovel-result.c:9:18: fatal error: fuse.h: No such file or directory compilation terminated.
(LOAD cl-fuse-meta-fs FAIL) ASDF/FIND-SYSTEM:LOAD-SYSTEM-DEFINITION-ERROR : Error while trying to load definition for system cl-fuse from pathname /home/testgrid/cl-test-grid/work-dir/agent/quicklisp/dists/quicklisp/software/cl-fuse-20150923-git/cl-fuse.asd: External process exited with code 1. Command was: "cc" "-m32" "-I/home/testgrid/cl-test-grid/work-dir/agent/quicklisp/dists/quicklisp/software/cffi_0.16.1/" "-o" "/home/testgrid/cl-test-grid/work-dir/agent/quicklisp/dists/quicklisp/software/cl-fuse-20150923-git/fuse-grovel-result" "/home/testgrid/cl-test-grid/work-dir/agent/quicklisp/dists/quicklisp/software/cl-fuse-20150923-git/fuse-grovel-result.c" Output was: /home/testgrid/cl-test-grid/work-dir/agent/quicklisp/dists/quicklisp/software/cl-fuse-20150923-git/fuse-grovel-result.c:9:18: fatal error: fuse.h: No such file or directory compilation terminated.
abcl-1.3.1-fasl42-linux-x86
(LOAD cl-fuse-meta-fs FAIL) ASDF/FIND-SYSTEM:LOAD-SYSTEM-DEFINITION-ERROR : Error while trying to load definition for system cl-fuse from pathname /home/testgrid/cl-test-grid/work-dir/agent/quicklisp/dists/quicklisp/software/cl-fuse-20150923-git/cl-fuse.asd: External process exited with code 1. Command was: "cc" "-m32" "-I/home/testgrid/cl-test-grid/work-dir/agent/quicklisp/dists/quicklisp/software/cffi_0.16.1/" "-o" "/home/testgrid/cl-test-grid/work-dir/agent/quicklisp/dists/quicklisp/software/cl-fuse-20150923-git/fuse-grovel-result" "/home/testgrid/cl-test-grid/work-dir/agent/quicklisp/dists/quicklisp/software/cl-fuse-20150923-git/fuse-grovel-result.c" Output was: /home/testgrid/cl-test-grid/work-dir/agent/quicklisp/dists/quicklisp/software/cl-fuse-20150923-git/fuse-grovel-result.c:9:18: fatal error: fuse.h: No such file or directory compilation terminated.
(LOAD cl-fuse-meta-fs FAIL) ASDF/FIND-SYSTEM:LOAD-SYSTEM-DEFINITION-ERROR : Error while trying to load definition for system cl-fuse from pathname /home/testgrid/cl-test-grid/work-dir/agent/quicklisp/dists/quicklisp/software/cl-fuse-20150923-git/cl-fuse.asd: External process exited with code 1. Command was: "cc" "-m32" "-I/home/testgrid/cl-test-grid/work-dir/agent/quicklisp/dists/quicklisp/software/cffi_0.16.1/" "-o" "/home/testgrid/cl-test-grid/work-dir/agent/quicklisp/dists/quicklisp/software/cl-fuse-20150923-git/fuse-grovel-result" "/home/testgrid/cl-test-grid/work-dir/agent/quicklisp/dists/quicklisp/software/cl-fuse-20150923-git/fuse-grovel-result.c" Output was: /home/testgrid/cl-test-grid/work-dir/agent/quicklisp/dists/quicklisp/software/cl-fuse-20150923-git/fuse-grovel-result.c:9:18: fatal error: fuse.h: No such file or directory compilation terminated.
abcl-1.3.1-fasl42-macosx-x64
(LOAD cl-fuse-meta-fs FAIL) ASDF/FIND-SYSTEM:LOAD-SYSTEM-DEFINITION-ERROR : Error while trying to load definition for system cl-fuse from pathname /Users/testgrid/cl-test-grid/work-dir/agent/quicklisp/dists/quicklisp/software/cl-fuse-20150923-git/cl-fuse.asd: The file http does not exist.
abcl-1.3.2-fasl42-linux-x86
(LOAD cl-fuse-meta-fs FAIL) ASDF/FIND-SYSTEM:LOAD-SYSTEM-DEFINITION-ERROR : Error while trying to load definition for system cl-fuse from pathname /home/testgrid/cl-test-grid/work-dir/agent/quicklisp/dists/quicklisp/software/cl-fuse-20150923-git/cl-fuse.asd: External process exited with code 1. Command was: "cc" "-m32" "-I/home/testgrid/cl-test-grid/work-dir/agent/quicklisp/dists/quicklisp/software/cffi_0.16.1/" "-o" "/home/testgrid/cl-test-grid/work-dir/agent/quicklisp/dists/quicklisp/software/cl-fuse-20150923-git/fuse-grovel-result" "/home/testgrid/cl-test-grid/work-dir/agent/quicklisp/dists/quicklisp/software/cl-fuse-20150923-git/fuse-grovel-result.c" Output was: /home/testgrid/cl-test-grid/work-dir/agent/quicklisp/dists/quicklisp/software/cl-fuse-20150923-git/fuse-grovel-result.c:9:18: fatal error: fuse.h: No such file or directory compilation terminated.
(LOAD cl-fuse-meta-fs FAIL) ASDF/FIND-SYSTEM:LOAD-SYSTEM-DEFINITION-ERROR : Error while trying to load definition for system cl-fuse from pathname /home/testgrid/cl-test-grid/work-dir/agent/quicklisp/dists/quicklisp/software/cl-fuse-20150923-git/cl-fuse.asd: External process exited with code 1. Command was: "cc" "-m32" "-I/home/testgrid/cl-test-grid/work-dir/agent/quicklisp/dists/quicklisp/software/cffi_0.16.1/" "-o" "/home/testgrid/cl-test-grid/work-dir/agent/quicklisp/dists/quicklisp/software/cl-fuse-20150923-git/fuse-grovel-result" "/home/testgrid/cl-test-grid/work-dir/agent/quicklisp/dists/quicklisp/software/cl-fuse-20150923-git/fuse-grovel-result.c" Output was: /home/testgrid/cl-test-grid/work-dir/agent/quicklisp/dists/quicklisp/software/cl-fuse-20150923-git/fuse-grovel-result.c:9:18: fatal error: fuse.h: No such file or directory compilation terminated.
ccl-1.10-r16196-f101-linux-arm
(LOAD cl-fuse-meta-fs FAIL) ASDF/FIND-SYSTEM:LOAD-SYSTEM-DEFINITION-ERROR : Error while trying to load definition for system cl-fuse from pathname /home/testgrid/cl-test-grid/work-dir/agent/quicklisp/dists/quicklisp/software/cl-fuse-20150923-git/cl-fuse.asd: Incorrect keyword arguments in (:SEARCH T :OUTPUT T) .
(LOAD cl-fuse-meta-fs FAIL) ASDF/FIND-SYSTEM:LOAD-SYSTEM-DEFINITION-ERROR : Error while trying to load definition for system cl-fuse from pathname /home/testgrid/cl-test-grid/work-dir/agent/quicklisp/dists/quicklisp/software/cl-fuse-20150923-git/cl-fuse.asd: Incorrect keyword arguments in (:SEARCH T :OUTPUT T) .
ccl-1.10-r16196-f96-linux-x64
(LOAD cl-fuse-meta-fs FAIL) ASDF/FIND-SYSTEM:LOAD-SYSTEM-DEFINITION-ERROR : Error while trying to load definition for system cl-fuse from pathname /home/hijarian/systems/cl-test-grid/work-dir/agent/quicklisp/dists/quicklisp/software/cl-fuse-20150923-git/cl-fuse.asd: Incorrect keyword arguments in (:SEARCH T :OUTPUT T) .
(LOAD cl-fuse-meta-fs FAIL) ASDF/FIND-SYSTEM:LOAD-SYSTEM-DEFINITION-ERROR : Error while trying to load definition for system cl-fuse from pathname /home/hijarian/systems/cl-test-grid/work-dir/agent/quicklisp/dists/quicklisp/software/cl-fuse-20150923-git/cl-fuse.asd: Incorrect keyword arguments in (:SEARCH T :OUTPUT T) .
ccl-1.10-r16196-f96-linux-x86
(LOAD cl-fuse-meta-fs FAIL) ASDF/FIND-SYSTEM:LOAD-SYSTEM-DEFINITION-ERROR : Error while trying to load definition for system cl-fuse from pathname /home/testgrid/cl-test-grid/work-dir/agent/quicklisp/dists/quicklisp/software/cl-fuse-20150923-git/cl-fuse.asd: Incorrect keyword arguments in (:SEARCH T :OUTPUT T) .
(LOAD cl-fuse-meta-fs FAIL) ASDF/FIND-SYSTEM:LOAD-SYSTEM-DEFINITION-ERROR : Error while trying to load definition for system cl-fuse from pathname /home/testgrid/cl-test-grid/work-dir/agent/quicklisp/dists/quicklisp/software/cl-fuse-20150923-git/cl-fuse.asd: Incorrect keyword arguments in (:SEARCH T :OUTPUT T) .
ccl-1.10-r16196-f96-macosx-x86
(LOAD cl-fuse-meta-fs FAIL) ASDF/FIND-SYSTEM:LOAD-SYSTEM-DEFINITION-ERROR : Error while trying to load definition for system cl-fuse from pathname /Users/testgrid/cl-test-grid/work-dir/agent/quicklisp/dists/quicklisp/software/cl-fuse-20150923-git/cl-fuse.asd: Incorrect keyword arguments in (:SEARCH T :OUTPUT T) .
ccl-1.10-r16393-f96-macosx-x64
(LOAD cl-fuse-meta-fs FAIL) ASDF/FIND-SYSTEM:LOAD-SYSTEM-DEFINITION-ERROR : Error while trying to load definition for system cl-fuse from pathname /Users/testgrid/cl-test-grid/work-dir/agent/quicklisp/dists/quicklisp/software/cl-fuse-20150923-git/cl-fuse.asd: Incorrect keyword arguments in (:SEARCH T :OUTPUT T) .
ccl-1.11-r16635-f96-linux-x86
(LOAD cl-fuse-meta-fs FAIL) ASDF/FIND-SYSTEM:LOAD-SYSTEM-DEFINITION-ERROR : Error while trying to load definition for system cl-fuse from pathname /home/testgrid/cl-test-grid/work-dir/agent/quicklisp/dists/quicklisp/software/cl-fuse-20150923-git/cl-fuse.asd: Incorrect keyword arguments in (:SEARCH T :OUTPUT T) .
(LOAD cl-fuse-meta-fs FAIL) ASDF/FIND-SYSTEM:LOAD-SYSTEM-DEFINITION-ERROR : Error while trying to load definition for system cl-fuse from pathname /home/testgrid/cl-test-grid/work-dir/agent/quicklisp/dists/quicklisp/software/cl-fuse-20150923-git/cl-fuse.asd: Incorrect keyword arguments in (:SEARCH T :OUTPUT T) .
ccl-1.11-rc1-r16536-f101-linux-arm
(LOAD cl-fuse-meta-fs FAIL) ASDF/FIND-SYSTEM:LOAD-SYSTEM-DEFINITION-ERROR : Error while trying to load definition for system cl-fuse from pathname /home/testgrid/cl-test-grid/work-dir/agent/quicklisp/dists/quicklisp/software/cl-fuse-20150923-git/cl-fuse.asd: Incorrect keyword arguments in (:SEARCH T :OUTPUT T) .
(LOAD cl-fuse-meta-fs FAIL) ASDF/FIND-SYSTEM:LOAD-SYSTEM-DEFINITION-ERROR : Error while trying to load definition for system cl-fuse from pathname /home/testgrid/cl-test-grid/work-dir/agent/quicklisp/dists/quicklisp/software/cl-fuse-20150923-git/cl-fuse.asd: Incorrect keyword arguments in (:SEARCH T :OUTPUT T) .
ccl-1.11-rc1-r16536-f96-linux-x86
(LOAD cl-fuse-meta-fs FAIL) ASDF/FIND-SYSTEM:LOAD-SYSTEM-DEFINITION-ERROR : Error while trying to load definition for system cl-fuse from pathname /home/testgrid/cl-test-grid/work-dir/agent/quicklisp/dists/quicklisp/software/cl-fuse-20150923-git/cl-fuse.asd: Incorrect keyword arguments in (:SEARCH T :OUTPUT T) .
(LOAD cl-fuse-meta-fs FAIL) ASDF/FIND-SYSTEM:LOAD-SYSTEM-DEFINITION-ERROR : Error while trying to load definition for system cl-fuse from pathname /home/testgrid/cl-test-grid/work-dir/agent/quicklisp/dists/quicklisp/software/cl-fuse-20150923-git/cl-fuse.asd: Incorrect keyword arguments in (:SEARCH T :OUTPUT T) .
ccl-1.11-rc1-r16536-f96-macosx-x86
(LOAD cl-fuse-meta-fs FAIL) ASDF/FIND-SYSTEM:LOAD-SYSTEM-DEFINITION-ERROR : Error while trying to load definition for system cl-fuse from pathname /Users/testgrid/cl-test-grid/work-dir/agent/quicklisp/dists/quicklisp/software/cl-fuse-20150923-git/cl-fuse.asd: Incorrect keyword arguments in (:SEARCH T :OUTPUT T) .
ccl-1.11-rc1-r16540-f96-macosx-x64
(LOAD cl-fuse-meta-fs FAIL) ASDF/FIND-SYSTEM:LOAD-SYSTEM-DEFINITION-ERROR : Error while trying to load definition for system cl-fuse from pathname /Users/testgrid/cl-test-grid/work-dir/agent/quicklisp/dists/quicklisp/software/cl-fuse-20150923-git/cl-fuse.asd: Incorrect keyword arguments in (:SEARCH T :OUTPUT T) .
(LOAD cl-fuse-meta-fs FAIL) ASDF/FIND-SYSTEM:LOAD-SYSTEM-DEFINITION-ERROR : Error while trying to load definition for system cl-fuse from pathname /Users/testgrid/cl-test-grid/work-dir/agent/quicklisp/dists/quicklisp/software/cl-fuse-20150923-git/cl-fuse.asd: Incorrect keyword arguments in (:SEARCH T :OUTPUT T) .
(LOAD cl-fuse-meta-fs FAIL) ASDF/FIND-SYSTEM:LOAD-SYSTEM-DEFINITION-ERROR : Error while trying to load definition for system cl-fuse from pathname /Users/testgrid/cl-test-grid/work-dir/agent/quicklisp/dists/quicklisp/software/cl-fuse-20150923-git/cl-fuse.asd: Incorrect keyword arguments in (:SEARCH T :OUTPUT T) .
ccl-1.11-rc1-r16542m-f101-linux-arm
(LOAD cl-fuse-meta-fs FAIL) ASDF/FIND-SYSTEM:LOAD-SYSTEM-DEFINITION-ERROR : Error while trying to load definition for system cl-fuse from pathname /home/testgrid/cl-test-grid/work-dir/agent/quicklisp/dists/quicklisp/software/cl-fuse-20150923-git/cl-fuse.asd: Incorrect keyword arguments in (:SEARCH T :OUTPUT T) .
(LOAD cl-fuse-meta-fs FAIL) ASDF/FIND-SYSTEM:LOAD-SYSTEM-DEFINITION-ERROR : Error while trying to load definition for system cl-fuse from pathname /home/testgrid/cl-test-grid/work-dir/agent/quicklisp/dists/quicklisp/software/cl-fuse-20150923-git/cl-fuse.asd: Incorrect keyword arguments in (:SEARCH T :OUTPUT T) .
ccl-1.8-r15286m-f95-linux-x86
(LOAD cl-fuse-meta-fs FAIL) ASDF:LOAD-SYSTEM-DEFINITION-ERROR : Error while trying to load definition for system bordeaux-threads from pathname /home/testgrid/cl-test-grid/work-dir/agent/quicklisp/dists/quicklisp/software/bordeaux-threads-v0.8.4-git/bordeaux-threads.asd: There is no package named "UIOP" .
(LOAD cl-fuse-meta-fs FAIL) ASDF:LOAD-SYSTEM-DEFINITION-ERROR : Error while trying to load definition for system cl-fuse from pathname /home/testgrid/cl-test-grid/work-dir/agent/quicklisp/dists/quicklisp/software/cl-fuse-20150923-git/cl-fuse.asd: Incorrect keyword arguments in (:SEARCH T :OUTPUT T) .
ccl-1.8-r15286m-f97-linux-arm
(LOAD cl-fuse-meta-fs FAIL) ASDF:LOAD-SYSTEM-DEFINITION-ERROR : Error while trying to load definition for system bordeaux-threads from pathname /home/testgrid/cl-test-grid/work-dir/agent/quicklisp/dists/quicklisp/software/bordeaux-threads-v0.8.4-git/bordeaux-threads.asd: There is no package named "UIOP" .
(LOAD cl-fuse-meta-fs FAIL) ASDF:LOAD-SYSTEM-DEFINITION-ERROR : Error while trying to load definition for system bordeaux-threads from pathname /home/testgrid/cl-test-grid/work-dir/agent/quicklisp/dists/quicklisp/software/bordeaux-threads-v0.8.4-git/bordeaux-threads.asd: There is no package named "UIOP" .
(LOAD cl-fuse-meta-fs FAIL) ASDF:LOAD-SYSTEM-DEFINITION-ERROR : Error while trying to load definition for system bordeaux-threads from pathname /home/testgrid/cl-test-grid/work-dir/agent/quicklisp/dists/quicklisp/software/bordeaux-threads-v0.8.4-git/bordeaux-threads.asd: There is no package named "UIOP" .
(LOAD cl-fuse-meta-fs FAIL) ASDF:LOAD-SYSTEM-DEFINITION-ERROR : Error while trying to load definition for system cl-fuse from pathname /home/testgrid/cl-test-grid/work-dir/agent/quicklisp/dists/quicklisp/software/cl-fuse-20150923-git/cl-fuse.asd: Incorrect keyword arguments in (:SEARCH T :OUTPUT T) .
ccl-1.9-r15756-f96-linux-x86
(LOAD cl-fuse-meta-fs FAIL) ASDF/FIND-SYSTEM:LOAD-SYSTEM-DEFINITION-ERROR : Error while trying to load definition for system cl-fuse from pathname /home/testgrid/cl-test-grid/work-dir/agent/quicklisp/dists/quicklisp/software/cl-fuse-20150923-git/cl-fuse.asd: Incorrect keyword arguments in (:SEARCH T :OUTPUT T) .
(LOAD cl-fuse-meta-fs FAIL) ASDF/FIND-SYSTEM:LOAD-SYSTEM-DEFINITION-ERROR : Error while trying to load definition for system cl-fuse from pathname /home/testgrid/cl-test-grid/work-dir/agent/quicklisp/dists/quicklisp/software/cl-fuse-20150923-git/cl-fuse.asd: Incorrect keyword arguments in (:SEARCH T :OUTPUT T) .
ccl-1.9-r15767-f99-linux-arm
(LOAD cl-fuse-meta-fs FAIL) ASDF/FIND-SYSTEM:LOAD-SYSTEM-DEFINITION-ERROR : Error while trying to load definition for system cl-fuse from pathname /home/testgrid/cl-test-grid/work-dir/agent/quicklisp/dists/quicklisp/software/cl-fuse-20150923-git/cl-fuse.asd: Incorrect keyword arguments in (:SEARCH T :OUTPUT T) .
(LOAD cl-fuse-meta-fs FAIL) ASDF/FIND-SYSTEM:LOAD-SYSTEM-DEFINITION-ERROR : Error while trying to load definition for system cl-fuse from pathname /home/testgrid/cl-test-grid/work-dir/agent/quicklisp/dists/quicklisp/software/cl-fuse-20150923-git/cl-fuse.asd: Incorrect keyword arguments in (:SEARCH T :OUTPUT T) .
clisp-2.49-unix-armv7l
(LOAD cl-fuse-meta-fs FAIL) ASDF:LOAD-SYSTEM-DEFINITION-ERROR : Error while trying to load definition for system bordeaux-threads from pathname /home/testgrid/cl-test-grid/work-dir/agent/quicklisp/dists/quicklisp/software/bordeaux-threads-v0.8.4-git/bordeaux-threads.asd: READ from #<INPUT BUFFERED FILE-STREAM CHARACTER #P"/home/testgrid/cl-test-grid/work-dir/agent/quicklisp/dists/quicklisp/software/bordeaux-threads-v0.8.4-git/bordeaux-threads.asd" @68>: there is no package with name "UIOP"
(LOAD cl-fuse-meta-fs FAIL) ASDF:LOAD-SYSTEM-DEFINITION-ERROR : Error while trying to load definition for system cl-fuse from pathname /home/testgrid/cl-test-grid/work-dir/agent/quicklisp/dists/quicklisp/software/cl-fuse-20150923-git/cl-fuse.asd: OPEN: File #P"/home/testgrid/cl-test-grid/work-dir/agent/quicklisp/dists/quicklisp/software/cl-fuse-20150923-git/clisp-cffi-invoke-3655784590-675.tmp" does not exist
clisp-2.49-unix-x86
(LOAD cl-fuse-meta-fs FAIL) ASDF:LOAD-SYSTEM-DEFINITION-ERROR : Error while trying to load definition for system bordeaux-threads from pathname /home/testgrid/cl-test-grid/work-dir/agent/quicklisp/dists/quicklisp/software/bordeaux-threads-v0.8.4-git/bordeaux-threads.asd: READ from #<INPUT BUFFERED FILE-STREAM CHARACTER #P"/home/testgrid/cl-test-grid/work-dir/agent/quicklisp/dists/quicklisp/software/bordeaux-threads-v0.8.4-git/bordeaux-threads.asd" @68>: there is no package with name "UIOP"
(LOAD cl-fuse-meta-fs FAIL) ASDF:LOAD-SYSTEM-DEFINITION-ERROR : Error while trying to load definition for system cl-fuse from pathname /home/testgrid/cl-test-grid/work-dir/agent/quicklisp/dists/quicklisp/software/cl-fuse-20150923-git/cl-fuse.asd: OPEN: File #P"/home/testgrid/cl-test-grid/work-dir/agent/quicklisp/dists/quicklisp/software/cl-fuse-20150923-git/clisp-cffi-invoke-3655364765-804.tmp" does not exist
cmu-snapshot-2013-04__20d_unicode_-linux-x86
(LOAD cl-fuse-meta-fs FAIL) ASDF/FIND-SYSTEM:LOAD-SYSTEM-DEFINITION-ERROR : Error while trying to load definition for system cl-fuse from pathname /home/testgrid/cl-test-grid/work-dir/agent/quicklisp/dists/quicklisp/software/cl-fuse-20150923-git/cl-fuse.asd: Error in function CFFI-GROVEL:GROVEL-ERROR: External process exited with code 1. Command was: "cc" "-m32" "-I/home/testgrid/cl-test-grid/work-dir/agent/quicklisp/dists/quicklisp/software/cffi_0.16.1/" "-o" "/home/testgrid/cl-test-grid/work-dir/agent/quicklisp/dists/quicklisp/software/cl-fuse-20150923-git/fuse-grovel-result" "/home/testgrid/cl-test-grid/work-dir/agent/quicklisp/dists/quicklisp/software/cl-fuse-20150923-git/fuse-grovel-result.c" Output was: /home/testgrid/cl-test-grid/work-dir/agent/quicklisp/dists/quicklisp/software/cl-fuse-20150923-git/fuse-grovel-result.c:9:18: fatal error: fuse.h: No such file or directory compilation terminated.
(LOAD cl-fuse-meta-fs FAIL) ASDF/FIND-SYSTEM:LOAD-SYSTEM-DEFINITION-ERROR : Error while trying to load definition for system cl-fuse from pathname /home/testgrid/cl-test-grid/work-dir/agent/quicklisp/dists/quicklisp/software/cl-fuse-20150923-git/cl-fuse.asd: Error in function CFFI-GROVEL:GROVEL-ERROR: External process exited with code 1. Command was: "cc" "-m32" "-I/home/testgrid/cl-test-grid/work-dir/agent/quicklisp/dists/quicklisp/software/cffi_0.16.1/" "-o" "/home/testgrid/cl-test-grid/work-dir/agent/quicklisp/dists/quicklisp/software/cl-fuse-20150923-git/fuse-grovel-result" "/home/testgrid/cl-test-grid/work-dir/agent/quicklisp/dists/quicklisp/software/cl-fuse-20150923-git/fuse-grovel-result.c" Output was: /home/testgrid/cl-test-grid/work-dir/agent/quicklisp/dists/quicklisp/software/cl-fuse-20150923-git/fuse-grovel-result.c:9:18: fatal error: fuse.h: No such file or directory compilation terminated.
cmu-snapshot-2014-01__20e_unicode_-linux-x86
(LOAD cl-fuse-meta-fs FAIL) ASDF/FIND-SYSTEM:LOAD-SYSTEM-DEFINITION-ERROR : Error while trying to load definition for system cl-fuse from pathname /home/testgrid/cl-test-grid/work-dir/agent/quicklisp/dists/quicklisp/software/cl-fuse-20150923-git/cl-fuse.asd: Error in function CFFI-GROVEL:GROVEL-ERROR: External process exited with code 1. Command was: "cc" "-m32" "-I/home/testgrid/cl-test-grid/work-dir/agent/quicklisp/dists/quicklisp/software/cffi_0.16.1/" "-o" "/home/testgrid/cl-test-grid/work-dir/agent/quicklisp/dists/quicklisp/software/cl-fuse-20150923-git/fuse-grovel-result" "/home/testgrid/cl-test-grid/work-dir/agent/quicklisp/dists/quicklisp/software/cl-fuse-20150923-git/fuse-grovel-result.c" Output was: /home/testgrid/cl-test-grid/work-dir/agent/quicklisp/dists/quicklisp/software/cl-fuse-20150923-git/fuse-grovel-result.c:9:18: fatal error: fuse.h: No such file or directory compilation terminated.
(LOAD cl-fuse-meta-fs FAIL) ASDF/FIND-SYSTEM:LOAD-SYSTEM-DEFINITION-ERROR : Error while trying to load definition for system cl-fuse from pathname /home/testgrid/cl-test-grid/work-dir/agent/quicklisp/dists/quicklisp/software/cl-fuse-20150923-git/cl-fuse.asd: Error in function CFFI-GROVEL:GROVEL-ERROR: External process exited with code 1. Command was: "cc" "-m32" "-I/home/testgrid/cl-test-grid/work-dir/agent/quicklisp/dists/quicklisp/software/cffi_0.16.1/" "-o" "/home/testgrid/cl-test-grid/work-dir/agent/quicklisp/dists/quicklisp/software/cl-fuse-20150923-git/fuse-grovel-result" "/home/testgrid/cl-test-grid/work-dir/agent/quicklisp/dists/quicklisp/software/cl-fuse-20150923-git/fuse-grovel-result.c" Output was: /home/testgrid/cl-test-grid/work-dir/agent/quicklisp/dists/quicklisp/software/cl-fuse-20150923-git/fuse-grovel-result.c:9:18: fatal error: fuse.h: No such file or directory compilation terminated.
cmu-snapshot-2014-05-dirty__20e_unicode_-linux-x86
(LOAD cl-fuse-meta-fs FAIL) ASDF/FIND-SYSTEM:LOAD-SYSTEM-DEFINITION-ERROR : Error while trying to load definition for system cl-fuse from pathname /home/testgrid/cl-test-grid/work-dir/agent/quicklisp/dists/quicklisp/software/cl-fuse-20150923-git/cl-fuse.asd: Error in function CFFI-GROVEL:GROVEL-ERROR: External process exited with code 1. Command was: "cc" "-m32" "-I/home/testgrid/cl-test-grid/work-dir/agent/quicklisp/dists/quicklisp/software/cffi_0.16.1/" "-o" "/home/testgrid/cl-test-grid/work-dir/agent/quicklisp/dists/quicklisp/software/cl-fuse-20150923-git/fuse-grovel-result" "/home/testgrid/cl-test-grid/work-dir/agent/quicklisp/dists/quicklisp/software/cl-fuse-20150923-git/fuse-grovel-result.c" Output was: /home/testgrid/cl-test-grid/work-dir/agent/quicklisp/dists/quicklisp/software/cl-fuse-20150923-git/fuse-grovel-result.c:9:18: fatal error: fuse.h: No such file or directory compilation terminated.
(LOAD cl-fuse-meta-fs FAIL) ASDF/FIND-SYSTEM:LOAD-SYSTEM-DEFINITION-ERROR : Error while trying to load definition for system cl-fuse from pathname /home/testgrid/cl-test-grid/work-dir/agent/quicklisp/dists/quicklisp/software/cl-fuse-20150923-git/cl-fuse.asd: Error in function CFFI-GROVEL:GROVEL-ERROR: External process exited with code 1. Command was: "cc" "-m32" "-I/home/testgrid/cl-test-grid/work-dir/agent/quicklisp/dists/quicklisp/software/cffi_0.16.1/" "-o" "/home/testgrid/cl-test-grid/work-dir/agent/quicklisp/dists/quicklisp/software/cl-fuse-20150923-git/fuse-grovel-result" "/home/testgrid/cl-test-grid/work-dir/agent/quicklisp/dists/quicklisp/software/cl-fuse-20150923-git/fuse-grovel-result.c" Output was: /home/testgrid/cl-test-grid/work-dir/agent/quicklisp/dists/quicklisp/software/cl-fuse-20150923-git/fuse-grovel-result.c:9:18: fatal error: fuse.h: No such file or directory compilation terminated.
cmu-snapshot-2014-12___20f_unicode_-linux-x86
(LOAD cl-fuse-meta-fs FAIL) ASDF/FIND-SYSTEM:LOAD-SYSTEM-DEFINITION-ERROR : Error while trying to load definition for system cl-fuse from pathname /home/testgrid/cl-test-grid/work-dir/agent/quicklisp/dists/quicklisp/software/cl-fuse-20150923-git/cl-fuse.asd: Error in function CFFI-GROVEL:GROVEL-ERROR: External process exited with code 1. Command was: "cc" "-m32" "-I/home/testgrid/cl-test-grid/work-dir/agent/quicklisp/dists/quicklisp/software/cffi_0.16.1/" "-o" "/home/testgrid/cl-test-grid/work-dir/agent/quicklisp/dists/quicklisp/software/cl-fuse-20150923-git/fuse-grovel-result" "/home/testgrid/cl-test-grid/work-dir/agent/quicklisp/dists/quicklisp/software/cl-fuse-20150923-git/fuse-grovel-result.c" Output was: /home/testgrid/cl-test-grid/work-dir/agent/quicklisp/dists/quicklisp/software/cl-fuse-20150923-git/fuse-grovel-result.c:9:18: fatal error: fuse.h: No such file or directory compilation terminated.
(LOAD cl-fuse-meta-fs FAIL) ASDF/FIND-SYSTEM:LOAD-SYSTEM-DEFINITION-ERROR : Error while trying to load definition for system cl-fuse from pathname /home/testgrid/cl-test-grid/work-dir/agent/quicklisp/dists/quicklisp/software/cl-fuse-20150923-git/cl-fuse.asd: Error in function CFFI-GROVEL:GROVEL-ERROR: External process exited with code 1. Command was: "cc" "-m32" "-I/home/testgrid/cl-test-grid/work-dir/agent/quicklisp/dists/quicklisp/software/cffi_0.16.1/" "-o" "/home/testgrid/cl-test-grid/work-dir/agent/quicklisp/dists/quicklisp/software/cl-fuse-20150923-git/fuse-grovel-result" "/home/testgrid/cl-test-grid/work-dir/agent/quicklisp/dists/quicklisp/software/cl-fuse-20150923-git/fuse-grovel-result.c" Output was: /home/testgrid/cl-test-grid/work-dir/agent/quicklisp/dists/quicklisp/software/cl-fuse-20150923-git/fuse-grovel-result.c:9:18: fatal error: fuse.h: No such file or directory compilation terminated.
ecl-13.5.1-44c86e08-macosx-x86-bytecode
(LOAD cl-fuse-meta-fs FAIL) ASDF/FIND-SYSTEM:LOAD-SYSTEM-DEFINITION-ERROR : Error while trying to load definition for system cl-fuse from pathname /Users/testgrid/cl-test-grid/work-dir/agent/quicklisp/dists/quicklisp/software/cl-fuse-20150923-git/cl-fuse.asd: The variable C::*CC-FLAGS* is unbound.
ecl-13.5.1-44c86e08-macosx-x86-lisp-to-c
(LOAD cl-fuse-meta-fs FAIL) ASDF/FIND-SYSTEM:LOAD-SYSTEM-DEFINITION-ERROR : Error while trying to load definition for system cl-fuse from pathname /Users/testgrid/cl-test-grid/work-dir/agent/quicklisp/dists/quicklisp/software/cl-fuse-20150923-git/cl-fuse.asd: External process exited with code 1. Command was: "cc" "-m64" "-I" "/opt/local/include/" " -g -O2 -fPIC -fno-common -g -O2 -fPIC -fno-common -D_THREAD_SAFE -Ddarwin" "-I/Users/testgrid/cl-test-grid/work-dir/agent/quicklisp/dists/quicklisp/software/cffi_0.16.1/" "-o" "/Users/testgrid/cl-test-grid/work-dir/agent/quicklisp/dists/quicklisp/software/cl-fuse-20150923-git/fuse-grovel-result" "/Users/testgrid/cl-test-grid/work-dir/agent/quicklisp/dists/quicklisp/software/cl-fuse-20150923-git/fuse-grovel-result.c" Output was:
ecl-13.5.1-unknown-linux-i686-bytecode
(LOAD cl-fuse-meta-fs FAIL) ASDF/FIND-SYSTEM:LOAD-SYSTEM-DEFINITION-ERROR : Error while trying to load definition for system cl-fuse from pathname /home/testgrid/cl-test-grid/work-dir/agent/quicklisp/dists/quicklisp/software/cl-fuse-20150923-git/cl-fuse.asd: The variable C::*CC-FLAGS* is unbound.
(LOAD cl-fuse-meta-fs FAIL) ASDF/FIND-SYSTEM:LOAD-SYSTEM-DEFINITION-ERROR : Error while trying to load definition for system cl-fuse from pathname /home/testgrid/cl-test-grid/work-dir/agent/quicklisp/dists/quicklisp/software/cl-fuse-20150923-git/cl-fuse.asd: The variable C::*CC-FLAGS* is unbound.
ecl-13.5.1-unknown-linux-i686-lisp-to-c
(LOAD cl-fuse-meta-fs FAIL) ASDF/FIND-SYSTEM:LOAD-SYSTEM-DEFINITION-ERROR : Error while trying to load definition for system cl-fuse from pathname /home/testgrid/cl-test-grid/work-dir/agent/quicklisp/dists/quicklisp/software/cl-fuse-20150923-git/cl-fuse.asd: External process exited with code 1. Command was: "cc" "-m32" " -D_GNU_SOURCE -D_FILE_OFFSET_BITS=64 -g -O2 -fPIC -D_GNU_SOURCE -D_FILE_OFFSET_BITS=64 -g -O2 -fPIC -D_THREAD_SAFE -Dlinux" "-I/home/testgrid/cl-test-grid/work-dir/agent/quicklisp/dists/quicklisp/software/cffi_0.16.1/" "-o" "/home/testgrid/cl-test-grid/work-dir/agent/quicklisp/dists/quicklisp/software/cl-fuse-20150923-git/fuse-grovel-result" "/home/testgrid/cl-test-grid/work-dir/agent/quicklisp/dists/quicklisp/software/cl-fuse-20150923-git/fuse-grovel-result.c" Output was:
(LOAD cl-fuse-meta-fs FAIL) ASDF/FIND-SYSTEM:LOAD-SYSTEM-DEFINITION-ERROR : Error while trying to load definition for system cl-fuse from pathname /home/testgrid/cl-test-grid/work-dir/agent/quicklisp/dists/quicklisp/software/cl-fuse-20150923-git/cl-fuse.asd: External process exited with code 1. Command was: "cc" "-m32" " -D_GNU_SOURCE -D_FILE_OFFSET_BITS=64 -g -O2 -fPIC -D_GNU_SOURCE -D_FILE_OFFSET_BITS=64 -g -O2 -fPIC -D_THREAD_SAFE -Dlinux" "-I/home/testgrid/cl-test-grid/work-dir/agent/quicklisp/dists/quicklisp/software/cffi_0.16.1/" "-o" "/home/testgrid/cl-test-grid/work-dir/agent/quicklisp/dists/quicklisp/software/cl-fuse-20150923-git/fuse-grovel-result" "/home/testgrid/cl-test-grid/work-dir/agent/quicklisp/dists/quicklisp/software/cl-fuse-20150923-git/fuse-grovel-result.c" Output was:
ecl-15.2.21-ee989b97-linux-i686-bytecode
(LOAD cl-fuse-meta-fs FAIL) ASDF/FIND-SYSTEM:LOAD-SYSTEM-DEFINITION-ERROR : Error while trying to load definition for system cl-fuse from pathname /home/testgrid/cl-test-grid/work-dir/agent/quicklisp/dists/quicklisp/software/cl-fuse-20150923-git/cl-fuse.asd: The variable C::*CC-FLAGS* is unbound.
(LOAD cl-fuse-meta-fs FAIL) ASDF/FIND-SYSTEM:LOAD-SYSTEM-DEFINITION-ERROR : Error while trying to load definition for system cl-fuse from pathname /home/testgrid/cl-test-grid/work-dir/agent/quicklisp/dists/quicklisp/software/cl-fuse-20150923-git/cl-fuse.asd: The variable C::*CC-FLAGS* is unbound.
ecl-15.2.21-ee989b97-linux-i686-lisp-to-c
(LOAD cl-fuse-meta-fs FAIL) ASDF/FIND-SYSTEM:LOAD-SYSTEM-DEFINITION-ERROR : Error while trying to load definition for system cl-fuse from pathname /home/testgrid/cl-test-grid/work-dir/agent/quicklisp/dists/quicklisp/software/cl-fuse-20150923-git/cl-fuse.asd: External process exited with code 1. Command was: "cc" "-m32" " -D_GNU_SOURCE -D_FILE_OFFSET_BITS=64 -g -O2 -fPIC -D_THREAD_SAFE -Dlinux" "-I/home/testgrid/cl-test-grid/work-dir/agent/quicklisp/dists/quicklisp/software/cffi_0.16.1/" "-o" "/home/testgrid/cl-test-grid/work-dir/agent/quicklisp/dists/quicklisp/software/cl-fuse-20150923-git/fuse-grovel-result" "/home/testgrid/cl-test-grid/work-dir/agent/quicklisp/dists/quicklisp/software/cl-fuse-20150923-git/fuse-grovel-result.c" Output was:
(LOAD cl-fuse-meta-fs FAIL) ASDF/FIND-SYSTEM:LOAD-SYSTEM-DEFINITION-ERROR : Error while trying to load definition for system cl-fuse from pathname /home/testgrid/cl-test-grid/work-dir/agent/quicklisp/dists/quicklisp/software/cl-fuse-20150923-git/cl-fuse.asd: External process exited with code 1. Command was: "cc" "-m32" " -D_GNU_SOURCE -D_FILE_OFFSET_BITS=64 -g -O2 -fPIC -D_THREAD_SAFE -Dlinux" "-I/home/testgrid/cl-test-grid/work-dir/agent/quicklisp/dists/quicklisp/software/cffi_0.16.1/" "-o" "/home/testgrid/cl-test-grid/work-dir/agent/quicklisp/dists/quicklisp/software/cl-fuse-20150923-git/fuse-grovel-result" "/home/testgrid/cl-test-grid/work-dir/agent/quicklisp/dists/quicklisp/software/cl-fuse-20150923-git/fuse-grovel-result.c" Output was:
ecl-15.2.21-ee989b97-linux-x64-bytecode
(LOAD cl-fuse-meta-fs FAIL) ASDF/FIND-SYSTEM:LOAD-SYSTEM-DEFINITION-ERROR : Error while trying to load definition for system cl-fuse from pathname /home/hijarian/systems/cl-test-grid/work-dir/agent/quicklisp/dists/quicklisp/software/cl-fuse-20150923-git/cl-fuse.asd: The variable C::*CC-FLAGS* is unbound.
(LOAD cl-fuse-meta-fs FAIL) ASDF/FIND-SYSTEM:LOAD-SYSTEM-DEFINITION-ERROR : Error while trying to load definition for system cl-fuse from pathname /home/hijarian/systems/cl-test-grid/work-dir/agent/quicklisp/dists/quicklisp/software/cl-fuse-20150923-git/cl-fuse.asd: The variable C::*CC-FLAGS* is unbound.
ecl-15.2.21-ee989b97-linux-x64-lisp-to-c
(LOAD cl-fuse-meta-fs FAIL) ASDF/FIND-SYSTEM:LOAD-SYSTEM-DEFINITION-ERROR : Error while trying to load definition for system cl-fuse from pathname /home/hijarian/systems/cl-test-grid/work-dir/agent/quicklisp/dists/quicklisp/software/cl-fuse-20150923-git/cl-fuse.asd: External process exited with code 1. Command was: "cc" "-m64" " -D_GNU_SOURCE -D_FILE_OFFSET_BITS=64 -g -O2 -fPIC -D_THREAD_SAFE -Dlinux" "-I/home/hijarian/systems/cl-test-grid/work-dir/agent/quicklisp/dists/quicklisp/software/cffi_0.16.1/" "-o" "/home/hijarian/systems/cl-test-grid/work-dir/agent/quicklisp/dists/quicklisp/software/cl-fuse-20150923-git/fuse-grovel-result" "/home/hijarian/systems/cl-test-grid/work-dir/agent/quicklisp/dists/quicklisp/software/cl-fuse-20150923-git/fuse-grovel-result.c" Output was:
(LOAD cl-fuse-meta-fs FAIL) ASDF/FIND-SYSTEM:LOAD-SYSTEM-DEFINITION-ERROR : Error while trying to load definition for system cl-fuse from pathname /home/hijarian/systems/cl-test-grid/work-dir/agent/quicklisp/dists/quicklisp/software/cl-fuse-20150923-git/cl-fuse.asd: External process exited with code 1. Command was: "cc" "-m64" " -D_GNU_SOURCE -D_FILE_OFFSET_BITS=64 -g -O2 -fPIC -D_THREAD_SAFE -Dlinux" "-I/home/hijarian/systems/cl-test-grid/work-dir/agent/quicklisp/dists/quicklisp/software/cffi_0.16.1/" "-o" "/home/hijarian/systems/cl-test-grid/work-dir/agent/quicklisp/dists/quicklisp/software/cl-fuse-20150923-git/fuse-grovel-result" "/home/hijarian/systems/cl-test-grid/work-dir/agent/quicklisp/dists/quicklisp/software/cl-fuse-20150923-git/fuse-grovel-result.c" Output was:
ecl-16.0.0-98fc12d3-linux-i686-bytecode
(LOAD cl-fuse-meta-fs FAIL) ASDF/FIND-SYSTEM:LOAD-SYSTEM-DEFINITION-ERROR : Error while trying to load definition for system cl-fuse from pathname /home/testgrid/cl-test-grid/work-dir/agent/quicklisp/dists/quicklisp/software/cl-fuse-20150923-git/cl-fuse.asd: The variable C::*CC-FLAGS* is unbound.
(LOAD cl-fuse-meta-fs FAIL) ASDF/FIND-SYSTEM:LOAD-SYSTEM-DEFINITION-ERROR : Error while trying to load definition for system cl-fuse from pathname /home/testgrid/cl-test-grid/work-dir/agent/quicklisp/dists/quicklisp/software/cl-fuse-20150923-git/cl-fuse.asd: The variable C::*CC-FLAGS* is unbound.
ecl-16.0.0-98fc12d3-linux-i686-lisp-to-c
(LOAD cl-fuse-meta-fs FAIL) ASDF/FIND-SYSTEM:LOAD-SYSTEM-DEFINITION-ERROR : Error while trying to load definition for system cl-fuse from pathname /home/testgrid/cl-test-grid/work-dir/agent/quicklisp/dists/quicklisp/software/cl-fuse-20150923-git/cl-fuse.asd: External process exited with code 1. Command was: "cc" "-m32" " -D_GNU_SOURCE -D_FILE_OFFSET_BITS=64 -g -O2 -fPIC -D_THREAD_SAFE -Dlinux" "-I/home/testgrid/cl-test-grid/work-dir/agent/quicklisp/dists/quicklisp/software/cffi_0.16.1/" "-o" "/home/testgrid/cl-test-grid/work-dir/agent/quicklisp/dists/quicklisp/software/cl-fuse-20150923-git/fuse-grovel-result" "/home/testgrid/cl-test-grid/work-dir/agent/quicklisp/dists/quicklisp/software/cl-fuse-20150923-git/fuse-grovel-result.c" Output was:
(LOAD cl-fuse-meta-fs FAIL) ASDF/FIND-SYSTEM:LOAD-SYSTEM-DEFINITION-ERROR : Error while trying to load definition for system cl-fuse from pathname /home/testgrid/cl-test-grid/work-dir/agent/quicklisp/dists/quicklisp/software/cl-fuse-20150923-git/cl-fuse.asd: External process exited with code 1. Command was: "cc" "-m32" " -D_GNU_SOURCE -D_FILE_OFFSET_BITS=64 -g -O2 -fPIC -D_THREAD_SAFE -Dlinux" "-I/home/testgrid/cl-test-grid/work-dir/agent/quicklisp/dists/quicklisp/software/cffi_0.16.1/" "-o" "/home/testgrid/cl-test-grid/work-dir/agent/quicklisp/dists/quicklisp/software/cl-fuse-20150923-git/fuse-grovel-result" "/home/testgrid/cl-test-grid/work-dir/agent/quicklisp/dists/quicklisp/software/cl-fuse-20150923-git/fuse-grovel-result.c" Output was:
ecl-16.1.2-093ba0ab-linux-x64-bytecode
(LOAD cl-fuse-meta-fs FAIL) ASDF/FIND-SYSTEM:LOAD-SYSTEM-DEFINITION-ERROR : Error while trying to load definition for system cl-fuse from pathname /home/jack/quicklisp/local-projects/cl-test-grid/work-dir/agent/quicklisp/dists/quicklisp/software/cl-fuse-20150923-git/cl-fuse.asd: The variable C::*CC-FLAGS* is unbound.
ecl-16.1.2-093ba0ab-linux-x64-lisp-to-c
(LOAD cl-fuse-meta-fs FAIL) ffi, CFFI:LOAD-FOREIGN-LIBRARY-ERROR : Unable to load any of the alternatives: ("/home/jack/quicklisp/local-projects/cl-test-grid/work-dir/agent/quicklisp/dists/quicklisp/software/cl-fuse-20150923-git/libfuse-launcher.so" "libfuse-launcher" #P"/home/jack/quicklisp/local-projects/cl-test-grid/work-dir/agent/quicklisp/dists/quicklisp/software/cl-fuse-20150923-git/libfuse-launcher" #P"/home/jack/quicklisp/local-projects/cl-test-grid/work-dir/agent/quicklisp/dists/quicklisp/software/cl-fuse-20150923-git/libfuse-launcher.so" "/home/jack/quicklisp/local-projects/cl-test-grid/work-dir/agent/quicklisp/dists/quicklisp/software/cl-fuse-20150923-git/libfuse-launcher")
ecl-16.1.2-093ba0ab-linux-x86-bytecode
(LOAD cl-fuse-meta-fs FAIL) ASDF/FIND-SYSTEM:LOAD-SYSTEM-DEFINITION-ERROR : Error while trying to load definition for system cl-fuse from pathname /home/dk/Workspace/cl-test-grid/work-dir/agent/quicklisp/dists/quicklisp/software/cl-fuse-20150923-git/cl-fuse.asd: The variable C::*CC-FLAGS* is unbound.
ecl-16.1.2-093ba0ab-win-x86-bytecode
sbcl-1.0.58-linux-x86
(LOAD cl-fuse-meta-fs FAIL) ASDF:LOAD-SYSTEM-DEFINITION-ERROR : Error while trying to load definition for system bordeaux-threads from pathname /home/testgrid/cl-test-grid/work-dir/agent/quicklisp/dists/quicklisp/software/bordeaux-threads-v0.8.4-git/bordeaux-threads.asd: READ error during COMPILE-FILE: Package UIOP does not exist. Line: 68, Column: 19, File-Position: 2835 Stream: #<SB-SYS:FD-STREAM for "file /home/testgrid/cl-test-grid/work-dir/agent/quicklisp/dists/quicklisp/software/bordeaux-threads-v0.8.4-git/bordeaux-threads.asd" {B0802B9}>
(LOAD cl-fuse-meta-fs FAIL) ASDF:LOAD-SYSTEM-DEFINITION-ERROR : Error while trying to load definition for system cl-fuse from pathname /home/testgrid/cl-test-grid/work-dir/agent/quicklisp/dists/quicklisp/software/cl-fuse-20150923-git/cl-fuse.asd: Error while invoking #<COMPILE-OP NIL {B4EAC71}> on #<CL-SOURCE-FILE "uiop" "image">
sbcl-1.1.11-linux-x86
(LOAD cl-fuse-meta-fs FAIL) ASDF/FIND-SYSTEM:LOAD-SYSTEM-DEFINITION-ERROR : Error while trying to load definition for system cl-fuse from pathname /home/testgrid/cl-test-grid/work-dir/agent/quicklisp/dists/quicklisp/software/cl-fuse-20150923-git/cl-fuse.asd: External process exited with code 1. Command was: "cc" "-m32" "-I/home/testgrid/cl-test-grid/work-dir/agent/quicklisp/dists/quicklisp/software/cffi_0.16.1/" "-o" "/home/testgrid/cl-test-grid/work-dir/agent/quicklisp/dists/quicklisp/software/cl-fuse-20150923-git/fuse-grovel-result" "/home/testgrid/cl-test-grid/work-dir/agent/quicklisp/dists/quicklisp/software/cl-fuse-20150923-git/fuse-grovel-result.c" Output was: /home/testgrid/cl-test-grid/work-dir/agent/quicklisp/dists/quicklisp/software/cl-fuse-20150923-git/fuse-grovel-result.c:9:18: fatal error: fuse.h: No such file or directory compilation terminated.
(LOAD cl-fuse-meta-fs FAIL) ASDF/FIND-SYSTEM:LOAD-SYSTEM-DEFINITION-ERROR : Error while trying to load definition for system cl-fuse from pathname /home/testgrid/cl-test-grid/work-dir/agent/quicklisp/dists/quicklisp/software/cl-fuse-20150923-git/cl-fuse.asd: External process exited with code 1. Command was: "cc" "-m32" "-I/home/testgrid/cl-test-grid/work-dir/agent/quicklisp/dists/quicklisp/software/cffi_0.16.1/" "-o" "/home/testgrid/cl-test-grid/work-dir/agent/quicklisp/dists/quicklisp/software/cl-fuse-20150923-git/fuse-grovel-result" "/home/testgrid/cl-test-grid/work-dir/agent/quicklisp/dists/quicklisp/software/cl-fuse-20150923-git/fuse-grovel-result.c" Output was: /home/testgrid/cl-test-grid/work-dir/agent/quicklisp/dists/quicklisp/software/cl-fuse-20150923-git/fuse-grovel-result.c:9:18: fatal error: fuse.h: No such file or directory compilation terminated.
sbcl-1.1.16-linux-x86
(LOAD cl-fuse-meta-fs FAIL) ASDF/FIND-SYSTEM:LOAD-SYSTEM-DEFINITION-ERROR : Error while trying to load definition for system cl-fuse from pathname /home/testgrid/cl-test-grid/work-dir/agent/quicklisp/dists/quicklisp/software/cl-fuse-20150923-git/cl-fuse.asd: External process exited with code 1. Command was: "cc" "-m32" "-I/home/testgrid/cl-test-grid/work-dir/agent/quicklisp/dists/quicklisp/software/cffi_0.16.1/" "-o" "/home/testgrid/cl-test-grid/work-dir/agent/quicklisp/dists/quicklisp/software/cl-fuse-20150923-git/fuse-grovel-result" "/home/testgrid/cl-test-grid/work-dir/agent/quicklisp/dists/quicklisp/software/cl-fuse-20150923-git/fuse-grovel-result.c" Output was: /home/testgrid/cl-test-grid/work-dir/agent/quicklisp/dists/quicklisp/software/cl-fuse-20150923-git/fuse-grovel-result.c:9:18: fatal error: fuse.h: No such file or directory compilation terminated.
(LOAD cl-fuse-meta-fs FAIL) ASDF/FIND-SYSTEM:LOAD-SYSTEM-DEFINITION-ERROR : Error while trying to load definition for system cl-fuse from pathname /home/testgrid/cl-test-grid/work-dir/agent/quicklisp/dists/quicklisp/software/cl-fuse-20150923-git/cl-fuse.asd: External process exited with code 1. Command was: "cc" "-m32" "-I/home/testgrid/cl-test-grid/work-dir/agent/quicklisp/dists/quicklisp/software/cffi_0.16.1/" "-o" "/home/testgrid/cl-test-grid/work-dir/agent/quicklisp/dists/quicklisp/software/cl-fuse-20150923-git/fuse-grovel-result" "/home/testgrid/cl-test-grid/work-dir/agent/quicklisp/dists/quicklisp/software/cl-fuse-20150923-git/fuse-grovel-result.c" Output was: /home/testgrid/cl-test-grid/work-dir/agent/quicklisp/dists/quicklisp/software/cl-fuse-20150923-git/fuse-grovel-result.c:9:18: fatal error: fuse.h: No such file or directory compilation terminated.
sbcl-1.2.14-linux-arm
(LOAD cl-fuse-meta-fs FAIL) ASDF/FIND-SYSTEM:LOAD-SYSTEM-DEFINITION-ERROR : Error while trying to load definition for system cl-fuse from pathname /home/testgrid/cl-test-grid/work-dir/agent/quicklisp/dists/quicklisp/software/cl-fuse-20150923-git/cl-fuse.asd: External process exited with code 1. Command was: "cc" "-marm" "-I/home/testgrid/cl-test-grid/work-dir/agent/quicklisp/dists/quicklisp/software/cffi_0.16.1/" "-o" "/home/testgrid/cl-test-grid/work-dir/agent/quicklisp/dists/quicklisp/software/cl-fuse-20150923-git/fuse-grovel-result" "/home/testgrid/cl-test-grid/work-dir/agent/quicklisp/dists/quicklisp/software/cl-fuse-20150923-git/fuse-grovel-result.c" Output was: /home/testgrid/cl-test-grid/work-dir/agent/quicklisp/dists/quicklisp/software/cl-fuse-20150923-git/fuse-grovel-result.c:9:18: fatal error: fuse.h: No such file or directory compilation terminated.
(LOAD cl-fuse-meta-fs FAIL) ASDF/FIND-SYSTEM:LOAD-SYSTEM-DEFINITION-ERROR : Error while trying to load definition for system cl-fuse from pathname /home/testgrid/cl-test-grid/work-dir/agent/quicklisp/dists/quicklisp/software/cl-fuse-20150923-git/cl-fuse.asd: External process exited with code 1. Command was: "cc" "-marm" "-I/home/testgrid/cl-test-grid/work-dir/agent/quicklisp/dists/quicklisp/software/cffi_0.16.1/" "-o" "/home/testgrid/cl-test-grid/work-dir/agent/quicklisp/dists/quicklisp/software/cl-fuse-20150923-git/fuse-grovel-result" "/home/testgrid/cl-test-grid/work-dir/agent/quicklisp/dists/quicklisp/software/cl-fuse-20150923-git/fuse-grovel-result.c" Output was: /home/testgrid/cl-test-grid/work-dir/agent/quicklisp/dists/quicklisp/software/cl-fuse-20150923-git/fuse-grovel-result.c:9:18: fatal error: fuse.h: No such file or directory #include <fuse.h> ^ compilation terminated.
(LOAD cl-fuse-meta-fs FAIL) ASDF/FIND-SYSTEM:LOAD-SYSTEM-DEFINITION-ERROR : Error while trying to load definition for system cl-fuse from pathname /home/testgrid/cl-test-grid/work-dir/agent/quicklisp/dists/quicklisp/software/cl-fuse-20150923-git/cl-fuse.asd: External process exited with code 1. Command was: "cc" "-marm" "-I/home/testgrid/cl-test-grid/work-dir/agent/quicklisp/dists/quicklisp/software/cffi_0.16.1/" "-o" "/home/testgrid/cl-test-grid/work-dir/agent/quicklisp/dists/quicklisp/software/cl-fuse-20150923-git/fuse-grovel-result" "/home/testgrid/cl-test-grid/work-dir/agent/quicklisp/dists/quicklisp/software/cl-fuse-20150923-git/fuse-grovel-result.c" Output was: /home/testgrid/cl-test-grid/work-dir/agent/quicklisp/dists/quicklisp/software/cl-fuse-20150923-git/fuse-grovel-result.c:9:18: fatal error: fuse.h: No such file or directory compilation terminated.
(LOAD cl-fuse-meta-fs FAIL) ASDF/FIND-SYSTEM:LOAD-SYSTEM-DEFINITION-ERROR : Error while trying to load definition for system cl-fuse from pathname /home/testgrid/cl-test-grid/work-dir/agent/quicklisp/dists/quicklisp/software/cl-fuse-20150923-git/cl-fuse.asd: External process exited with code 1. Command was: "cc" "-marm" "-I/home/testgrid/cl-test-grid/work-dir/agent/quicklisp/dists/quicklisp/software/cffi_0.16.1/" "-o" "/home/testgrid/cl-test-grid/work-dir/agent/quicklisp/dists/quicklisp/software/cl-fuse-20150923-git/fuse-grovel-result" "/home/testgrid/cl-test-grid/work-dir/agent/quicklisp/dists/quicklisp/software/cl-fuse-20150923-git/fuse-grovel-result.c" Output was: /home/testgrid/cl-test-grid/work-dir/agent/quicklisp/dists/quicklisp/software/cl-fuse-20150923-git/fuse-grovel-result.c:9:18: fatal error: fuse.h: No such file or directory #include <fuse.h> ^ compilation terminated.
sbcl-1.2.3-linux-x64
(LOAD cl-fuse-meta-fs FAIL) ASDF/FIND-SYSTEM:LOAD-SYSTEM-DEFINITION-ERROR : Error while trying to load definition for system cl-fuse from pathname /home/hijarian/systems/cl-test-grid/work-dir/agent/quicklisp/dists/quicklisp/software/cl-fuse-20150923-git/cl-fuse.asd: External process exited with code 1. Command was: "cc" "-m64" "-I/home/hijarian/systems/cl-test-grid/work-dir/agent/quicklisp/dists/quicklisp/software/cffi_0.16.1/" "-o" "/home/hijarian/systems/cl-test-grid/work-dir/agent/quicklisp/dists/quicklisp/software/cl-fuse-20150923-git/fuse-grovel-result" "/home/hijarian/systems/cl-test-grid/work-dir/agent/quicklisp/dists/quicklisp/software/cl-fuse-20150923-git/fuse-grovel-result.c" Output was: /home/hijarian/systems/cl-test-grid/work-dir/agent/quicklisp/dists/quicklisp/software/cl-fuse-20150923-git/fuse-grovel-result.c:9:18: fatal error: fuse.h: Нет такого файла или каталога #include <fuse.h> ^ compilation terminated.
(LOAD cl-fuse-meta-fs FAIL) ASDF/FIND-SYSTEM:LOAD-SYSTEM-DEFINITION-ERROR : Error while trying to load definition for system cl-fuse from pathname /home/hijarian/systems/cl-test-grid/work-dir/agent/quicklisp/dists/quicklisp/software/cl-fuse-20150923-git/cl-fuse.asd: External process exited with code 1. Command was: "cc" "-m64" "-I/home/hijarian/systems/cl-test-grid/work-dir/agent/quicklisp/dists/quicklisp/software/cffi_0.16.1/" "-o" "/home/hijarian/systems/cl-test-grid/work-dir/agent/quicklisp/dists/quicklisp/software/cl-fuse-20150923-git/fuse-grovel-result" "/home/hijarian/systems/cl-test-grid/work-dir/agent/quicklisp/dists/quicklisp/software/cl-fuse-20150923-git/fuse-grovel-result.c" Output was: /home/hijarian/systems/cl-test-grid/work-dir/agent/quicklisp/dists/quicklisp/software/cl-fuse-20150923-git/fuse-grovel-result.c:9:18: fatal error: fuse.h: Нет такого файла или каталога #include <fuse.h> ^ compilation terminated.
sbcl-1.2.3.13-3446e1a-dirty-macosx-x64
(LOAD cl-fuse-meta-fs FAIL) ASDF/FIND-SYSTEM:LOAD-SYSTEM-DEFINITION-ERROR : Error while trying to load definition for system cl-fuse from pathname /Users/testgrid/cl-test-grid/work-dir/agent/quicklisp/dists/quicklisp/software/cl-fuse-20150923-git/cl-fuse.asd: External process exited with code 1. Command was: "cc" "-m64" "-I" "/opt/local/include/" "-I/Users/testgrid/cl-test-grid/work-dir/agent/quicklisp/dists/quicklisp/software/cffi_0.16.1/" "-o" "/Users/testgrid/cl-test-grid/work-dir/agent/quicklisp/dists/quicklisp/software/cl-fuse-20150923-git/fuse-grovel-result" "/Users/testgrid/cl-test-grid/work-dir/agent/quicklisp/dists/quicklisp/software/cl-fuse-20150923-git/fuse-grovel-result.c" Output was: /Users/testgrid/cl-test-grid/work-dir/agent/quicklisp/dists/quicklisp/software/cl-fuse-20150923-git/fuse-grovel-result.c:9:10: fatal error: 'fuse.h' file not found #include <fuse.h> ^ 1 error generated.
sbcl-1.2.6-linux-x86
(LOAD cl-fuse-meta-fs FAIL) ASDF/FIND-SYSTEM:LOAD-SYSTEM-DEFINITION-ERROR : Error while trying to load definition for system cl-fuse from pathname /home/testgrid/cl-test-grid/work-dir/agent/quicklisp/dists/quicklisp/software/cl-fuse-20150923-git/cl-fuse.asd: External process exited with code 1. Command was: "cc" "-m32" "-I/home/testgrid/cl-test-grid/work-dir/agent/quicklisp/dists/quicklisp/software/cffi_0.16.1/" "-o" "/home/testgrid/cl-test-grid/work-dir/agent/quicklisp/dists/quicklisp/software/cl-fuse-20150923-git/fuse-grovel-result" "/home/testgrid/cl-test-grid/work-dir/agent/quicklisp/dists/quicklisp/software/cl-fuse-20150923-git/fuse-grovel-result.c" Output was: /home/testgrid/cl-test-grid/work-dir/agent/quicklisp/dists/quicklisp/software/cl-fuse-20150923-git/fuse-grovel-result.c:9:18: fatal error: fuse.h: No such file or directory compilation terminated.
(LOAD cl-fuse-meta-fs FAIL) ASDF/FIND-SYSTEM:LOAD-SYSTEM-DEFINITION-ERROR : Error while trying to load definition for system cl-fuse from pathname /home/testgrid/cl-test-grid/work-dir/agent/quicklisp/dists/quicklisp/software/cl-fuse-20150923-git/cl-fuse.asd: External process exited with code 1. Command was: "cc" "-m32" "-I/home/testgrid/cl-test-grid/work-dir/agent/quicklisp/dists/quicklisp/software/cffi_0.16.1/" "-o" "/home/testgrid/cl-test-grid/work-dir/agent/quicklisp/dists/quicklisp/software/cl-fuse-20150923-git/fuse-grovel-result" "/home/testgrid/cl-test-grid/work-dir/agent/quicklisp/dists/quicklisp/software/cl-fuse-20150923-git/fuse-grovel-result.c" Output was: /home/testgrid/cl-test-grid/work-dir/agent/quicklisp/dists/quicklisp/software/cl-fuse-20150923-git/fuse-grovel-result.c:9:18: fatal error: fuse.h: No such file or directory compilation terminated.

Breakdown by testcases: for every failed testcase the lisp implmentations it fails on

The library does not have a testsuite adapter for CL Test Grid.

To reports overview

Generated at: 2016-02-04 21:45:37 GMT.