cl-cairo2 results collected by cl-test-grid

Results on the last two Quicklisp distributions

 quicklisp 2016-03-18quicklisp 2016-02-08
abcl-1.2.1-fasl42-linux-x86
(LOAD cl-cairo2-xlib FAIL) ASDF/FIND-SYSTEM:LOAD-SYSTEM-DEFINITION-ERROR : Error while trying to load definition for system cl-freetype2 from pathname /home/testgrid/cl-test-grid/work-dir/agent/quicklisp/dists/quicklisp/software/cl-freetype2-20150709-git/cl-freetype2.asd: Error while trying to load definition for system cffi-toolchain from pathname /home/testgrid/cl-test-grid/work-dir/agent/quicklisp/dists/quicklisp/software/cffi_0.17.1/cffi-toolchain.asd: CFFI-toolchain requires ASDF 3.1!
(LOAD cl-cairo2-gtk2 FAIL) ASDF/FIND-SYSTEM:LOAD-SYSTEM-DEFINITION-ERROR : Error while trying to load definition for system cl-freetype2 from pathname /home/testgrid/cl-test-grid/work-dir/agent/quicklisp/dists/quicklisp/software/cl-freetype2-20150709-git/cl-freetype2.asd: Error while trying to load definition for system cffi-toolchain from pathname /home/testgrid/cl-test-grid/work-dir/agent/quicklisp/dists/quicklisp/software/cffi_0.17.1/cffi-toolchain.asd: CFFI-toolchain requires ASDF 3.1!
(LOAD cl-cairo2-xlib FAIL) ffi-grovel, CFFI-GROVEL:GROVEL-ERROR : External process exited with code 1. Command was: "cc" "-m32" "-I/home/testgrid/cl-test-grid/work-dir/agent/quicklisp/dists/quicklisp/software/cl-freetype2-20150709-git/src/ffi/grovel/" "-I/usr/include/freetype2" "-I/usr/include/freetype2/freetype2" "-I/usr/include/freetype2/freetype" "-I/usr/include/freetype" "-I/home/testgrid/cl-test-grid/work-dir/agent/quicklisp/dists/quicklisp/software/cffi_0.16.1/" "-o" "/home/testgrid/cl-test-grid/work-dir/agent/test-runs/20160219104759-abcl-1.2.1-fasl42-linux-x86/fasl/ql/dists/quicklisp/software/cl-freetype2-20150709-git/src/ffi/grovel/grovel-freetype2" "/home/testgrid/cl-test-grid/work-dir/agent/test-runs/20160219104759-abcl-1.2.1-fasl42-linux-x86/fasl/ql/dists/quicklisp/software/cl-freetype2-20150709-git/src/ffi/grovel/grovel-freetype2.c" Output was: In file included from /home/testgrid/cl-test-grid/work-dir/agent/test-runs/20160219104759-abcl-1.2.1-fasl42-linux-x86/fasl/ql/dists/quicklisp/software/cl-freetype2-20150709-git/src/ffi/grovel/grovel-freetype2.c:6:0: /home/testgrid/cl-test-grid/work-dir/agent/quicklisp/dists/quicklisp/software/cl-freetype2-20150709-git/src/ffi/grovel/grovel-freetype.h:2:22: fatal error: ft2build.h: No such file or directory compilation terminated.
(LOAD cl-cairo2-gtk2 FAIL) ffi-grovel, CFFI-GROVEL:GROVEL-ERROR : External process exited with code 1. Command was: "cc" "-m32" "-I/home/testgrid/cl-test-grid/work-dir/agent/quicklisp/dists/quicklisp/software/cl-freetype2-20150709-git/src/ffi/grovel/" "-I/usr/include/freetype2" "-I/usr/include/freetype2/freetype2" "-I/usr/include/freetype2/freetype" "-I/usr/include/freetype" "-I/home/testgrid/cl-test-grid/work-dir/agent/quicklisp/dists/quicklisp/software/cffi_0.16.1/" "-o" "/home/testgrid/cl-test-grid/work-dir/agent/test-runs/20160219104759-abcl-1.2.1-fasl42-linux-x86/fasl/ql/dists/quicklisp/software/cl-freetype2-20150709-git/src/ffi/grovel/grovel-freetype2" "/home/testgrid/cl-test-grid/work-dir/agent/test-runs/20160219104759-abcl-1.2.1-fasl42-linux-x86/fasl/ql/dists/quicklisp/software/cl-freetype2-20150709-git/src/ffi/grovel/grovel-freetype2.c" Output was: In file included from /home/testgrid/cl-test-grid/work-dir/agent/test-runs/20160219104759-abcl-1.2.1-fasl42-linux-x86/fasl/ql/dists/quicklisp/software/cl-freetype2-20150709-git/src/ffi/grovel/grovel-freetype2.c:6:0: /home/testgrid/cl-test-grid/work-dir/agent/quicklisp/dists/quicklisp/software/cl-freetype2-20150709-git/src/ffi/grovel/grovel-freetype.h:2:22: fatal error: ft2build.h: No such file or directory compilation terminated.
abcl-1.3.0-fasl42-linux-x86
(LOAD cl-cairo2-xlib FAIL) ASDF/FIND-SYSTEM:LOAD-SYSTEM-DEFINITION-ERROR : Error while trying to load definition for system cl-freetype2 from pathname /home/testgrid/cl-test-grid/work-dir/agent/quicklisp/dists/quicklisp/software/cl-freetype2-20150709-git/cl-freetype2.asd: Component "asdf" does not match version 3.1.2, required by #<ASDF/SYSTEM:SYSTEM "cffi-toolchain">
(LOAD cl-cairo2-gtk2 FAIL) ASDF/FIND-SYSTEM:LOAD-SYSTEM-DEFINITION-ERROR : Error while trying to load definition for system cl-freetype2 from pathname /home/testgrid/cl-test-grid/work-dir/agent/quicklisp/dists/quicklisp/software/cl-freetype2-20150709-git/cl-freetype2.asd: Component "asdf" does not match version 3.1.2, required by #<ASDF/SYSTEM:SYSTEM "cffi-toolchain">
(LOAD cl-cairo2-xlib FAIL) ffi-grovel, CFFI-GROVEL:GROVEL-ERROR : External process exited with code 1. Command was: "cc" "-m32" "-I/home/testgrid/cl-test-grid/work-dir/agent/quicklisp/dists/quicklisp/software/cl-freetype2-20150709-git/src/ffi/grovel/" "-I/usr/include/freetype2" "-I/usr/include/freetype2/freetype2" "-I/usr/include/freetype2/freetype" "-I/usr/include/freetype" "-I/home/testgrid/cl-test-grid/work-dir/agent/quicklisp/dists/quicklisp/software/cffi_0.16.1/" "-o" "/home/testgrid/cl-test-grid/work-dir/agent/test-runs/20160218183137-abcl-1.3.0-fasl42-linux-x86/fasl/ql/dists/quicklisp/software/cl-freetype2-20150709-git/src/ffi/grovel/grovel-freetype2" "/home/testgrid/cl-test-grid/work-dir/agent/test-runs/20160218183137-abcl-1.3.0-fasl42-linux-x86/fasl/ql/dists/quicklisp/software/cl-freetype2-20150709-git/src/ffi/grovel/grovel-freetype2.c" Output was: In file included from /home/testgrid/cl-test-grid/work-dir/agent/test-runs/20160218183137-abcl-1.3.0-fasl42-linux-x86/fasl/ql/dists/quicklisp/software/cl-freetype2-20150709-git/src/ffi/grovel/grovel-freetype2.c:6:0: /home/testgrid/cl-test-grid/work-dir/agent/quicklisp/dists/quicklisp/software/cl-freetype2-20150709-git/src/ffi/grovel/grovel-freetype.h:2:22: fatal error: ft2build.h: No such file or directory compilation terminated.
(LOAD cl-cairo2-gtk2 FAIL) ffi-grovel, CFFI-GROVEL:GROVEL-ERROR : External process exited with code 1. Command was: "cc" "-m32" "-I/home/testgrid/cl-test-grid/work-dir/agent/quicklisp/dists/quicklisp/software/cl-freetype2-20150709-git/src/ffi/grovel/" "-I/usr/include/freetype2" "-I/usr/include/freetype2/freetype2" "-I/usr/include/freetype2/freetype" "-I/usr/include/freetype" "-I/home/testgrid/cl-test-grid/work-dir/agent/quicklisp/dists/quicklisp/software/cffi_0.16.1/" "-o" "/home/testgrid/cl-test-grid/work-dir/agent/test-runs/20160218183137-abcl-1.3.0-fasl42-linux-x86/fasl/ql/dists/quicklisp/software/cl-freetype2-20150709-git/src/ffi/grovel/grovel-freetype2" "/home/testgrid/cl-test-grid/work-dir/agent/test-runs/20160218183137-abcl-1.3.0-fasl42-linux-x86/fasl/ql/dists/quicklisp/software/cl-freetype2-20150709-git/src/ffi/grovel/grovel-freetype2.c" Output was: In file included from /home/testgrid/cl-test-grid/work-dir/agent/test-runs/20160218183137-abcl-1.3.0-fasl42-linux-x86/fasl/ql/dists/quicklisp/software/cl-freetype2-20150709-git/src/ffi/grovel/grovel-freetype2.c:6:0: /home/testgrid/cl-test-grid/work-dir/agent/quicklisp/dists/quicklisp/software/cl-freetype2-20150709-git/src/ffi/grovel/grovel-freetype.h:2:22: fatal error: ft2build.h: No such file or directory compilation terminated.
abcl-1.3.1-fasl42-linux-x86
(LOAD cl-cairo2-xlib FAIL) ASDF/FIND-SYSTEM:LOAD-SYSTEM-DEFINITION-ERROR : Error while trying to load definition for system cl-freetype2 from pathname /home/testgrid/cl-test-grid/work-dir/agent/quicklisp/dists/quicklisp/software/cl-freetype2-20150709-git/cl-freetype2.asd: Component "asdf" does not match version 3.1.2, required by #<ASDF/SYSTEM:SYSTEM "cffi-toolchain">
(LOAD cl-cairo2-gtk2 FAIL) ASDF/FIND-SYSTEM:LOAD-SYSTEM-DEFINITION-ERROR : Error while trying to load definition for system cl-freetype2 from pathname /home/testgrid/cl-test-grid/work-dir/agent/quicklisp/dists/quicklisp/software/cl-freetype2-20150709-git/cl-freetype2.asd: Component "asdf" does not match version 3.1.2, required by #<ASDF/SYSTEM:SYSTEM "cffi-toolchain">
(LOAD cl-cairo2-xlib FAIL) ffi-grovel, CFFI-GROVEL:GROVEL-ERROR : External process exited with code 1. Command was: "cc" "-m32" "-I/home/testgrid/cl-test-grid/work-dir/agent/quicklisp/dists/quicklisp/software/cl-freetype2-20150709-git/src/ffi/grovel/" "-I/usr/include/freetype2" "-I/usr/include/freetype2/freetype2" "-I/usr/include/freetype2/freetype" "-I/usr/include/freetype" "-I/home/testgrid/cl-test-grid/work-dir/agent/quicklisp/dists/quicklisp/software/cffi_0.16.1/" "-o" "/home/testgrid/cl-test-grid/work-dir/agent/test-runs/20160217235158-abcl-1.3.1-fasl42-linux-x86/fasl/ql/dists/quicklisp/software/cl-freetype2-20150709-git/src/ffi/grovel/grovel-freetype2" "/home/testgrid/cl-test-grid/work-dir/agent/test-runs/20160217235158-abcl-1.3.1-fasl42-linux-x86/fasl/ql/dists/quicklisp/software/cl-freetype2-20150709-git/src/ffi/grovel/grovel-freetype2.c" Output was: In file included from /home/testgrid/cl-test-grid/work-dir/agent/test-runs/20160217235158-abcl-1.3.1-fasl42-linux-x86/fasl/ql/dists/quicklisp/software/cl-freetype2-20150709-git/src/ffi/grovel/grovel-freetype2.c:6:0: /home/testgrid/cl-test-grid/work-dir/agent/quicklisp/dists/quicklisp/software/cl-freetype2-20150709-git/src/ffi/grovel/grovel-freetype.h:2:22: fatal error: ft2build.h: No such file or directory compilation terminated.
(LOAD cl-cairo2-gtk2 FAIL) ffi-grovel, CFFI-GROVEL:GROVEL-ERROR : External process exited with code 1. Command was: "cc" "-m32" "-I/home/testgrid/cl-test-grid/work-dir/agent/quicklisp/dists/quicklisp/software/cl-freetype2-20150709-git/src/ffi/grovel/" "-I/usr/include/freetype2" "-I/usr/include/freetype2/freetype2" "-I/usr/include/freetype2/freetype" "-I/usr/include/freetype" "-I/home/testgrid/cl-test-grid/work-dir/agent/quicklisp/dists/quicklisp/software/cffi_0.16.1/" "-o" "/home/testgrid/cl-test-grid/work-dir/agent/test-runs/20160217235158-abcl-1.3.1-fasl42-linux-x86/fasl/ql/dists/quicklisp/software/cl-freetype2-20150709-git/src/ffi/grovel/grovel-freetype2" "/home/testgrid/cl-test-grid/work-dir/agent/test-runs/20160217235158-abcl-1.3.1-fasl42-linux-x86/fasl/ql/dists/quicklisp/software/cl-freetype2-20150709-git/src/ffi/grovel/grovel-freetype2.c" Output was: In file included from /home/testgrid/cl-test-grid/work-dir/agent/test-runs/20160217235158-abcl-1.3.1-fasl42-linux-x86/fasl/ql/dists/quicklisp/software/cl-freetype2-20150709-git/src/ffi/grovel/grovel-freetype2.c:6:0: /home/testgrid/cl-test-grid/work-dir/agent/quicklisp/dists/quicklisp/software/cl-freetype2-20150709-git/src/ffi/grovel/grovel-freetype.h:2:22: fatal error: ft2build.h: No such file or directory compilation terminated.
abcl-1.3.2-fasl42-linux-x86
(LOAD cl-cairo2-xlib FAIL) ffi-grovel, CFFI-GROVEL:GROVEL-ERROR : Subprocess with command ("cc" "-m32" "-I/home/testgrid/cl-test-grid/work-dir/agent/quicklisp/dists/quicklisp/software/cl-freetype2-20150709-git/src/ffi/grovel/" "-I/usr/include/freetype2" "-I/usr/include/freetype2/freetype2" "-I/usr/include/freetype2/freetype" "-I/usr/include/freetype" "-o" "/home/testgrid/cl-test-grid/w... "-I/home/testgrid/cl-test-grid/work-dir/agent/quicklisp/dists/quicklisp/software/cffi_0.17.1/" "/home/testgrid/cl-test-grid/work-dir/agent/test-runs/20160324115455-abcl-1.3.2-fasl42-linux-x86/fasl/ql/dists/quicklisp/software/cl-freetype2-20150709-git/src/ffi/grovel/grovel-freetype2__grovel.c") exited with error code 1
(LOAD cl-cairo2-gtk2 FAIL) ffi-grovel, CFFI-GROVEL:GROVEL-ERROR : Subprocess with command ("cc" "-m32" "-I/home/testgrid/cl-test-grid/work-dir/agent/quicklisp/dists/quicklisp/software/cl-freetype2-20150709-git/src/ffi/grovel/" "-I/usr/include/freetype2" "-I/usr/include/freetype2/freetype2" "-I/usr/include/freetype2/freetype" "-I/usr/include/freetype" "-o" "/home/testgrid/cl-test-grid/w... "-I/home/testgrid/cl-test-grid/work-dir/agent/quicklisp/dists/quicklisp/software/cffi_0.17.1/" "/home/testgrid/cl-test-grid/work-dir/agent/test-runs/20160324115455-abcl-1.3.2-fasl42-linux-x86/fasl/ql/dists/quicklisp/software/cl-freetype2-20150709-git/src/ffi/grovel/grovel-freetype2__grovel.c") exited with error code 1
(LOAD cl-cairo2-xlib FAIL) ffi-grovel, CFFI-GROVEL:GROVEL-ERROR : External process exited with code 1. Command was: "cc" "-m32" "-I/home/testgrid/cl-test-grid/work-dir/agent/quicklisp/dists/quicklisp/software/cl-freetype2-20150709-git/src/ffi/grovel/" "-I/usr/include/freetype2" "-I/usr/include/freetype2/freetype2" "-I/usr/include/freetype2/freetype" "-I/usr/include/freetype" "-I/home/testgrid/cl-test-grid/work-dir/agent/quicklisp/dists/quicklisp/software/cffi_0.16.1/" "-o" "/home/testgrid/cl-test-grid/work-dir/agent/test-runs/20160215090312-abcl-1.3.2-fasl42-linux-x86/fasl/ql/dists/quicklisp/software/cl-freetype2-20150709-git/src/ffi/grovel/grovel-freetype2" "/home/testgrid/cl-test-grid/work-dir/agent/test-runs/20160215090312-abcl-1.3.2-fasl42-linux-x86/fasl/ql/dists/quicklisp/software/cl-freetype2-20150709-git/src/ffi/grovel/grovel-freetype2.c" Output was: In file included from /home/testgrid/cl-test-grid/work-dir/agent/test-runs/20160215090312-abcl-1.3.2-fasl42-linux-x86/fasl/ql/dists/quicklisp/software/cl-freetype2-20150709-git/src/ffi/grovel/grovel-freetype2.c:6:0: /home/testgrid/cl-test-grid/work-dir/agent/quicklisp/dists/quicklisp/software/cl-freetype2-20150709-git/src/ffi/grovel/grovel-freetype.h:2:22: fatal error: ft2build.h: No such file or directory compilation terminated.
(LOAD cl-cairo2-gtk2 FAIL) ffi-grovel, CFFI-GROVEL:GROVEL-ERROR : External process exited with code 1. Command was: "cc" "-m32" "-I/home/testgrid/cl-test-grid/work-dir/agent/quicklisp/dists/quicklisp/software/cl-freetype2-20150709-git/src/ffi/grovel/" "-I/usr/include/freetype2" "-I/usr/include/freetype2/freetype2" "-I/usr/include/freetype2/freetype" "-I/usr/include/freetype" "-I/home/testgrid/cl-test-grid/work-dir/agent/quicklisp/dists/quicklisp/software/cffi_0.16.1/" "-o" "/home/testgrid/cl-test-grid/work-dir/agent/test-runs/20160215090312-abcl-1.3.2-fasl42-linux-x86/fasl/ql/dists/quicklisp/software/cl-freetype2-20150709-git/src/ffi/grovel/grovel-freetype2" "/home/testgrid/cl-test-grid/work-dir/agent/test-runs/20160215090312-abcl-1.3.2-fasl42-linux-x86/fasl/ql/dists/quicklisp/software/cl-freetype2-20150709-git/src/ffi/grovel/grovel-freetype2.c" Output was: In file included from /home/testgrid/cl-test-grid/work-dir/agent/test-runs/20160215090312-abcl-1.3.2-fasl42-linux-x86/fasl/ql/dists/quicklisp/software/cl-freetype2-20150709-git/src/ffi/grovel/grovel-freetype2.c:6:0: /home/testgrid/cl-test-grid/work-dir/agent/quicklisp/dists/quicklisp/software/cl-freetype2-20150709-git/src/ffi/grovel/grovel-freetype.h:2:22: fatal error: ft2build.h: No such file or directory compilation terminated.
ccl-1.10-r16196-f101-linux-arm
(LOAD cl-cairo2-xlib FAIL) ffi-grovel, CFFI-GROVEL:GROVEL-ERROR : Subprocess (:PROCESS #<EXTERNAL-PROCESS (cc -marm -I/home/testgrid/cl-test-grid/work-dir/agent/quicklisp/dists/quicklisp/software/cl-freetype2-20150709-git/src/ffi/grovel/ ...)[2327] (EXITED : 1) #x454CB89E>) with command ("cc" "-marm" "-I/home/testgrid/cl-test-grid/work-dir/agent/quicklisp/dists/quicklisp/software/cl-freetype2-20150709-git/src/ffi/grovel/" "-I/usr/include/freetype2" "-I/usr/include/freetype2/freetype2" "-I/usr/include/freetype2/freetype" "-I/usr/include/freetype" "-o" "/home/testgrid/cl-test-grid/w... "-I/home/testgrid/cl-test-grid/work-dir/agent/quicklisp/dists/quicklisp/software/cffi_0.17.1/" "/home/testgrid/cl-test-grid/w... exited with error code 1
(LOAD cl-cairo2-gtk2 FAIL) ffi-grovel, CFFI-GROVEL:GROVEL-ERROR : Subprocess (:PROCESS #<EXTERNAL-PROCESS (cc -marm -I/home/testgrid/cl-test-grid/work-dir/agent/quicklisp/dists/quicklisp/software/cl-freetype2-20150709-git/src/ffi/grovel/ ...)[2318] (EXITED : 1) #x456532C6>) with command ("cc" "-marm" "-I/home/testgrid/cl-test-grid/work-dir/agent/quicklisp/dists/quicklisp/software/cl-freetype2-20150709-git/src/ffi/grovel/" "-I/usr/include/freetype2" "-I/usr/include/freetype2/freetype2" "-I/usr/include/freetype2/freetype" "-I/usr/include/freetype" "-o" "/home/testgrid/cl-test-grid/w... "-I/home/testgrid/cl-test-grid/work-dir/agent/quicklisp/dists/quicklisp/software/cffi_0.17.1/" "/home/testgrid/cl-test-grid/w... exited with error code 1
(LOAD cl-cairo2-xlib FAIL) ffi-grovel, CFFI-GROVEL:GROVEL-ERROR : External process exited with code 1. Command was: "cc" "-marm" "-I/home/testgrid/cl-test-grid/work-dir/agent/quicklisp/dists/quicklisp/software/cl-freetype2-20150709-git/src/ffi/grovel/" "-I/usr/include/freetype2" "-I/usr/include/freetype2/freetype2" "-I/usr/include/freetype2/freetype" "-I/usr/include/freetype" "-I/home/testgrid/cl-test-grid/work-dir/agent/quicklisp/dists/quicklisp/software/cffi_0.16.1/" "-o" "/home/testgrid/cl-test-grid/work-dir/agent/test-runs/20160215053538-ccl-1.10-r16196-f101-linux-arm/fasl/ql/dists/quicklisp/software/cl-freetype2-20150709-git/src/ffi/grovel/grovel-freetype2" "/home/testgrid/cl-test-grid/work-dir/agent/test-runs/20160215053538-ccl-1.10-r16196-f101-linux-arm/fasl/ql/dists/quicklisp/software/cl-freetype2-20150709-git/src/ffi/grovel/grovel-freetype2.c" Output was: In file included from /home/testgrid/cl-test-grid/work-dir/agent/test-runs/20160215053538-ccl-1.10-r16196-f101-linux-arm/fasl/ql/dists/quicklisp/software/cl-freetype2-20150709-git/src/ffi/grovel/grovel-freetype2.c:6:0: /home/testgrid/cl-test-grid/work-dir/agent/quicklisp/dists/quicklisp/software/cl-freetype2-20150709-git/src/ffi/grovel/grovel-freetype.h:2:22: fatal error: ft2build.h: No such file or directory #include <ft2build.h> ^ compilation terminated.
(LOAD cl-cairo2-gtk2 FAIL) ffi-grovel, CFFI-GROVEL:GROVEL-ERROR : External process exited with code 1. Command was: "cc" "-marm" "-I/home/testgrid/cl-test-grid/work-dir/agent/quicklisp/dists/quicklisp/software/cl-freetype2-20150709-git/src/ffi/grovel/" "-I/usr/include/freetype2" "-I/usr/include/freetype2/freetype2" "-I/usr/include/freetype2/freetype" "-I/usr/include/freetype" "-I/home/testgrid/cl-test-grid/work-dir/agent/quicklisp/dists/quicklisp/software/cffi_0.16.1/" "-o" "/home/testgrid/cl-test-grid/work-dir/agent/test-runs/20160215053538-ccl-1.10-r16196-f101-linux-arm/fasl/ql/dists/quicklisp/software/cl-freetype2-20150709-git/src/ffi/grovel/grovel-freetype2" "/home/testgrid/cl-test-grid/work-dir/agent/test-runs/20160215053538-ccl-1.10-r16196-f101-linux-arm/fasl/ql/dists/quicklisp/software/cl-freetype2-20150709-git/src/ffi/grovel/grovel-freetype2.c" Output was: In file included from /home/testgrid/cl-test-grid/work-dir/agent/test-runs/20160215053538-ccl-1.10-r16196-f101-linux-arm/fasl/ql/dists/quicklisp/software/cl-freetype2-20150709-git/src/ffi/grovel/grovel-freetype2.c:6:0: /home/testgrid/cl-test-grid/work-dir/agent/quicklisp/dists/quicklisp/software/cl-freetype2-20150709-git/src/ffi/grovel/grovel-freetype.h:2:22: fatal error: ft2build.h: No such file or directory #include <ft2build.h> ^ compilation terminated.
ccl-1.10-r16196-f96-linux-x64
(LOAD cl-cairo2-xlib FAIL) ASDF/FIND-SYSTEM:LOAD-SYSTEM-DEFINITION-ERROR : Error while trying to load definition for system cl-freetype2 from pathname /home/hijarian/systems/cl-test-grid/work-dir/agent/quicklisp/dists/quicklisp/software/cl-freetype2-20150709-git/cl-freetype2.asd: Serious errors encountered during compilation of "/home/hijarian/systems/cl-test-grid/work-dir/agent/quicklisp/dists/quicklisp/software/cffi_0.17.1/toolchain/asdf-compat.lisp"
(LOAD cl-cairo2-gtk2 FAIL) ASDF/FIND-SYSTEM:LOAD-SYSTEM-DEFINITION-ERROR : Error while trying to load definition for system cl-freetype2 from pathname /home/hijarian/systems/cl-test-grid/work-dir/agent/quicklisp/dists/quicklisp/software/cl-freetype2-20150709-git/cl-freetype2.asd: Serious errors encountered during compilation of "/home/hijarian/systems/cl-test-grid/work-dir/agent/quicklisp/dists/quicklisp/software/cffi_0.17.1/toolchain/asdf-compat.lisp"
ccl-1.10-r16196-f96-linux-x86
(LOAD cl-cairo2-xlib FAIL) ffi-grovel, CFFI-GROVEL:GROVEL-ERROR : Subprocess (:PROCESS #<EXTERNAL-PROCESS (cc -m32 -I/home/testgrid/cl-test-grid/work-dir/agent/quicklisp/dists/quicklisp/software/cl-freetype2-20150709-git/src/ffi/grovel/ ...)[11139] (EXITED : 1) #x18F65CBE>) with command ("cc" "-m32" "-I/home/testgrid/cl-test-grid/work-dir/agent/quicklisp/dists/quicklisp/software/cl-freetype2-20150709-git/src/ffi/grovel/" "-I/usr/include/freetype2" "-I/usr/include/freetype2/freetype2" "-I/usr/include/freetype2/freetype" "-I/usr/include/freetype" "-o" "/home/testgrid/cl-test-grid/w... "-I/home/testgrid/cl-test-grid/work-dir/agent/quicklisp/dists/quicklisp/software/cffi_0.17.1/" "/home/testgrid/cl-test-grid/w... exited with error code 1
(LOAD cl-cairo2-gtk2 FAIL) ffi-grovel, CFFI-GROVEL:GROVEL-ERROR : Subprocess (:PROCESS #<EXTERNAL-PROCESS (cc -m32 -I/home/testgrid/cl-test-grid/work-dir/agent/quicklisp/dists/quicklisp/software/cl-freetype2-20150709-git/src/ffi/grovel/ ...)[11130] (EXITED : 1) #x19165C16>) with command ("cc" "-m32" "-I/home/testgrid/cl-test-grid/work-dir/agent/quicklisp/dists/quicklisp/software/cl-freetype2-20150709-git/src/ffi/grovel/" "-I/usr/include/freetype2" "-I/usr/include/freetype2/freetype2" "-I/usr/include/freetype2/freetype" "-I/usr/include/freetype" "-o" "/home/testgrid/cl-test-grid/w... "-I/home/testgrid/cl-test-grid/work-dir/agent/quicklisp/dists/quicklisp/software/cffi_0.17.1/" "/home/testgrid/cl-test-grid/w... exited with error code 1
ccl-1.11-r16635-f96-linux-x86
(LOAD cl-cairo2-xlib FAIL) ffi-grovel, CFFI-GROVEL:GROVEL-ERROR : Subprocess (:PROCESS #<EXTERNAL-PROCESS (cc -m32 -I/home/testgrid/cl-test-grid/work-dir/agent/quicklisp/dists/quicklisp/software/cl-freetype2-20150709-git/src/ffi/grovel/ ...)[27573] (EXITED : 1) #x18F4DED6>) with command ("cc" "-m32" "-I/home/testgrid/cl-test-grid/work-dir/agent/quicklisp/dists/quicklisp/software/cl-freetype2-20150709-git/src/ffi/grovel/" "-I/usr/include/freetype2" "-I/usr/include/freetype2/freetype2" "-I/usr/include/freetype2/freetype" "-I/usr/include/freetype" "-o" "/home/testgrid/cl-test-grid/w... "-I/home/testgrid/cl-test-grid/work-dir/agent/quicklisp/dists/quicklisp/software/cffi_0.17.1/" "/home/testgrid/cl-test-grid/w... exited with error code 1
(LOAD cl-cairo2-gtk2 FAIL) ffi-grovel, CFFI-GROVEL:GROVEL-ERROR : Subprocess (:PROCESS #<EXTERNAL-PROCESS (cc -m32 -I/home/testgrid/cl-test-grid/work-dir/agent/quicklisp/dists/quicklisp/software/cl-freetype2-20150709-git/src/ffi/grovel/ ...)[27564] (EXITED : 1) #x1910A256>) with command ("cc" "-m32" "-I/home/testgrid/cl-test-grid/work-dir/agent/quicklisp/dists/quicklisp/software/cl-freetype2-20150709-git/src/ffi/grovel/" "-I/usr/include/freetype2" "-I/usr/include/freetype2/freetype2" "-I/usr/include/freetype2/freetype" "-I/usr/include/freetype" "-o" "/home/testgrid/cl-test-grid/w... "-I/home/testgrid/cl-test-grid/work-dir/agent/quicklisp/dists/quicklisp/software/cffi_0.17.1/" "/home/testgrid/cl-test-grid/w... exited with error code 1
(LOAD cl-cairo2-xlib FAIL) ffi-grovel, CFFI-GROVEL:GROVEL-ERROR : External process exited with code 1. Command was: "cc" "-m32" "-I/home/testgrid/cl-test-grid/work-dir/agent/quicklisp/dists/quicklisp/software/cl-freetype2-20150709-git/src/ffi/grovel/" "-I/usr/include/freetype2" "-I/usr/include/freetype2/freetype2" "-I/usr/include/freetype2/freetype" "-I/usr/include/freetype" "-I/home/testgrid/cl-test-grid/work-dir/agent/quicklisp/dists/quicklisp/software/cffi_0.16.1/" "-o" "/home/testgrid/cl-test-grid/work-dir/agent/test-runs/20160216034139-ccl-1.11-r16635-f96-linux-x86/fasl/ql/dists/quicklisp/software/cl-freetype2-20150709-git/src/ffi/grovel/grovel-freetype2" "/home/testgrid/cl-test-grid/work-dir/agent/test-runs/20160216034139-ccl-1.11-r16635-f96-linux-x86/fasl/ql/dists/quicklisp/software/cl-freetype2-20150709-git/src/ffi/grovel/grovel-freetype2.c" Output was: In file included from /home/testgrid/cl-test-grid/work-dir/agent/test-runs/20160216034139-ccl-1.11-r16635-f96-linux-x86/fasl/ql/dists/quicklisp/software/cl-freetype2-20150709-git/src/ffi/grovel/grovel-freetype2.c:6:0: /home/testgrid/cl-test-grid/work-dir/agent/quicklisp/dists/quicklisp/software/cl-freetype2-20150709-git/src/ffi/grovel/grovel-freetype.h:2:22: fatal error: ft2build.h: No such file or directory compilation terminated.
(LOAD cl-cairo2-gtk2 FAIL) ffi-grovel, CFFI-GROVEL:GROVEL-ERROR : External process exited with code 1. Command was: "cc" "-m32" "-I/home/testgrid/cl-test-grid/work-dir/agent/quicklisp/dists/quicklisp/software/cl-freetype2-20150709-git/src/ffi/grovel/" "-I/usr/include/freetype2" "-I/usr/include/freetype2/freetype2" "-I/usr/include/freetype2/freetype" "-I/usr/include/freetype" "-I/home/testgrid/cl-test-grid/work-dir/agent/quicklisp/dists/quicklisp/software/cffi_0.16.1/" "-o" "/home/testgrid/cl-test-grid/work-dir/agent/test-runs/20160216034139-ccl-1.11-r16635-f96-linux-x86/fasl/ql/dists/quicklisp/software/cl-freetype2-20150709-git/src/ffi/grovel/grovel-freetype2" "/home/testgrid/cl-test-grid/work-dir/agent/test-runs/20160216034139-ccl-1.11-r16635-f96-linux-x86/fasl/ql/dists/quicklisp/software/cl-freetype2-20150709-git/src/ffi/grovel/grovel-freetype2.c" Output was: In file included from /home/testgrid/cl-test-grid/work-dir/agent/test-runs/20160216034139-ccl-1.11-r16635-f96-linux-x86/fasl/ql/dists/quicklisp/software/cl-freetype2-20150709-git/src/ffi/grovel/grovel-freetype2.c:6:0: /home/testgrid/cl-test-grid/work-dir/agent/quicklisp/dists/quicklisp/software/cl-freetype2-20150709-git/src/ffi/grovel/grovel-freetype.h:2:22: fatal error: ft2build.h: No such file or directory compilation terminated.
ccl-1.11-r16635-f96-macosx-x64
(LOAD cl-cairo2-xlib FAIL) ffi-grovel, CFFI-GROVEL:GROVEL-ERROR : External process exited with code 1. Command was: "cc" "-m64" "-I/Users/testgrid/cl-test-grid/work-dir/agent/quicklisp/dists/quicklisp/software/cl-freetype2-20150709-git/src/ffi/grovel/" "-I" "/opt/local/include/" "-I/opt/local/include/freetype2" "-I/Users/testgrid/cl-test-grid/work-dir/agent/quicklisp/dists/quicklisp/software/cffi_0.16.1/" "-o" "/Users/testgrid/cl-test-grid/work-dir/agent/test-runs/20160220010916-ccl-1.11-r16635-f96-macosx-x64/fasl/ql/dists/quicklisp/software/cl-freetype2-20150709-git/src/ffi/grovel/grovel-freetype2" "/Users/testgrid/cl-test-grid/work-dir/agent/test-runs/20160220010916-ccl-1.11-r16635-f96-macosx-x64/fasl/ql/dists/quicklisp/software/cl-freetype2-20150709-git/src/ffi/grovel/grovel-freetype2.c" Output was: In file included from /Users/testgrid/cl-test-grid/work-dir/agent/test-runs/20160220010916-ccl-1.11-r16635-f96-macosx-x64/fasl/ql/dists/quicklisp/software/cl-freetype2-20150709-git/src/ffi/grovel/grovel-freetype2.c:6: /Users/testgrid/cl-test-grid/work-dir/agent/quicklisp/dists/quicklisp/software/cl-freetype2-20150709-git/src/ffi/grovel/grovel-freetype.h:2:10: fatal error: 'ft2build.h' file not found #include <ft2build.h> ^ 1 error generated.
(LOAD cl-cairo2-gtk2 FAIL) ffi-grovel, CFFI-GROVEL:GROVEL-ERROR : External process exited with code 1. Command was: "cc" "-m64" "-I/Users/testgrid/cl-test-grid/work-dir/agent/quicklisp/dists/quicklisp/software/cl-freetype2-20150709-git/src/ffi/grovel/" "-I" "/opt/local/include/" "-I/opt/local/include/freetype2" "-I/Users/testgrid/cl-test-grid/work-dir/agent/quicklisp/dists/quicklisp/software/cffi_0.16.1/" "-o" "/Users/testgrid/cl-test-grid/work-dir/agent/test-runs/20160220010916-ccl-1.11-r16635-f96-macosx-x64/fasl/ql/dists/quicklisp/software/cl-freetype2-20150709-git/src/ffi/grovel/grovel-freetype2" "/Users/testgrid/cl-test-grid/work-dir/agent/test-runs/20160220010916-ccl-1.11-r16635-f96-macosx-x64/fasl/ql/dists/quicklisp/software/cl-freetype2-20150709-git/src/ffi/grovel/grovel-freetype2.c" Output was: In file included from /Users/testgrid/cl-test-grid/work-dir/agent/test-runs/20160220010916-ccl-1.11-r16635-f96-macosx-x64/fasl/ql/dists/quicklisp/software/cl-freetype2-20150709-git/src/ffi/grovel/grovel-freetype2.c:6: /Users/testgrid/cl-test-grid/work-dir/agent/quicklisp/dists/quicklisp/software/cl-freetype2-20150709-git/src/ffi/grovel/grovel-freetype.h:2:10: fatal error: 'ft2build.h' file not found #include <ft2build.h> ^ 1 error generated.
ccl-1.11-r16635-f96-macosx-x86
(LOAD cl-cairo2-xlib FAIL) ffi-grovel, CFFI-GROVEL:GROVEL-ERROR : External process exited with code 1. Command was: "cc" "-m32" "-I/Users/testgrid/cl-test-grid/work-dir/agent/quicklisp/dists/quicklisp/software/cl-freetype2-20150709-git/src/ffi/grovel/" "-I" "/opt/local/include/" "-I/opt/local/include/freetype2" "-I/Users/testgrid/cl-test-grid/work-dir/agent/quicklisp/dists/quicklisp/software/cffi_0.16.1/" "-o" "/Users/testgrid/cl-test-grid/work-dir/agent/test-runs/20160219210452-ccl-1.11-r16635-f96-macosx-x86/fasl/ql/dists/quicklisp/software/cl-freetype2-20150709-git/src/ffi/grovel/grovel-freetype2" "/Users/testgrid/cl-test-grid/work-dir/agent/test-runs/20160219210452-ccl-1.11-r16635-f96-macosx-x86/fasl/ql/dists/quicklisp/software/cl-freetype2-20150709-git/src/ffi/grovel/grovel-freetype2.c" Output was: In file included from /Users/testgrid/cl-test-grid/work-dir/agent/test-runs/20160219210452-ccl-1.11-r16635-f96-macosx-x86/fasl/ql/dists/quicklisp/software/cl-freetype2-20150709-git/src/ffi/grovel/grovel-freetype2.c:6: /Users/testgrid/cl-test-grid/work-dir/agent/quicklisp/dists/quicklisp/software/cl-freetype2-20150709-git/src/ffi/grovel/grovel-freetype.h:2:10: fatal error: 'ft2build.h' file not found #include <ft2build.h> ^ 1 error generated.
(LOAD cl-cairo2-gtk2 FAIL) ffi, CFFI:LOAD-FOREIGN-LIBRARY-ERROR : Unable to load foreign library (LIBCAIRO). Error opening shared library /usr/local/Cellar/cairo/1.14.6/lib/libcairo.2.dylib : dlopen(/usr/local/Cellar/cairo/1.14.6/lib/libcairo.2.dylib, 10): no suitable image found. Did find: /usr/local/Cellar/cairo/1.14.6/lib/libcairo.2.dylib: mach-o, but wrong architecture.
(LOAD cl-cairo2-demos FAIL) ffi, CFFI:LOAD-FOREIGN-LIBRARY-ERROR : Unable to load foreign library (LIBCAIRO). Error opening shared library /usr/local/Cellar/cairo/1.14.6/lib/libcairo.2.dylib : dlopen(/usr/local/Cellar/cairo/1.14.6/lib/libcairo.2.dylib, 10): no suitable image found. Did find: /usr/local/Cellar/cairo/1.14.6/lib/libcairo.2.dylib: mach-o, but wrong architecture.
(LOAD cl-cairo2 FAIL) ffi, CFFI:LOAD-FOREIGN-LIBRARY-ERROR : Unable to load foreign library (LIBCAIRO). Error opening shared library /usr/local/Cellar/cairo/1.14.6/lib/libcairo.2.dylib : dlopen(/usr/local/Cellar/cairo/1.14.6/lib/libcairo.2.dylib, 10): no suitable image found. Did find: /usr/local/Cellar/cairo/1.14.6/lib/libcairo.2.dylib: mach-o, but wrong architecture.
(LOAD a-cl-cairo2-loader FAIL) ffi, CFFI:LOAD-FOREIGN-LIBRARY-ERROR : Unable to load foreign library (LIBCAIRO). Error opening shared library /usr/local/Cellar/cairo/1.14.6/lib/libcairo.2.dylib : dlopen(/usr/local/Cellar/cairo/1.14.6/lib/libcairo.2.dylib, 10): no suitable image found. Did find: /usr/local/Cellar/cairo/1.14.6/lib/libcairo.2.dylib: mach-o, but wrong architecture.
ccl-1.11-r16702m-f101-linux-arm
(LOAD cl-cairo2-gtk2 FAIL) COMMON-LISP:SIMPLE-ERROR : Can not define 'gsize', unknown CPU architecture (known are x86 and x86-64)
ccl-1.11-rc1-r16536-f101-linux-arm
(LOAD cl-cairo2-xlib FAIL) ffi-grovel, CFFI-GROVEL:GROVEL-ERROR : Subprocess (:PROCESS #<EXTERNAL-PROCESS (cc -marm -I/home/testgrid/cl-test-grid/work-dir/agent/quicklisp/dists/quicklisp/software/cl-freetype2-20150709-git/src/ffi/grovel/ ...)[22648] (EXITED : 1) #x454AE656>) with command ("cc" "-marm" "-I/home/testgrid/cl-test-grid/work-dir/agent/quicklisp/dists/quicklisp/software/cl-freetype2-20150709-git/src/ffi/grovel/" "-I/usr/include/freetype2" "-I/usr/include/freetype2/freetype2" "-I/usr/include/freetype2/freetype" "-I/usr/include/freetype" "-o" "/home/testgrid/cl-test-grid/w... "-I/home/testgrid/cl-test-grid/work-dir/agent/quicklisp/dists/quicklisp/software/cffi_0.17.1/" "/home/testgrid/cl-test-grid/w... exited with error code 1
(LOAD cl-cairo2-gtk2 FAIL) ffi-grovel, CFFI-GROVEL:GROVEL-ERROR : Subprocess (:PROCESS #<EXTERNAL-PROCESS (cc -marm -I/home/testgrid/cl-test-grid/work-dir/agent/quicklisp/dists/quicklisp/software/cl-freetype2-20150709-git/src/ffi/grovel/ ...)[22639] (EXITED : 1) #x451F899E>) with command ("cc" "-marm" "-I/home/testgrid/cl-test-grid/work-dir/agent/quicklisp/dists/quicklisp/software/cl-freetype2-20150709-git/src/ffi/grovel/" "-I/usr/include/freetype2" "-I/usr/include/freetype2/freetype2" "-I/usr/include/freetype2/freetype" "-I/usr/include/freetype" "-o" "/home/testgrid/cl-test-grid/w... "-I/home/testgrid/cl-test-grid/work-dir/agent/quicklisp/dists/quicklisp/software/cffi_0.17.1/" "/home/testgrid/cl-test-grid/w... exited with error code 1
(LOAD cl-cairo2-xlib FAIL) ffi-grovel, CFFI-GROVEL:GROVEL-ERROR : External process exited with code 1. Command was: "cc" "-marm" "-I/home/testgrid/cl-test-grid/work-dir/agent/quicklisp/dists/quicklisp/software/cl-freetype2-20150709-git/src/ffi/grovel/" "-I/usr/include/freetype2" "-I/usr/include/freetype2/freetype2" "-I/usr/include/freetype2/freetype" "-I/usr/include/freetype" "-I/home/testgrid/cl-test-grid/work-dir/agent/quicklisp/dists/quicklisp/software/cffi_0.16.1/" "-o" "/home/testgrid/cl-test-grid/work-dir/agent/test-runs/20160216170231-ccl-1.11-rc1-r16536-f101-linux-arm/fasl/ql/dists/quicklisp/software/cl-freetype2-20150709-git/src/ffi/grovel/grovel-freetype2" "/home/testgrid/cl-test-grid/work-dir/agent/test-runs/20160216170231-ccl-1.11-rc1-r16536-f101-linux-arm/fasl/ql/dists/quicklisp/software/cl-freetype2-20150709-git/src/ffi/grovel/grovel-freetype2.c" Output was: In file included from /home/testgrid/cl-test-grid/wo... /home/testgrid/cl-test-grid/work-dir/agent/quicklisp/dists/quicklisp/software/cl-freetype2-20150709-git/src/ffi/grovel/grovel-freetype.h:2:22: fatal error: ft2build.h: No such file or directory #include <ft2build.h> ^ compilation terminated.
(LOAD cl-cairo2-gtk2 FAIL) ffi-grovel, CFFI-GROVEL:GROVEL-ERROR : External process exited with code 1. Command was: "cc" "-marm" "-I/home/testgrid/cl-test-grid/work-dir/agent/quicklisp/dists/quicklisp/software/cl-freetype2-20150709-git/src/ffi/grovel/" "-I/usr/include/freetype2" "-I/usr/include/freetype2/freetype2" "-I/usr/include/freetype2/freetype" "-I/usr/include/freetype" "-I/home/testgrid/cl-test-grid/work-dir/agent/quicklisp/dists/quicklisp/software/cffi_0.16.1/" "-o" "/home/testgrid/cl-test-grid/work-dir/agent/test-runs/20160216170231-ccl-1.11-rc1-r16536-f101-linux-arm/fasl/ql/dists/quicklisp/software/cl-freetype2-20150709-git/src/ffi/grovel/grovel-freetype2" "/home/testgrid/cl-test-grid/work-dir/agent/test-runs/20160216170231-ccl-1.11-rc1-r16536-f101-linux-arm/fasl/ql/dists/quicklisp/software/cl-freetype2-20150709-git/src/ffi/grovel/grovel-freetype2.c" Output was: In file included from /home/testgrid/cl-test-grid/wo... /home/testgrid/cl-test-grid/work-dir/agent/quicklisp/dists/quicklisp/software/cl-freetype2-20150709-git/src/ffi/grovel/grovel-freetype.h:2:22: fatal error: ft2build.h: No such file or directory #include <ft2build.h> ^ compilation terminated.
ccl-1.11-rc1-r16536-f96-linux-x86
(LOAD cl-cairo2-xlib FAIL) ffi-grovel, CFFI-GROVEL:GROVEL-ERROR : Subprocess (:PROCESS #<EXTERNAL-PROCESS (cc -m32 -I/home/testgrid/cl-test-grid/work-dir/agent/quicklisp/dists/quicklisp/software/cl-freetype2-20150709-git/src/ffi/grovel/ ...)[24260] (EXITED : 1) #x18EC52C6>) with command ("cc" "-m32" "-I/home/testgrid/cl-test-grid/work-dir/agent/quicklisp/dists/quicklisp/software/cl-freetype2-20150709-git/src/ffi/grovel/" "-I/usr/include/freetype2" "-I/usr/include/freetype2/freetype2" "-I/usr/include/freetype2/freetype" "-I/usr/include/freetype" "-o" "/home/testgrid/cl-test-grid/w... "-I/home/testgrid/cl-test-grid/work-dir/agent/quicklisp/dists/quicklisp/software/cffi_0.17.1/" "/home/testgrid/cl-test-grid/w... exited with error code 1
(LOAD cl-cairo2-gtk2 FAIL) ffi-grovel, CFFI-GROVEL:GROVEL-ERROR : Subprocess (:PROCESS #<EXTERNAL-PROCESS (cc -m32 -I/home/testgrid/cl-test-grid/work-dir/agent/quicklisp/dists/quicklisp/software/cl-freetype2-20150709-git/src/ffi/grovel/ ...)[24250] (EXITED : 1) #x19174116>) with command ("cc" "-m32" "-I/home/testgrid/cl-test-grid/work-dir/agent/quicklisp/dists/quicklisp/software/cl-freetype2-20150709-git/src/ffi/grovel/" "-I/usr/include/freetype2" "-I/usr/include/freetype2/freetype2" "-I/usr/include/freetype2/freetype" "-I/usr/include/freetype" "-o" "/home/testgrid/cl-test-grid/w... "-I/home/testgrid/cl-test-grid/work-dir/agent/quicklisp/dists/quicklisp/software/cffi_0.17.1/" "/home/testgrid/cl-test-grid/w... exited with error code 1
(LOAD cl-cairo2-xlib FAIL) ffi-grovel, CFFI-GROVEL:GROVEL-ERROR : External process exited with code 1. Command was: "cc" "-m32" "-I/home/testgrid/cl-test-grid/work-dir/agent/quicklisp/dists/quicklisp/software/cl-freetype2-20150709-git/src/ffi/grovel/" "-I/usr/include/freetype2" "-I/usr/include/freetype2/freetype2" "-I/usr/include/freetype2/freetype" "-I/usr/include/freetype" "-I/home/testgrid/cl-test-grid/work-dir/agent/quicklisp/dists/quicklisp/software/cffi_0.16.1/" "-o" "/home/testgrid/cl-test-grid/work-dir/agent/test-runs/20160216134117-ccl-1.11-rc1-r16536-f96-linux-x86/fasl/ql/dists/quicklisp/software/cl-freetype2-20150709-git/src/ffi/grovel/grovel-freetype2" "/home/testgrid/cl-test-grid/work-dir/agent/test-runs/20160216134117-ccl-1.11-rc1-r16536-f96-linux-x86/fasl/ql/dists/quicklisp/software/cl-freetype2-20150709-git/src/ffi/grovel/grovel-freetype2.c" Output was: In file included from /home/testgrid/cl-test-grid/work-dir/agent/test-runs/20160216134117-ccl-1.11-rc1-r16536-f96-linux-x86/fasl/ql/dists/quicklisp/software/cl-freetype2-20150709-git/src/ffi/grovel/grovel-freetype2.c:6:0: /home/testgrid/cl-test-grid/work-dir/agent/quicklisp/dists/quicklisp/software/cl-freetype2-20150709-git/src/ffi/grovel/grovel-freetype.h:2:22: fatal error: ft2build.h: No such file or directory compilation terminated.
(LOAD cl-cairo2-gtk2 FAIL) ffi-grovel, CFFI-GROVEL:GROVEL-ERROR : External process exited with code 1. Command was: "cc" "-m32" "-I/home/testgrid/cl-test-grid/work-dir/agent/quicklisp/dists/quicklisp/software/cl-freetype2-20150709-git/src/ffi/grovel/" "-I/usr/include/freetype2" "-I/usr/include/freetype2/freetype2" "-I/usr/include/freetype2/freetype" "-I/usr/include/freetype" "-I/home/testgrid/cl-test-grid/work-dir/agent/quicklisp/dists/quicklisp/software/cffi_0.16.1/" "-o" "/home/testgrid/cl-test-grid/work-dir/agent/test-runs/20160216134117-ccl-1.11-rc1-r16536-f96-linux-x86/fasl/ql/dists/quicklisp/software/cl-freetype2-20150709-git/src/ffi/grovel/grovel-freetype2" "/home/testgrid/cl-test-grid/work-dir/agent/test-runs/20160216134117-ccl-1.11-rc1-r16536-f96-linux-x86/fasl/ql/dists/quicklisp/software/cl-freetype2-20150709-git/src/ffi/grovel/grovel-freetype2.c" Output was: In file included from /home/testgrid/cl-test-grid/work-dir/agent/test-runs/20160216134117-ccl-1.11-rc1-r16536-f96-linux-x86/fasl/ql/dists/quicklisp/software/cl-freetype2-20150709-git/src/ffi/grovel/grovel-freetype2.c:6:0: /home/testgrid/cl-test-grid/work-dir/agent/quicklisp/dists/quicklisp/software/cl-freetype2-20150709-git/src/ffi/grovel/grovel-freetype.h:2:22: fatal error: ft2build.h: No such file or directory compilation terminated.
ccl-1.8-r15286m-f95-linux-x86
(LOAD cl-cairo2-xlib FAIL) ASDF:LOAD-SYSTEM-DEFINITION-ERROR : Error while trying to load definition for system cffi from pathname /home/testgrid/cl-test-grid/work-dir/agent/quicklisp/dists/quicklisp/software/cffi_0.17.1/cffi.asd: Extra arguments in (OPERATE 'TEST-OP :CFFI-TESTS) don't match lambda list (O C).
(LOAD cl-cairo2-gtk2 FAIL) ASDF:LOAD-SYSTEM-DEFINITION-ERROR : Error while trying to load definition for system cffi from pathname /home/testgrid/cl-test-grid/work-dir/agent/quicklisp/dists/quicklisp/software/cffi_0.17.1/cffi.asd: Extra arguments in (OPERATE 'TEST-OP :CFFI-TESTS) don't match lambda list (O C).
(LOAD cl-cairo2-demos FAIL) ASDF:LOAD-SYSTEM-DEFINITION-ERROR : Error while trying to load definition for system cffi from pathname /home/testgrid/cl-test-grid/work-dir/agent/quicklisp/dists/quicklisp/software/cffi_0.17.1/cffi.asd: Extra arguments in (OPERATE 'TEST-OP :CFFI-TESTS) don't match lambda list (O C).
(LOAD cl-cairo2 FAIL) ASDF:LOAD-SYSTEM-DEFINITION-ERROR : Error while trying to load definition for system cffi from pathname /home/testgrid/cl-test-grid/work-dir/agent/quicklisp/dists/quicklisp/software/cffi_0.17.1/cffi.asd: Extra arguments in (OPERATE 'TEST-OP :CFFI-TESTS) don't match lambda list (O C).
(LOAD a-cl-cairo2-loader FAIL) ASDF:LOAD-SYSTEM-DEFINITION-ERROR : Error while trying to load definition for system cffi from pathname /home/testgrid/cl-test-grid/work-dir/agent/quicklisp/dists/quicklisp/software/cffi_0.17.1/cffi.asd: Extra arguments in (OPERATE 'TEST-OP :CFFI-TESTS) don't match lambda list (O C).
(LOAD cl-cairo2-xlib FAIL) ffi-grovel, CFFI-GROVEL:GROVEL-ERROR : External process exited with code 1. Command was: "cc" "-m32" "-I/home/testgrid/cl-test-grid/work-dir/agent/quicklisp/dists/quicklisp/software/cl-freetype2-20150709-git/src/ffi/grovel/" "-I/usr/include/freetype2" "-I/usr/include/freetype2/freetype2" "-I/usr/include/freetype2/freetype" "-I/usr/include/freetype" "-I/home/testgrid/cl-test-grid/work-dir/agent/quicklisp/dists/quicklisp/software/cffi_0.16.1/" "-o" "/home/testgrid/cl-test-grid/work-dir/agent/test-runs/20160217020635-ccl-1.8-r15286m-f95-linux-x86/fasl/ql/dists/quicklisp/software/cl-freetype2-20150709-git/src/ffi/grovel/grovel-freetype2" "/home/testgrid/cl-test-grid/work-dir/agent/test-runs/20160217020635-ccl-1.8-r15286m-f95-linux-x86/fasl/ql/dists/quicklisp/software/cl-freetype2-20150709-git/src/ffi/grovel/grovel-freetype2.c" Output was: In file included from /home/testgrid/cl-test-grid/work-dir/agent/test-runs/20160217020635-ccl-1.8-r15286m-f95-linux-x86/fasl/ql/dists/quicklisp/software/cl-freetype2-20150709-git/src/ffi/grovel/grovel-freetype2.c:6:0: /home/testgrid/cl-test-grid/work-dir/agent/quicklisp/dists/quicklisp/software/cl-freetype2-20150709-git/src/ffi/grovel/grovel-freetype.h:2:22: fatal error: ft2build.h: No such file or directory compilation terminated.
(LOAD cl-cairo2-gtk2 FAIL) ASDF:LOAD-SYSTEM-DEFINITION-ERROR : Error while trying to load definition for system bordeaux-threads from pathname /home/testgrid/cl-test-grid/work-dir/agent/quicklisp/dists/quicklisp/software/bordeaux-threads-v0.8.4-git/bordeaux-threads.asd: There is no package named "UIOP" .
ccl-1.8-r15286m-f97-linux-arm
(LOAD cl-cairo2-xlib FAIL) ASDF:LOAD-SYSTEM-DEFINITION-ERROR : Error while trying to load definition for system cffi from pathname /home/testgrid/cl-test-grid/work-dir/agent/quicklisp/dists/quicklisp/software/cffi_0.17.1/cffi.asd: Extra arguments in (OPERATE 'TEST-OP :CFFI-TESTS) don't match lambda list (O C).
(LOAD cl-cairo2-gtk2 FAIL) ASDF:LOAD-SYSTEM-DEFINITION-ERROR : Error while trying to load definition for system cffi from pathname /home/testgrid/cl-test-grid/work-dir/agent/quicklisp/dists/quicklisp/software/cffi_0.17.1/cffi.asd: Extra arguments in (OPERATE 'TEST-OP :CFFI-TESTS) don't match lambda list (O C).
(LOAD cl-cairo2-demos FAIL) ASDF:LOAD-SYSTEM-DEFINITION-ERROR : Error while trying to load definition for system cffi from pathname /home/testgrid/cl-test-grid/work-dir/agent/quicklisp/dists/quicklisp/software/cffi_0.17.1/cffi.asd: Extra arguments in (OPERATE 'TEST-OP :CFFI-TESTS) don't match lambda list (O C).
(LOAD cl-cairo2 FAIL) ASDF:LOAD-SYSTEM-DEFINITION-ERROR : Error while trying to load definition for system cffi from pathname /home/testgrid/cl-test-grid/work-dir/agent/quicklisp/dists/quicklisp/software/cffi_0.17.1/cffi.asd: Extra arguments in (OPERATE 'TEST-OP :CFFI-TESTS) don't match lambda list (O C).
(LOAD a-cl-cairo2-loader FAIL) ASDF:LOAD-SYSTEM-DEFINITION-ERROR : Error while trying to load definition for system cffi from pathname /home/testgrid/cl-test-grid/work-dir/agent/quicklisp/dists/quicklisp/software/cffi_0.17.1/cffi.asd: Extra arguments in (OPERATE 'TEST-OP :CFFI-TESTS) don't match lambda list (O C).
(LOAD cl-cairo2-xlib FAIL) ffi-grovel, CFFI-GROVEL:GROVEL-ERROR : External process exited with code 1. Command was: "cc" "-marm" "-I/home/testgrid/cl-test-grid/work-dir/agent/quicklisp/dists/quicklisp/software/cl-freetype2-20150709-git/src/ffi/grovel/" "-I/usr/include/freetype2" "-I/usr/include/freetype2/freetype2" "-I/usr/include/freetype2/freetype" "-I/usr/include/freetype" "-I/home/testgrid/cl-test-grid/work-dir/agent/quicklisp/dists/quicklisp/software/cffi_0.16.1/" "-o" "/home/testgrid/cl-test-grid/work-dir/agent/test-runs/20160216093619-ccl-1.8-r15286m-f97-linux-arm/fasl/ql/dists/quicklisp/software/cl-freetype2-20150709-git/src/ffi/grovel/grovel-freetype2" "/home/testgrid/cl-test-grid/work-dir/agent/test-runs/20160216093619-ccl-1.8-r15286m-f97-linux-arm/fasl/ql/dists/quicklisp/software/cl-freetype2-20150709-git/src/ffi/grovel/grovel-freetype2.c" Output was: In file included from /home/testgrid/cl-test-grid/work-dir/agent/test-runs/20160216093619-ccl-1.8-r15286m-f97-linux-arm/fasl/ql/dists/quicklisp/software/cl-freetype2-20150709-git/src/ffi/grovel/grovel-freetype2.c:6:0: /home/testgrid/cl-test-grid/work-dir/agent/quicklisp/dists/quicklisp/software/cl-freetype2-20150709-git/src/ffi/grovel/grovel-freetype.h:2:22: fatal error: ft2build.h: No such file or directory #include <ft2build.h> ^ compilation terminated.
(LOAD cl-cairo2-gtk2 FAIL) ASDF:LOAD-SYSTEM-DEFINITION-ERROR : Error while trying to load definition for system bordeaux-threads from pathname /home/testgrid/cl-test-grid/work-dir/agent/quicklisp/dists/quicklisp/software/bordeaux-threads-v0.8.4-git/bordeaux-threads.asd: There is no package named "UIOP" .
ccl-1.9-r15756-f96-linux-x86
(LOAD cl-cairo2-xlib FAIL) ASDF/FIND-SYSTEM:LOAD-SYSTEM-DEFINITION-ERROR : Error while trying to load definition for system cl-freetype2 from pathname /home/testgrid/cl-test-grid/work-dir/agent/quicklisp/dists/quicklisp/software/cl-freetype2-20150709-git/cl-freetype2.asd: Error while trying to load definition for system cffi-toolchain from pathname /home/testgrid/cl-test-grid/work-dir/agent/quicklisp/dists/quicklisp/software/cffi_0.17.1/cffi-toolchain.asd: CFFI-toolchain requires ASDF 3.1!
(LOAD cl-cairo2-gtk2 FAIL) ASDF/FIND-SYSTEM:LOAD-SYSTEM-DEFINITION-ERROR : Error while trying to load definition for system cl-freetype2 from pathname /home/testgrid/cl-test-grid/work-dir/agent/quicklisp/dists/quicklisp/software/cl-freetype2-20150709-git/cl-freetype2.asd: Error while trying to load definition for system cffi-toolchain from pathname /home/testgrid/cl-test-grid/work-dir/agent/quicklisp/dists/quicklisp/software/cffi_0.17.1/cffi-toolchain.asd: CFFI-toolchain requires ASDF 3.1!
(LOAD cl-cairo2-xlib FAIL) ffi-grovel, CFFI-GROVEL:GROVEL-ERROR : External process exited with code 1. Command was: "cc" "-m32" "-I/home/testgrid/cl-test-grid/work-dir/agent/quicklisp/dists/quicklisp/software/cl-freetype2-20150709-git/src/ffi/grovel/" "-I/usr/include/freetype2" "-I/usr/include/freetype2/freetype2" "-I/usr/include/freetype2/freetype" "-I/usr/include/freetype" "-I/home/testgrid/cl-test-grid/work-dir/agent/quicklisp/dists/quicklisp/software/cffi_0.16.1/" "-o" "/home/testgrid/cl-test-grid/work-dir/agent/test-runs/20160216090332-ccl-1.9-r15756-f96-linux-x86/fasl/ql/dists/quicklisp/software/cl-freetype2-20150709-git/src/ffi/grovel/grovel-freetype2" "/home/testgrid/cl-test-grid/work-dir/agent/test-runs/20160216090332-ccl-1.9-r15756-f96-linux-x86/fasl/ql/dists/quicklisp/software/cl-freetype2-20150709-git/src/ffi/grovel/grovel-freetype2.c" Output was: In file included from /home/testgrid/cl-test-grid/work-dir/agent/test-runs/20160216090332-ccl-1.9-r15756-f96-linux-x86/fasl/ql/dists/quicklisp/software/cl-freetype2-20150709-git/src/ffi/grovel/grovel-freetype2.c:6:0: /home/testgrid/cl-test-grid/work-dir/agent/quicklisp/dists/quicklisp/software/cl-freetype2-20150709-git/src/ffi/grovel/grovel-freetype.h:2:22: fatal error: ft2build.h: No such file or directory compilation terminated.
(LOAD cl-cairo2-gtk2 FAIL) ffi-grovel, CFFI-GROVEL:GROVEL-ERROR : External process exited with code 1. Command was: "cc" "-m32" "-I/home/testgrid/cl-test-grid/work-dir/agent/quicklisp/dists/quicklisp/software/cl-freetype2-20150709-git/src/ffi/grovel/" "-I/usr/include/freetype2" "-I/usr/include/freetype2/freetype2" "-I/usr/include/freetype2/freetype" "-I/usr/include/freetype" "-I/home/testgrid/cl-test-grid/work-dir/agent/quicklisp/dists/quicklisp/software/cffi_0.16.1/" "-o" "/home/testgrid/cl-test-grid/work-dir/agent/test-runs/20160216090332-ccl-1.9-r15756-f96-linux-x86/fasl/ql/dists/quicklisp/software/cl-freetype2-20150709-git/src/ffi/grovel/grovel-freetype2" "/home/testgrid/cl-test-grid/work-dir/agent/test-runs/20160216090332-ccl-1.9-r15756-f96-linux-x86/fasl/ql/dists/quicklisp/software/cl-freetype2-20150709-git/src/ffi/grovel/grovel-freetype2.c" Output was: In file included from /home/testgrid/cl-test-grid/work-dir/agent/test-runs/20160216090332-ccl-1.9-r15756-f96-linux-x86/fasl/ql/dists/quicklisp/software/cl-freetype2-20150709-git/src/ffi/grovel/grovel-freetype2.c:6:0: /home/testgrid/cl-test-grid/work-dir/agent/quicklisp/dists/quicklisp/software/cl-freetype2-20150709-git/src/ffi/grovel/grovel-freetype.h:2:22: fatal error: ft2build.h: No such file or directory compilation terminated.
ccl-1.9-r15767-f99-linux-arm
(LOAD cl-cairo2-xlib FAIL) ASDF/FIND-SYSTEM:LOAD-SYSTEM-DEFINITION-ERROR : Error while trying to load definition for system cl-freetype2 from pathname /home/testgrid/cl-test-grid/work-dir/agent/quicklisp/dists/quicklisp/software/cl-freetype2-20150709-git/cl-freetype2.asd: Error while trying to load definition for system cffi-toolchain from pathname /home/testgrid/cl-test-grid/work-dir/agent/quicklisp/dists/quicklisp/software/cffi_0.17.1/cffi-toolchain.asd: CFFI-toolchain requires ASDF 3.1!
(LOAD cl-cairo2-gtk2 FAIL) ASDF/FIND-SYSTEM:LOAD-SYSTEM-DEFINITION-ERROR : Error while trying to load definition for system cl-freetype2 from pathname /home/testgrid/cl-test-grid/work-dir/agent/quicklisp/dists/quicklisp/software/cl-freetype2-20150709-git/cl-freetype2.asd: Error while trying to load definition for system cffi-toolchain from pathname /home/testgrid/cl-test-grid/work-dir/agent/quicklisp/dists/quicklisp/software/cffi_0.17.1/cffi-toolchain.asd: CFFI-toolchain requires ASDF 3.1!
(LOAD cl-cairo2-xlib FAIL) ffi-grovel, CFFI-GROVEL:GROVEL-ERROR : External process exited with code 1. Command was: "cc" "-marm" "-I/home/testgrid/cl-test-grid/work-dir/agent/quicklisp/dists/quicklisp/software/cl-freetype2-20150709-git/src/ffi/grovel/" "-I/usr/include/freetype2" "-I/usr/include/freetype2/freetype2" "-I/usr/include/freetype2/freetype" "-I/usr/include/freetype" "-I/home/testgrid/cl-test-grid/work-dir/agent/quicklisp/dists/quicklisp/software/cffi_0.16.1/" "-o" "/home/testgrid/cl-test-grid/work-dir/agent/test-runs/20160215204000-ccl-1.9-r15767-f99-linux-arm/fasl/ql/dists/quicklisp/software/cl-freetype2-20150709-git/src/ffi/grovel/grovel-freetype2" "/home/testgrid/cl-test-grid/work-dir/agent/test-runs/20160215204000-ccl-1.9-r15767-f99-linux-arm/fasl/ql/dists/quicklisp/software/cl-freetype2-20150709-git/src/ffi/grovel/grovel-freetype2.c" Output was: In file included from /home/testgrid/cl-test-grid/work-dir/agent/test-runs/20160215204000-ccl-1.9-r15767-f99-linux-arm/fasl/ql/dists/quicklisp/software/cl-freetype2-20150709-git/src/ffi/grovel/grovel-freetype2.c:6:0: /home/testgrid/cl-test-grid/work-dir/agent/quicklisp/dists/quicklisp/software/cl-freetype2-20150709-git/src/ffi/grovel/grovel-freetype.h:2:22: fatal error: ft2build.h: No such file or directory #include <ft2build.h> ^ compilation terminated.
(LOAD cl-cairo2-gtk2 FAIL) ffi-grovel, CFFI-GROVEL:GROVEL-ERROR : External process exited with code 1. Command was: "cc" "-marm" "-I/home/testgrid/cl-test-grid/work-dir/agent/quicklisp/dists/quicklisp/software/cl-freetype2-20150709-git/src/ffi/grovel/" "-I/usr/include/freetype2" "-I/usr/include/freetype2/freetype2" "-I/usr/include/freetype2/freetype" "-I/usr/include/freetype" "-I/home/testgrid/cl-test-grid/work-dir/agent/quicklisp/dists/quicklisp/software/cffi_0.16.1/" "-o" "/home/testgrid/cl-test-grid/work-dir/agent/test-runs/20160215204000-ccl-1.9-r15767-f99-linux-arm/fasl/ql/dists/quicklisp/software/cl-freetype2-20150709-git/src/ffi/grovel/grovel-freetype2" "/home/testgrid/cl-test-grid/work-dir/agent/test-runs/20160215204000-ccl-1.9-r15767-f99-linux-arm/fasl/ql/dists/quicklisp/software/cl-freetype2-20150709-git/src/ffi/grovel/grovel-freetype2.c" Output was: In file included from /home/testgrid/cl-test-grid/work-dir/agent/test-runs/20160215204000-ccl-1.9-r15767-f99-linux-arm/fasl/ql/dists/quicklisp/software/cl-freetype2-20150709-git/src/ffi/grovel/grovel-freetype2.c:6:0: /home/testgrid/cl-test-grid/work-dir/agent/quicklisp/dists/quicklisp/software/cl-freetype2-20150709-git/src/ffi/grovel/grovel-freetype.h:2:22: fatal error: ft2build.h: No such file or directory #include <ft2build.h> ^ compilation terminated.
clisp-2.49-unix-armv7l
(LOAD cl-cairo2-xlib FAIL) ASDF:LOAD-SYSTEM-DEFINITION-ERROR : Error while trying to load definition for system cffi from pathname /home/testgrid/cl-test-grid/work-dir/agent/quicklisp/dists/quicklisp/software/cffi_0.17.1/cffi.asd: DESTRUCTURING-BIND: (OPERATE 'TEST-OP :CFFI-TESTS) does not match lambda list element (O C)
(LOAD cl-cairo2-gtk2 FAIL) ASDF:LOAD-SYSTEM-DEFINITION-ERROR : Error while trying to load definition for system cffi from pathname /home/testgrid/cl-test-grid/work-dir/agent/quicklisp/dists/quicklisp/software/cffi_0.17.1/cffi.asd: DESTRUCTURING-BIND: (OPERATE 'TEST-OP :CFFI-TESTS) does not match lambda list element (O C)
(LOAD cl-cairo2-demos FAIL) ASDF:LOAD-SYSTEM-DEFINITION-ERROR : Error while trying to load definition for system cffi from pathname /home/testgrid/cl-test-grid/work-dir/agent/quicklisp/dists/quicklisp/software/cffi_0.17.1/cffi.asd: DESTRUCTURING-BIND: (OPERATE 'TEST-OP :CFFI-TESTS) does not match lambda list element (O C)
(LOAD cl-cairo2 FAIL) ASDF:LOAD-SYSTEM-DEFINITION-ERROR : Error while trying to load definition for system cffi from pathname /home/testgrid/cl-test-grid/work-dir/agent/quicklisp/dists/quicklisp/software/cffi_0.17.1/cffi.asd: DESTRUCTURING-BIND: (OPERATE 'TEST-OP :CFFI-TESTS) does not match lambda list element (O C)
(LOAD a-cl-cairo2-loader FAIL) ASDF:LOAD-SYSTEM-DEFINITION-ERROR : Error while trying to load definition for system cffi from pathname /home/testgrid/cl-test-grid/work-dir/agent/quicklisp/dists/quicklisp/software/cffi_0.17.1/cffi.asd: DESTRUCTURING-BIND: (OPERATE 'TEST-OP :CFFI-TESTS) does not match lambda list element (O C)
(LOAD cl-cairo2-xlib FAIL) ffi-grovel, CFFI-GROVEL:GROVEL-ERROR : External process exited with code 1. Command was: "cc" "-m32" "-I/home/testgrid/cl-test-grid/work-dir/agent/quicklisp/dists/quicklisp/software/cl-freetype2-20150709-git/src/ffi/grovel/" "-I/usr/include/freetype2" "-I/usr/include/freetype2/freetype2" "-I/usr/include/freetype2/freetype" "-I/usr/include/freetype" "-I/home/testgrid/cl-test-grid/work-dir/agent/quicklisp/dists/quicklisp/software/cffi_0.16.1/" "-o" "/home/testgrid/cl-test-grid/work-dir/agent/test-runs/20160217083144-clisp-2.49-unix-armv7l/fasl/ql/dists/quicklisp/software/cl-freetype2-20150709-git/src/ffi/grovel/grovel-freetype2" "/home/testgrid/cl-test-grid/work-dir/agent/test-runs/20160217083144-clisp-2.49-unix-armv7l/fasl/ql/dists/quicklisp/software/cl-freetype2-20150709-git/src/ffi/grovel/grovel-freetype2.c" Output was:
(LOAD cl-cairo2-gtk2 FAIL) ASDF:LOAD-SYSTEM-DEFINITION-ERROR : Error while trying to load definition for system bordeaux-threads from pathname /home/testgrid/cl-test-grid/work-dir/agent/quicklisp/dists/quicklisp/software/bordeaux-threads-v0.8.4-git/bordeaux-threads.asd: READ from #<INPUT BUFFERED FILE-STREAM CHARACTER #P"/home/testgrid/cl-test-grid/work-dir/agent/quicklisp/dists/quicklisp/software/bordeaux-threads-v0.8.4-git/bordeaux-threads.asd" @68>: there is no package with name "UIOP"
clisp-2.49-unix-x86
(LOAD cl-cairo2-xlib FAIL) ASDF:LOAD-SYSTEM-DEFINITION-ERROR : Error while trying to load definition for system cffi from pathname /home/testgrid/cl-test-grid/work-dir/agent/quicklisp/dists/quicklisp/software/cffi_0.17.1/cffi.asd: DESTRUCTURING-BIND: (OPERATE 'TEST-OP :CFFI-TESTS) does not match lambda list element (O C)
(LOAD cl-cairo2-gtk2 FAIL) ASDF:LOAD-SYSTEM-DEFINITION-ERROR : Error while trying to load definition for system cffi from pathname /home/testgrid/cl-test-grid/work-dir/agent/quicklisp/dists/quicklisp/software/cffi_0.17.1/cffi.asd: DESTRUCTURING-BIND: (OPERATE 'TEST-OP :CFFI-TESTS) does not match lambda list element (O C)
(LOAD cl-cairo2-demos FAIL) ASDF:LOAD-SYSTEM-DEFINITION-ERROR : Error while trying to load definition for system cffi from pathname /home/testgrid/cl-test-grid/work-dir/agent/quicklisp/dists/quicklisp/software/cffi_0.17.1/cffi.asd: DESTRUCTURING-BIND: (OPERATE 'TEST-OP :CFFI-TESTS) does not match lambda list element (O C)
(LOAD cl-cairo2 FAIL) ASDF:LOAD-SYSTEM-DEFINITION-ERROR : Error while trying to load definition for system cffi from pathname /home/testgrid/cl-test-grid/work-dir/agent/quicklisp/dists/quicklisp/software/cffi_0.17.1/cffi.asd: DESTRUCTURING-BIND: (OPERATE 'TEST-OP :CFFI-TESTS) does not match lambda list element (O C)
(LOAD a-cl-cairo2-loader FAIL) ASDF:LOAD-SYSTEM-DEFINITION-ERROR : Error while trying to load definition for system cffi from pathname /home/testgrid/cl-test-grid/work-dir/agent/quicklisp/dists/quicklisp/software/cffi_0.17.1/cffi.asd: DESTRUCTURING-BIND: (OPERATE 'TEST-OP :CFFI-TESTS) does not match lambda list element (O C)
(LOAD cl-cairo2-xlib FAIL) ffi-grovel, CFFI-GROVEL:GROVEL-ERROR : External process exited with code 1. Command was: "cc" "-m32" "-I/home/testgrid/cl-test-grid/work-dir/agent/quicklisp/dists/quicklisp/software/cl-freetype2-20150709-git/src/ffi/grovel/" "-I/usr/include/freetype2" "-I/usr/include/freetype2/freetype2" "-I/usr/include/freetype2/freetype" "-I/usr/include/freetype" "-I/home/testgrid/cl-test-grid/work-dir/agent/quicklisp/dists/quicklisp/software/cffi_0.16.1/" "-o" "/home/testgrid/cl-test-grid/work-dir/agent/test-runs/20160214095017-clisp-2.49-unix-x86/fasl/ql/dists/quicklisp/software/cl-freetype2-20150709-git/src/ffi/grovel/grovel-freetype2" "/home/testgrid/cl-test-grid/work-dir/agent/test-runs/20160214095017-clisp-2.49-unix-x86/fasl/ql/dists/quicklisp/software/cl-freetype2-20150709-git/src/ffi/grovel/grovel-freetype2.c" Output was:
(LOAD cl-cairo2-gtk2 FAIL) ASDF:LOAD-SYSTEM-DEFINITION-ERROR : Error while trying to load definition for system bordeaux-threads from pathname /home/testgrid/cl-test-grid/work-dir/agent/quicklisp/dists/quicklisp/software/bordeaux-threads-v0.8.4-git/bordeaux-threads.asd: READ from #<INPUT BUFFERED FILE-STREAM CHARACTER #P"/home/testgrid/cl-test-grid/work-dir/agent/quicklisp/dists/quicklisp/software/bordeaux-threads-v0.8.4-git/bordeaux-threads.asd" @68>: there is no package with name "UIOP"
cmu-snapshot-2013-04__20d_unicode_-linux-x86
(LOAD cl-cairo2-xlib FAIL) ASDF/FIND-SYSTEM:LOAD-SYSTEM-DEFINITION-ERROR : Error while trying to load definition for system cl-freetype2 from pathname /home/testgrid/cl-test-grid/work-dir/agent/quicklisp/dists/quicklisp/software/cl-freetype2-20150709-git/cl-freetype2.asd: Error while trying to load definition for system cffi-toolchain from pathname /home/testgrid/cl-test-grid/work-dir/agent/quicklisp/dists/quicklisp/software/cffi_0.17.1/cffi-toolchain.asd: Error in function LISP::SLOLOAD: CFFI-toolchain requires ASDF 3.1!
(LOAD cl-cairo2-gtk2 FAIL) ASDF/FIND-SYSTEM:LOAD-SYSTEM-DEFINITION-ERROR : Error while trying to load definition for system cl-freetype2 from pathname /home/testgrid/cl-test-grid/work-dir/agent/quicklisp/dists/quicklisp/software/cl-freetype2-20150709-git/cl-freetype2.asd: Error while trying to load definition for system cffi-toolchain from pathname /home/testgrid/cl-test-grid/work-dir/agent/quicklisp/dists/quicklisp/software/cffi_0.17.1/cffi-toolchain.asd: Error in function LISP::SLOLOAD: CFFI-toolchain requires ASDF 3.1!
(LOAD cl-cairo2-xlib FAIL) ffi-grovel, CFFI-GROVEL:GROVEL-ERROR : Error in function CFFI-GROVEL:GROVEL-ERROR: External process exited with code 1. Command was: "cc" "-m32" "-I/home/testgrid/cl-test-grid/work-dir/agent/quicklisp/dists/quicklisp/software/cl-freetype2-20150709-git/src/ffi/grovel/" "-I/usr/include/freetype2" "-I/usr/include/freetype2/freetype2" "-I/usr/include/freetype2/freetype" "-I/usr/include/freetype" "-I/home/testgrid/cl-test-grid/work-dir/agent/quicklisp/dists/quicklisp/software/cffi_0.16.1/" "-o" "/home/testgrid/cl-test-grid/w... "/home/testgrid/cl-test-grid/w... Output was: In file included from /home/testgrid/cl-test-grid/wo... /home/testgrid/cl-test-grid/work-dir/agent/quicklisp/dists/quicklisp/software/cl-freetype2-20150709-git/src/ffi/grovel/grovel-freetype.h:2:22: fatal error: ft2build.h: No such file or directory compilation terminated.
(LOAD cl-cairo2-gtk2 FAIL) ffi-grovel, CFFI-GROVEL:GROVEL-ERROR : Error in function CFFI-GROVEL:GROVEL-ERROR: External process exited with code 1. Command was: "cc" "-m32" "-I/home/testgrid/cl-test-grid/work-dir/agent/quicklisp/dists/quicklisp/software/cl-freetype2-20150709-git/src/ffi/grovel/" "-I/usr/include/freetype2" "-I/usr/include/freetype2/freetype2" "-I/usr/include/freetype2/freetype" "-I/usr/include/freetype" "-I/home/testgrid/cl-test-grid/work-dir/agent/quicklisp/dists/quicklisp/software/cffi_0.16.1/" "-o" "/home/testgrid/cl-test-grid/w... "/home/testgrid/cl-test-grid/w... Output was: In file included from /home/testgrid/cl-test-grid/wo... /home/testgrid/cl-test-grid/work-dir/agent/quicklisp/dists/quicklisp/software/cl-freetype2-20150709-git/src/ffi/grovel/grovel-freetype.h:2:22: fatal error: ft2build.h: No such file or directory compilation terminated.
cmu-snapshot-2014-01__20e_unicode_-linux-x86
(LOAD cl-cairo2-xlib FAIL) ASDF/FIND-SYSTEM:LOAD-SYSTEM-DEFINITION-ERROR : Error while trying to load definition for system cl-freetype2 from pathname /home/testgrid/cl-test-grid/work-dir/agent/quicklisp/dists/quicklisp/software/cl-freetype2-20150709-git/cl-freetype2.asd: Error while trying to load definition for system cffi-toolchain from pathname /home/testgrid/cl-test-grid/work-dir/agent/quicklisp/dists/quicklisp/software/cffi_0.17.1/cffi-toolchain.asd: Error in function LISP::SLOLOAD: CFFI-toolchain requires ASDF 3.1!
(LOAD cl-cairo2-gtk2 FAIL) ASDF/FIND-SYSTEM:LOAD-SYSTEM-DEFINITION-ERROR : Error while trying to load definition for system cl-freetype2 from pathname /home/testgrid/cl-test-grid/work-dir/agent/quicklisp/dists/quicklisp/software/cl-freetype2-20150709-git/cl-freetype2.asd: Error while trying to load definition for system cffi-toolchain from pathname /home/testgrid/cl-test-grid/work-dir/agent/quicklisp/dists/quicklisp/software/cffi_0.17.1/cffi-toolchain.asd: Error in function LISP::SLOLOAD: CFFI-toolchain requires ASDF 3.1!
(LOAD cl-cairo2-xlib FAIL) ffi-grovel, CFFI-GROVEL:GROVEL-ERROR : Error in function CFFI-GROVEL:GROVEL-ERROR: External process exited with code 1. Command was: "cc" "-m32" "-I/home/testgrid/cl-test-grid/work-dir/agent/quicklisp/dists/quicklisp/software/cl-freetype2-20150709-git/src/ffi/grovel/" "-I/usr/include/freetype2" "-I/usr/include/freetype2/freetype2" "-I/usr/include/freetype2/freetype" "-I/usr/include/freetype" "-I/home/testgrid/cl-test-grid/work-dir/agent/quicklisp/dists/quicklisp/software/cffi_0.16.1/" "-o" "/home/testgrid/cl-test-grid/w... "/home/testgrid/cl-test-grid/w... Output was: In file included from /home/testgrid/cl-test-grid/wo... /home/testgrid/cl-test-grid/work-dir/agent/quicklisp/dists/quicklisp/software/cl-freetype2-20150709-git/src/ffi/grovel/grovel-freetype.h:2:22: fatal error: ft2build.h: No such file or directory compilation terminated.
(LOAD cl-cairo2-gtk2 FAIL) ffi-grovel, CFFI-GROVEL:GROVEL-ERROR : Error in function CFFI-GROVEL:GROVEL-ERROR: External process exited with code 1. Command was: "cc" "-m32" "-I/home/testgrid/cl-test-grid/work-dir/agent/quicklisp/dists/quicklisp/software/cl-freetype2-20150709-git/src/ffi/grovel/" "-I/usr/include/freetype2" "-I/usr/include/freetype2/freetype2" "-I/usr/include/freetype2/freetype" "-I/usr/include/freetype" "-I/home/testgrid/cl-test-grid/work-dir/agent/quicklisp/dists/quicklisp/software/cffi_0.16.1/" "-o" "/home/testgrid/cl-test-grid/w... "/home/testgrid/cl-test-grid/w... Output was: In file included from /home/testgrid/cl-test-grid/wo... /home/testgrid/cl-test-grid/work-dir/agent/quicklisp/dists/quicklisp/software/cl-freetype2-20150709-git/src/ffi/grovel/grovel-freetype.h:2:22: fatal error: ft2build.h: No such file or directory compilation terminated.
cmu-snapshot-2014-05-dirty__20e_unicode_-linux-x86
(LOAD cl-cairo2-xlib FAIL) ASDF/FIND-SYSTEM:LOAD-SYSTEM-DEFINITION-ERROR : Error while trying to load definition for system cl-freetype2 from pathname /home/testgrid/cl-test-grid/work-dir/agent/quicklisp/dists/quicklisp/software/cl-freetype2-20150709-git/cl-freetype2.asd: Error while trying to load definition for system cffi-toolchain from pathname /home/testgrid/cl-test-grid/work-dir/agent/quicklisp/dists/quicklisp/software/cffi_0.17.1/cffi-toolchain.asd: Error in function LISP::SLOLOAD: CFFI-toolchain requires ASDF 3.1!
(LOAD cl-cairo2-gtk2 FAIL) ASDF/FIND-SYSTEM:LOAD-SYSTEM-DEFINITION-ERROR : Error while trying to load definition for system cl-freetype2 from pathname /home/testgrid/cl-test-grid/work-dir/agent/quicklisp/dists/quicklisp/software/cl-freetype2-20150709-git/cl-freetype2.asd: Error while trying to load definition for system cffi-toolchain from pathname /home/testgrid/cl-test-grid/work-dir/agent/quicklisp/dists/quicklisp/software/cffi_0.17.1/cffi-toolchain.asd: Error in function LISP::SLOLOAD: CFFI-toolchain requires ASDF 3.1!
(LOAD cl-cairo2-xlib FAIL) ffi-grovel, CFFI-GROVEL:GROVEL-ERROR : Error in function CFFI-GROVEL:GROVEL-ERROR: External process exited with code 1. Command was: "cc" "-m32" "-I/home/testgrid/cl-test-grid/work-dir/agent/quicklisp/dists/quicklisp/software/cl-freetype2-20150709-git/src/ffi/grovel/" "-I/usr/include/freetype2" "-I/usr/include/freetype2/freetype2" "-I/usr/include/freetype2/freetype" "-I/usr/include/freetype" "-I/home/testgrid/cl-test-grid/work-dir/agent/quicklisp/dists/quicklisp/software/cffi_0.16.1/" "-o" "/home/testgrid/cl-test-grid/w... "/home/testgrid/cl-test-grid/w... Output was: In file included from /home/testgrid/cl-test-grid/wo... /home/testgrid/cl-test-grid/work-dir/agent/quicklisp/dists/quicklisp/software/cl-freetype2-20150709-git/src/ffi/grovel/grovel-freetype.h:2:22: fatal error: ft2build.h: No such file or directory compilation terminated.
(LOAD cl-cairo2-gtk2 FAIL) ffi-grovel, CFFI-GROVEL:GROVEL-ERROR : Error in function CFFI-GROVEL:GROVEL-ERROR: External process exited with code 1. Command was: "cc" "-m32" "-I/home/testgrid/cl-test-grid/work-dir/agent/quicklisp/dists/quicklisp/software/cl-freetype2-20150709-git/src/ffi/grovel/" "-I/usr/include/freetype2" "-I/usr/include/freetype2/freetype2" "-I/usr/include/freetype2/freetype" "-I/usr/include/freetype" "-I/home/testgrid/cl-test-grid/work-dir/agent/quicklisp/dists/quicklisp/software/cffi_0.16.1/" "-o" "/home/testgrid/cl-test-grid/w... "/home/testgrid/cl-test-grid/w... Output was: In file included from /home/testgrid/cl-test-grid/wo... /home/testgrid/cl-test-grid/work-dir/agent/quicklisp/dists/quicklisp/software/cl-freetype2-20150709-git/src/ffi/grovel/grovel-freetype.h:2:22: fatal error: ft2build.h: No such file or directory compilation terminated.
cmu-snapshot-2014-12___20f_unicode_-linux-x86
(LOAD cl-cairo2-xlib FAIL) ASDF/FIND-SYSTEM:LOAD-SYSTEM-DEFINITION-ERROR : Error while trying to load definition for system cl-freetype2 from pathname /home/testgrid/cl-test-grid/work-dir/agent/quicklisp/dists/quicklisp/software/cl-freetype2-20150709-git/cl-freetype2.asd: (during macroexpansion) Error in FDEFINITION: the function GATHER-TYPE is undefined.
(LOAD cl-cairo2-gtk2 FAIL) ASDF/FIND-SYSTEM:LOAD-SYSTEM-DEFINITION-ERROR : Error while trying to load definition for system cl-freetype2 from pathname /home/testgrid/cl-test-grid/work-dir/agent/quicklisp/dists/quicklisp/software/cl-freetype2-20150709-git/cl-freetype2.asd: (during macroexpansion) Error in FDEFINITION: the function GATHER-TYPE is undefined.
(LOAD cl-cairo2-xlib FAIL) ffi-grovel, CFFI-GROVEL:GROVEL-ERROR : Error in function CFFI-GROVEL:GROVEL-ERROR: External process exited with code 1. Command was: "cc" "-m32" "-I/home/testgrid/cl-test-grid/work-dir/agent/quicklisp/dists/quicklisp/software/cl-freetype2-20150709-git/src/ffi/grovel/" "-I/usr/include/freetype2" "-I/usr/include/freetype2/freetype2" "-I/usr/include/freetype2/freetype" "-I/usr/include/freetype" "-I/home/testgrid/cl-test-grid/work-dir/agent/quicklisp/dists/quicklisp/software/cffi_0.16.1/" "-o" "/home/testgrid/cl-test-grid/w... "/home/testgrid/cl-test-grid/w... Output was: In file included from /home/testgrid/cl-test-grid/wo... /home/testgrid/cl-test-grid/work-dir/agent/quicklisp/dists/quicklisp/software/cl-freetype2-20150709-git/src/ffi/grovel/grovel-freetype.h:2:22: fatal error: ft2build.h: No such file or directory compilation terminated.
(LOAD cl-cairo2-gtk2 FAIL) ffi-grovel, CFFI-GROVEL:GROVEL-ERROR : Error in function CFFI-GROVEL:GROVEL-ERROR: External process exited with code 1. Command was: "cc" "-m32" "-I/home/testgrid/cl-test-grid/work-dir/agent/quicklisp/dists/quicklisp/software/cl-freetype2-20150709-git/src/ffi/grovel/" "-I/usr/include/freetype2" "-I/usr/include/freetype2/freetype2" "-I/usr/include/freetype2/freetype" "-I/usr/include/freetype" "-I/home/testgrid/cl-test-grid/work-dir/agent/quicklisp/dists/quicklisp/software/cffi_0.16.1/" "-o" "/home/testgrid/cl-test-grid/w... "/home/testgrid/cl-test-grid/w... Output was: In file included from /home/testgrid/cl-test-grid/wo... /home/testgrid/cl-test-grid/work-dir/agent/quicklisp/dists/quicklisp/software/cl-freetype2-20150709-git/src/ffi/grovel/grovel-freetype.h:2:22: fatal error: ft2build.h: No such file or directory compilation terminated.
ecl-13.5.1-unknown-linux-i686-bytecode
(LOAD cl-cairo2-xlib FAIL) ASDF/FIND-SYSTEM:LOAD-SYSTEM-DEFINITION-ERROR : Error while trying to load definition for system cl-freetype2 from pathname /home/testgrid/cl-test-grid/work-dir/agent/quicklisp/dists/quicklisp/software/cl-freetype2-20150709-git/cl-freetype2.asd: Error while trying to load definition for system cffi-toolchain from pathname /home/testgrid/cl-test-grid/work-dir/agent/quicklisp/dists/quicklisp/software/cffi_0.17.1/cffi-toolchain.asd: CFFI-toolchain requires ASDF 3.1!
(LOAD cl-cairo2-gtk2 FAIL) ASDF/FIND-SYSTEM:LOAD-SYSTEM-DEFINITION-ERROR : Error while trying to load definition for system cl-freetype2 from pathname /home/testgrid/cl-test-grid/work-dir/agent/quicklisp/dists/quicklisp/software/cl-freetype2-20150709-git/cl-freetype2.asd: Error while trying to load definition for system cffi-toolchain from pathname /home/testgrid/cl-test-grid/work-dir/agent/quicklisp/dists/quicklisp/software/cffi_0.17.1/cffi-toolchain.asd: CFFI-toolchain requires ASDF 3.1!
ecl-13.5.1-unknown-linux-i686-lisp-to-c
(LOAD cl-cairo2-xlib FAIL) ASDF/FIND-SYSTEM:LOAD-SYSTEM-DEFINITION-ERROR : Error while trying to load definition for system cl-freetype2 from pathname /home/testgrid/cl-test-grid/work-dir/agent/quicklisp/dists/quicklisp/software/cl-freetype2-20150709-git/cl-freetype2.asd: Error while trying to load definition for system cffi-toolchain from pathname /home/testgrid/cl-test-grid/work-dir/agent/quicklisp/dists/quicklisp/software/cffi_0.17.1/cffi-toolchain.asd: CFFI-toolchain requires ASDF 3.1!
(LOAD cl-cairo2-gtk2 FAIL) ASDF/FIND-SYSTEM:LOAD-SYSTEM-DEFINITION-ERROR : Error while trying to load definition for system cl-freetype2 from pathname /home/testgrid/cl-test-grid/work-dir/agent/quicklisp/dists/quicklisp/software/cl-freetype2-20150709-git/cl-freetype2.asd: Error while trying to load definition for system cffi-toolchain from pathname /home/testgrid/cl-test-grid/work-dir/agent/quicklisp/dists/quicklisp/software/cffi_0.17.1/cffi-toolchain.asd: CFFI-toolchain requires ASDF 3.1!
(LOAD cl-cairo2-xlib FAIL) ffi-grovel, CFFI-GROVEL:GROVEL-ERROR : External process exited with code 1. Command was: "cc" "-m32" "-I/home/testgrid/cl-test-grid/work-dir/agent/quicklisp/dists/quicklisp/software/cl-freetype2-20150709-git/src/ffi/grovel/" " -D_GNU_SOURCE -D_FILE_OFFSET_BITS=64 -g -O2 -fPIC -D_GNU_SOURCE -D_FILE_OFFSET_BITS=64 -g -O2 -fPIC -D_THREAD_SAFE -Dlinux" "-I/usr/include/freetype2" "-I/usr/include/freetype2/freetype2" "-I/usr/include/freetype2/freetype" "-I/usr/include/freetype" "-I/home/testgrid/cl-test-grid/work-dir/agent/quicklisp/dists/quicklisp/software/cffi_0.16.1/" "-o" "/home/testgrid/cl-test-grid/w... "/home/testgrid/cl-test-grid/w... Output was:
(LOAD cl-cairo2-gtk2 FAIL) ffi-grovel, CFFI-GROVEL:GROVEL-ERROR : External process exited with code 1. Command was: "cc" "-m32" "-I/home/testgrid/cl-test-grid/work-dir/agent/quicklisp/dists/quicklisp/software/cl-freetype2-20150709-git/src/ffi/grovel/" " -D_GNU_SOURCE -D_FILE_OFFSET_BITS=64 -g -O2 -fPIC -D_GNU_SOURCE -D_FILE_OFFSET_BITS=64 -g -O2 -fPIC -D_THREAD_SAFE -Dlinux" "-I/usr/include/freetype2" "-I/usr/include/freetype2/freetype2" "-I/usr/include/freetype2/freetype" "-I/usr/include/freetype" "-I/home/testgrid/cl-test-grid/work-dir/agent/quicklisp/dists/quicklisp/software/cffi_0.16.1/" "-o" "/home/testgrid/cl-test-grid/w... "/home/testgrid/cl-test-grid/w... Output was:
ecl-15.2.21-ee989b97-linux-i686-bytecode
(LOAD cl-cairo2-xlib FAIL) ASDF/FIND-SYSTEM:LOAD-SYSTEM-DEFINITION-ERROR : Error while trying to load definition for system cl-freetype2 from pathname /home/testgrid/cl-test-grid/work-dir/agent/quicklisp/dists/quicklisp/software/cl-freetype2-20150709-git/cl-freetype2.asd: The variable C::*CC-FLAGS* is unbound.
(LOAD cl-cairo2-gtk2 FAIL) ASDF/FIND-SYSTEM:LOAD-SYSTEM-DEFINITION-ERROR : Error while trying to load definition for system cl-freetype2 from pathname /home/testgrid/cl-test-grid/work-dir/agent/quicklisp/dists/quicklisp/software/cl-freetype2-20150709-git/cl-freetype2.asd: The variable C::*CC-FLAGS* is unbound.
(LOAD cl-cairo2-xlib FAIL) ASDF/FIND-SYSTEM:LOAD-SYSTEM-DEFINITION-ERROR : Error while trying to load definition for system cl-freetype2 from pathname /home/testgrid/cl-test-grid/work-dir/agent/quicklisp/dists/quicklisp/software/cl-freetype2-20150709-git/cl-freetype2.asd: The variable C::*CC-FLAGS* is unbound.
(LOAD cl-cairo2-gtk2 FAIL) ASDF/FIND-SYSTEM:LOAD-SYSTEM-DEFINITION-ERROR : Error while trying to load definition for system cl-freetype2 from pathname /home/testgrid/cl-test-grid/work-dir/agent/quicklisp/dists/quicklisp/software/cl-freetype2-20150709-git/cl-freetype2.asd: The variable C::*CC-FLAGS* is unbound.
ecl-15.2.21-ee989b97-linux-i686-lisp-to-c
(LOAD cl-cairo2-xlib FAIL) ffi-grovel, CFFI-GROVEL:GROVEL-ERROR : Subprocess with command ("cc" "-m32" "-I/home/testgrid/cl-test-grid/work-dir/agent/quicklisp/dists/quicklisp/software/cl-freetype2-20150709-git/src/ffi/grovel/" "-D_GNU_SOURCE" "-D_FILE_OFFSET_BITS=64" "-g" "-O2" "-fPIC" "-D_THREAD_SAFE" "-Dlinux" "-I/usr/include/freetype2" "-I/usr/include/freetype2/freetype2" "-I/usr/include/freetype2/freetype" "-I/usr/include/freetype" "-o" "/home/testgrid/cl-test-grid/w... "-I/home/testgrid/cl-test-grid/work-dir/agent/quicklisp/dists/quicklisp/software/cffi_0.17.1/" "/home/testgrid/cl-test-grid/w... exited with error code 1
(LOAD cl-cairo2-gtk2 FAIL) ffi-grovel, CFFI-GROVEL:GROVEL-ERROR : Subprocess with command ("cc" "-m32" "-I/home/testgrid/cl-test-grid/work-dir/agent/quicklisp/dists/quicklisp/software/cl-freetype2-20150709-git/src/ffi/grovel/" "-D_GNU_SOURCE" "-D_FILE_OFFSET_BITS=64" "-g" "-O2" "-fPIC" "-D_THREAD_SAFE" "-Dlinux" "-I/usr/include/freetype2" "-I/usr/include/freetype2/freetype2" "-I/usr/include/freetype2/freetype" "-I/usr/include/freetype" "-o" "/home/testgrid/cl-test-grid/w... "-I/home/testgrid/cl-test-grid/work-dir/agent/quicklisp/dists/quicklisp/software/cffi_0.17.1/" "/home/testgrid/cl-test-grid/w... exited with error code 1
(LOAD cl-cairo2-xlib FAIL) ffi-grovel, CFFI-GROVEL:GROVEL-ERROR : External process exited with code 1. Command was: "cc" "-m32" "-I/home/testgrid/cl-test-grid/work-dir/agent/quicklisp/dists/quicklisp/software/cl-freetype2-20150709-git/src/ffi/grovel/" " -D_GNU_SOURCE -D_FILE_OFFSET_BITS=64 -g -O2 -fPIC -D_THREAD_SAFE -Dlinux" "-I/usr/include/freetype2" "-I/usr/include/freetype2/freetype2" "-I/usr/include/freetype2/freetype" "-I/usr/include/freetype" "-I/home/testgrid/cl-test-grid/work-dir/agent/quicklisp/dists/quicklisp/software/cffi_0.16.1/" "-o" "/home/testgrid/cl-test-grid/w... "/home/testgrid/cl-test-grid/w... Output was:
(LOAD cl-cairo2-gtk2 FAIL) ffi-grovel, CFFI-GROVEL:GROVEL-ERROR : External process exited with code 1. Command was: "cc" "-m32" "-I/home/testgrid/cl-test-grid/work-dir/agent/quicklisp/dists/quicklisp/software/cl-freetype2-20150709-git/src/ffi/grovel/" " -D_GNU_SOURCE -D_FILE_OFFSET_BITS=64 -g -O2 -fPIC -D_THREAD_SAFE -Dlinux" "-I/usr/include/freetype2" "-I/usr/include/freetype2/freetype2" "-I/usr/include/freetype2/freetype" "-I/usr/include/freetype" "-I/home/testgrid/cl-test-grid/work-dir/agent/quicklisp/dists/quicklisp/software/cffi_0.16.1/" "-o" "/home/testgrid/cl-test-grid/w... "/home/testgrid/cl-test-grid/w... Output was:
ecl-15.2.21-ee989b97-linux-x64-bytecode
(LOAD cl-cairo2-xlib FAIL) ASDF/FIND-SYSTEM:LOAD-SYSTEM-DEFINITION-ERROR : Error while trying to load definition for system cl-freetype2 from pathname /home/hijarian/systems/cl-test-grid/work-dir/agent/quicklisp/dists/quicklisp/software/cl-freetype2-20150709-git/cl-freetype2.asd: In form ((OS-UNIX-P) "o") FUNCTION: Not a valid argument (OS-UNIX-P).
(LOAD cl-cairo2-gtk2 FAIL) ASDF/FIND-SYSTEM:LOAD-SYSTEM-DEFINITION-ERROR : Error while trying to load definition for system cl-freetype2 from pathname /home/hijarian/systems/cl-test-grid/work-dir/agent/quicklisp/dists/quicklisp/software/cl-freetype2-20150709-git/cl-freetype2.asd: In form ((OS-UNIX-P) "o") FUNCTION: Not a valid argument (OS-UNIX-P).
(LOAD cl-cairo2-xlib FAIL) ASDF/FIND-SYSTEM:LOAD-SYSTEM-DEFINITION-ERROR : Error while trying to load definition for system cl-freetype2 from pathname /home/hijarian/systems/cl-test-grid/work-dir/agent/quicklisp/dists/quicklisp/software/cl-freetype2-20150709-git/cl-freetype2.asd: The variable C::*CC-FLAGS* is unbound.
(LOAD cl-cairo2-gtk2 FAIL) ASDF/FIND-SYSTEM:LOAD-SYSTEM-DEFINITION-ERROR : Error while trying to load definition for system cl-freetype2 from pathname /home/hijarian/systems/cl-test-grid/work-dir/agent/quicklisp/dists/quicklisp/software/cl-freetype2-20150709-git/cl-freetype2.asd: The variable C::*CC-FLAGS* is unbound.
(LOAD cl-cairo2-xlib FAIL) ASDF/FIND-SYSTEM:LOAD-SYSTEM-DEFINITION-ERROR : Error while trying to load definition for system cl-freetype2 from pathname /home/hijarian/systems/cl-test-grid/work-dir/agent/quicklisp/dists/quicklisp/software/cl-freetype2-20150709-git/cl-freetype2.asd: The variable C::*CC-FLAGS* is unbound.
(LOAD cl-cairo2-gtk2 FAIL) ASDF/FIND-SYSTEM:LOAD-SYSTEM-DEFINITION-ERROR : Error while trying to load definition for system cl-freetype2 from pathname /home/hijarian/systems/cl-test-grid/work-dir/agent/quicklisp/dists/quicklisp/software/cl-freetype2-20150709-git/cl-freetype2.asd: The variable C::*CC-FLAGS* is unbound.
ecl-15.2.21-ee989b97-linux-x64-lisp-to-c
(LOAD cl-cairo2-xlib FAIL) ASDF/FIND-SYSTEM:LOAD-SYSTEM-DEFINITION-ERROR : Error while trying to load definition for system cl-freetype2 from pathname /home/hijarian/systems/cl-test-grid/work-dir/agent/quicklisp/dists/quicklisp/software/cl-freetype2-20150709-git/cl-freetype2.asd: COMPILE-FILE-ERROR while compiling #<cl-source-file "cffi-toolchain" "toolchain" "asdf-compat">
(LOAD cl-cairo2-gtk2 FAIL) ASDF/FIND-SYSTEM:LOAD-SYSTEM-DEFINITION-ERROR : Error while trying to load definition for system cl-freetype2 from pathname /home/hijarian/systems/cl-test-grid/work-dir/agent/quicklisp/dists/quicklisp/software/cl-freetype2-20150709-git/cl-freetype2.asd: COMPILE-FILE-ERROR while compiling #<cl-source-file "cffi-toolchain" "toolchain" "asdf-compat">
ecl-16.0.0-98fc12d3-linux-i686-bytecode
(LOAD cl-cairo2-xlib FAIL) ASDF/FIND-SYSTEM:LOAD-SYSTEM-DEFINITION-ERROR : Error while trying to load definition for system cl-freetype2 from pathname /home/testgrid/cl-test-grid/work-dir/agent/quicklisp/dists/quicklisp/software/cl-freetype2-20150709-git/cl-freetype2.asd: The variable C::*CC-FLAGS* is unbound.
(LOAD cl-cairo2-gtk2 FAIL) ASDF/FIND-SYSTEM:LOAD-SYSTEM-DEFINITION-ERROR : Error while trying to load definition for system cl-freetype2 from pathname /home/testgrid/cl-test-grid/work-dir/agent/quicklisp/dists/quicklisp/software/cl-freetype2-20150709-git/cl-freetype2.asd: The variable C::*CC-FLAGS* is unbound.
(LOAD cl-cairo2-xlib FAIL) ASDF/FIND-SYSTEM:LOAD-SYSTEM-DEFINITION-ERROR : Error while trying to load definition for system cl-freetype2 from pathname /home/testgrid/cl-test-grid/work-dir/agent/quicklisp/dists/quicklisp/software/cl-freetype2-20150709-git/cl-freetype2.asd: The variable C::*CC-FLAGS* is unbound.
(LOAD cl-cairo2-gtk2 FAIL) ASDF/FIND-SYSTEM:LOAD-SYSTEM-DEFINITION-ERROR : Error while trying to load definition for system cl-freetype2 from pathname /home/testgrid/cl-test-grid/work-dir/agent/quicklisp/dists/quicklisp/software/cl-freetype2-20150709-git/cl-freetype2.asd: The variable C::*CC-FLAGS* is unbound.
ecl-16.0.0-98fc12d3-linux-i686-lisp-to-c
(LOAD cl-cairo2-xlib FAIL) ffi-grovel, CFFI-GROVEL:GROVEL-ERROR : Subprocess with command ("cc" "-m32" "-I/home/testgrid/cl-test-grid/work-dir/agent/quicklisp/dists/quicklisp/software/cl-freetype2-20150709-git/src/ffi/grovel/" "-D_GNU_SOURCE" "-D_FILE_OFFSET_BITS=64" "-g" "-O2" "-fPIC" "-D_THREAD_SAFE" "-Dlinux" "-I/usr/include/freetype2" "-I/usr/include/freetype2/freetype2" "-I/usr/include/freetype2/freetype" "-I/usr/include/freetype" "-o" "/home/testgrid/cl-test-grid/w... "-I/home/testgrid/cl-test-grid/work-dir/agent/quicklisp/dists/quicklisp/software/cffi_0.17.1/" "/home/testgrid/cl-test-grid/w... exited with error code 1
(LOAD cl-cairo2-gtk2 FAIL) ffi-grovel, CFFI-GROVEL:GROVEL-ERROR : Subprocess with command ("cc" "-m32" "-I/home/testgrid/cl-test-grid/work-dir/agent/quicklisp/dists/quicklisp/software/cl-freetype2-20150709-git/src/ffi/grovel/" "-D_GNU_SOURCE" "-D_FILE_OFFSET_BITS=64" "-g" "-O2" "-fPIC" "-D_THREAD_SAFE" "-Dlinux" "-I/usr/include/freetype2" "-I/usr/include/freetype2/freetype2" "-I/usr/include/freetype2/freetype" "-I/usr/include/freetype" "-o" "/home/testgrid/cl-test-grid/w... "-I/home/testgrid/cl-test-grid/work-dir/agent/quicklisp/dists/quicklisp/software/cffi_0.17.1/" "/home/testgrid/cl-test-grid/w... exited with error code 1
ecl-16.0.0-b2661fd1-linux-x64-bytecode
(LOAD cl-cairo2-xlib FAIL) ASDF/FIND-SYSTEM:LOAD-SYSTEM-DEFINITION-ERROR : Error while trying to load definition for system cl-freetype2 from pathname /home/jack/quicklisp/local-projects/cl-test-grid/work-dir/agent/quicklisp/dists/quicklisp/software/cl-freetype2-20150709-git/cl-freetype2.asd: The variable C::*CC-FLAGS* is unbound.
(LOAD cl-cairo2-gtk2 FAIL) ASDF/FIND-SYSTEM:LOAD-SYSTEM-DEFINITION-ERROR : Error while trying to load definition for system cl-freetype2 from pathname /home/jack/quicklisp/local-projects/cl-test-grid/work-dir/agent/quicklisp/dists/quicklisp/software/cl-freetype2-20150709-git/cl-freetype2.asd: The variable C::*CC-FLAGS* is unbound.
ecl-16.0.0-b2661fd1-linux-x64-lisp-to-c
ecl-16.0.0-b2661fd1-macosx-x64-bytecode
(LOAD cl-cairo2-xlib FAIL) ASDF/FIND-SYSTEM:LOAD-SYSTEM-DEFINITION-ERROR : Error while trying to load definition for system cl-freetype2 from pathname /Users/testgrid/cl-test-grid/work-dir/agent/quicklisp/dists/quicklisp/software/cl-freetype2-20150709-git/cl-freetype2.asd: The variable C::*CC-FLAGS* is unbound.
(LOAD cl-cairo2-gtk2 FAIL) ASDF/FIND-SYSTEM:LOAD-SYSTEM-DEFINITION-ERROR : Error while trying to load definition for system cl-freetype2 from pathname /Users/testgrid/cl-test-grid/work-dir/agent/quicklisp/dists/quicklisp/software/cl-freetype2-20150709-git/cl-freetype2.asd: The variable C::*CC-FLAGS* is unbound.
ecl-16.0.0-b2661fd1-macosx-x64-lisp-to-c
(LOAD cl-cairo2-xlib FAIL) ffi-grovel, CFFI-GROVEL:GROVEL-ERROR : External process exited with code 1. Command was: "cc" "-m64" "-I/Users/testgrid/cl-test-grid/work-dir/agent/quicklisp/dists/quicklisp/software/cl-freetype2-20150709-git/src/ffi/grovel/" "-I" "/opt/local/include/" " -g -O2 -fPIC -fno-common -D_THREAD_SAFE -Ddarwin" "-I/opt/local/include/freetype2" "-I/Users/testgrid/cl-test-grid/work-dir/agent/quicklisp/dists/quicklisp/software/cffi_0.16.1/" "-o" "/Users/testgrid/cl-test-grid/... "/Users/testgrid/cl-test-grid/... Output was:
(LOAD cl-cairo2-gtk2 FAIL) ffi-grovel, CFFI-GROVEL:GROVEL-ERROR : External process exited with code 1. Command was: "cc" "-m64" "-I/Users/testgrid/cl-test-grid/work-dir/agent/quicklisp/dists/quicklisp/software/cl-freetype2-20150709-git/src/ffi/grovel/" "-I" "/opt/local/include/" " -g -O2 -fPIC -fno-common -D_THREAD_SAFE -Ddarwin" "-I/opt/local/include/freetype2" "-I/Users/testgrid/cl-test-grid/work-dir/agent/quicklisp/dists/quicklisp/software/cffi_0.16.1/" "-o" "/Users/testgrid/cl-test-grid/... "/Users/testgrid/cl-test-grid/... Output was:
ecl-16.1.2-rc2-093ba0ab-linux-x64-bytecode
(LOAD cl-cairo2-xlib FAIL) ASDF/FIND-SYSTEM:LOAD-SYSTEM-DEFINITION-ERROR : Error while trying to load definition for system cl-freetype2 from pathname /home/jack/quicklisp/local-projects/cl-test-grid/work-dir/agent/quicklisp/dists/quicklisp/software/cl-freetype2-20150709-git/cl-freetype2.asd: The variable C::*CC-FLAGS* is unbound.
(LOAD cl-cairo2-gtk2 FAIL) ASDF/FIND-SYSTEM:LOAD-SYSTEM-DEFINITION-ERROR : Error while trying to load definition for system cl-freetype2 from pathname /home/jack/quicklisp/local-projects/cl-test-grid/work-dir/agent/quicklisp/dists/quicklisp/software/cl-freetype2-20150709-git/cl-freetype2.asd: The variable C::*CC-FLAGS* is unbound.
ecl-16.1.2-rc2-093ba0ab-linux-x64-lisp-to-c
ecl-16.1.2-rc3-9e5a61f4-linux-x64-bytecode
(LOAD cl-cairo2-xlib FAIL) ASDF/FIND-SYSTEM:LOAD-SYSTEM-DEFINITION-ERROR : Error while trying to load definition for system cl-freetype2 from pathname /home/jack/Projekty/lisp-systems/cl-test-grid/work-dir/agent/quicklisp/dists/quicklisp/software/cl-freetype2-20150709-git/cl-freetype2.asd: The variable C::*CC-FLAGS* is unbound.
(LOAD cl-cairo2-gtk2 FAIL) ASDF/FIND-SYSTEM:LOAD-SYSTEM-DEFINITION-ERROR : Error while trying to load definition for system cl-freetype2 from pathname /home/jack/Projekty/lisp-systems/cl-test-grid/work-dir/agent/quicklisp/dists/quicklisp/software/cl-freetype2-20150709-git/cl-freetype2.asd: The variable C::*CC-FLAGS* is unbound.
(LOAD cl-cairo2-demos FAIL) ffi, CFFI:LOAD-FOREIGN-LIBRARY-ERROR : Unable to load any of the alternatives: ("libcairo.so.2" "libcairo.so")
(LOAD cl-cairo2 FAIL) ffi, CFFI:LOAD-FOREIGN-LIBRARY-ERROR : Unable to load any of the alternatives: ("libcairo.so.2" "libcairo.so")
(LOAD a-cl-cairo2-loader FAIL) ffi, CFFI:LOAD-FOREIGN-LIBRARY-ERROR : Unable to load any of the alternatives: ("libcairo.so.2" "libcairo.so")
ecl-16.1.2-rc3-9e5a61f4-linux-x64-lisp-to-c
(LOAD cl-cairo2-xlib FAIL) ffi, CFFI:LOAD-FOREIGN-LIBRARY-ERROR : Unable to load any of the alternatives: ("libcairo.so.2" "libcairo.so")
(LOAD cl-cairo2-gtk2 FAIL) ffi, CFFI:LOAD-FOREIGN-LIBRARY-ERROR : Unable to load any of the alternatives: ("libcairo.so.2" "libcairo.so")
(LOAD cl-cairo2-demos FAIL) ffi, CFFI:LOAD-FOREIGN-LIBRARY-ERROR : Unable to load any of the alternatives: ("libcairo.so.2" "libcairo.so")
(LOAD cl-cairo2 FAIL) ffi, CFFI:LOAD-FOREIGN-LIBRARY-ERROR : Unable to load any of the alternatives: ("libcairo.so.2" "libcairo.so")
(LOAD a-cl-cairo2-loader FAIL) ffi, CFFI:LOAD-FOREIGN-LIBRARY-ERROR : Unable to load any of the alternatives: ("libcairo.so.2" "libcairo.so")
sbcl-1.0.58-linux-x86
(LOAD cl-cairo2-xlib FAIL) ASDF:LOAD-SYSTEM-DEFINITION-ERROR : Error while trying to load definition for system cffi from pathname /home/testgrid/cl-test-grid/work-dir/agent/quicklisp/dists/quicklisp/software/cffi_0.17.1/cffi.asd: error while parsing arguments to DESTRUCTURING-BIND: invalid number of elements in (OPERATE 'TEST-OP :CFFI-TESTS) to satisfy lambda list (O C): exactly 2 expected, but 3 found
(LOAD cl-cairo2-gtk2 FAIL) ASDF:LOAD-SYSTEM-DEFINITION-ERROR : Error while trying to load definition for system cffi from pathname /home/testgrid/cl-test-grid/work-dir/agent/quicklisp/dists/quicklisp/software/cffi_0.17.1/cffi.asd: error while parsing arguments to DESTRUCTURING-BIND: invalid number of elements in (OPERATE 'TEST-OP :CFFI-TESTS) to satisfy lambda list (O C): exactly 2 expected, but 3 found
(LOAD cl-cairo2-demos FAIL) ASDF:LOAD-SYSTEM-DEFINITION-ERROR : Error while trying to load definition for system cffi from pathname /home/testgrid/cl-test-grid/work-dir/agent/quicklisp/dists/quicklisp/software/cffi_0.17.1/cffi.asd: error while parsing arguments to DESTRUCTURING-BIND: invalid number of elements in (OPERATE 'TEST-OP :CFFI-TESTS) to satisfy lambda list (O C): exactly 2 expected, but 3 found
(LOAD cl-cairo2 FAIL) ASDF:LOAD-SYSTEM-DEFINITION-ERROR : Error while trying to load definition for system cffi from pathname /home/testgrid/cl-test-grid/work-dir/agent/quicklisp/dists/quicklisp/software/cffi_0.17.1/cffi.asd: error while parsing arguments to DESTRUCTURING-BIND: invalid number of elements in (OPERATE 'TEST-OP :CFFI-TESTS) to satisfy lambda list (O C): exactly 2 expected, but 3 found
(LOAD a-cl-cairo2-loader FAIL) ASDF:LOAD-SYSTEM-DEFINITION-ERROR : Error while trying to load definition for system cffi from pathname /home/testgrid/cl-test-grid/work-dir/agent/quicklisp/dists/quicklisp/software/cffi_0.17.1/cffi.asd: error while parsing arguments to DESTRUCTURING-BIND: invalid number of elements in (OPERATE 'TEST-OP :CFFI-TESTS) to satisfy lambda list (O C): exactly 2 expected, but 3 found
(LOAD cl-cairo2-xlib FAIL) ASDF:LOAD-SYSTEM-DEFINITION-ERROR : Error while trying to load definition for system cl-freetype2 from pathname /home/testgrid/cl-test-grid/work-dir/agent/quicklisp/dists/quicklisp/software/cl-freetype2-20150709-git/cl-freetype2.asd: Error while invoking #<COMPILE-OP NIL {BD21459}> on #<CL-SOURCE-FILE "uiop" "image">
(LOAD cl-cairo2-gtk2 FAIL) ASDF:LOAD-SYSTEM-DEFINITION-ERROR : Error while trying to load definition for system bordeaux-threads from pathname /home/testgrid/cl-test-grid/work-dir/agent/quicklisp/dists/quicklisp/software/bordeaux-threads-v0.8.4-git/bordeaux-threads.asd: READ error during COMPILE-FILE: Package UIOP does not exist. Line: 68, Column: 19, File-Position: 2835 Stream: #<SB-SYS:FD-STREAM for "file /home/testgrid/cl-test-grid/work-dir/agent/quicklisp/dists/quicklisp/software/bordeaux-threads-v0.8.4-git/bordeaux-threads.asd" {BE3F581}>
(LOAD cl-cairo2-demos FAIL) ASDF:COMPILE-ERROR : Error while invoking #<COMPILE-OP (:VERBOSE NIL) {BA32481}> on #<CL-SOURCE-FILE "uiop" "image">
(LOAD cl-cairo2 FAIL) ASDF:COMPILE-ERROR : Error while invoking #<COMPILE-OP (:VERBOSE NIL) {BA09CC1}> on #<CL-SOURCE-FILE "uiop" "image">
(LOAD a-cl-cairo2-loader FAIL) ASDF:COMPILE-ERROR : Error while invoking #<COMPILE-OP (:VERBOSE NIL) {CE2CF19}> on #<CL-SOURCE-FILE "uiop" "image">
sbcl-1.1.11-linux-x86
(LOAD cl-cairo2-xlib FAIL) ASDF/FIND-SYSTEM:LOAD-SYSTEM-DEFINITION-ERROR : Error while trying to load definition for system cl-freetype2 from pathname /home/testgrid/cl-test-grid/work-dir/agent/quicklisp/dists/quicklisp/software/cl-freetype2-20150709-git/cl-freetype2.asd: Error while trying to load definition for system cffi-toolchain from pathname /home/testgrid/cl-test-grid/work-dir/agent/quicklisp/dists/quicklisp/software/cffi_0.17.1/cffi-toolchain.asd: CFFI-toolchain requires ASDF 3.1!
(LOAD cl-cairo2-gtk2 FAIL) ASDF/FIND-SYSTEM:LOAD-SYSTEM-DEFINITION-ERROR : Error while trying to load definition for system cl-freetype2 from pathname /home/testgrid/cl-test-grid/work-dir/agent/quicklisp/dists/quicklisp/software/cl-freetype2-20150709-git/cl-freetype2.asd: Error while trying to load definition for system cffi-toolchain from pathname /home/testgrid/cl-test-grid/work-dir/agent/quicklisp/dists/quicklisp/software/cffi_0.17.1/cffi-toolchain.asd: CFFI-toolchain requires ASDF 3.1!
(LOAD cl-cairo2-xlib FAIL) ffi-grovel, CFFI-GROVEL:GROVEL-ERROR : External process exited with code 1. Command was: "cc" "-m32" "-I/home/testgrid/cl-test-grid/work-dir/agent/quicklisp/dists/quicklisp/software/cl-freetype2-20150709-git/src/ffi/grovel/" "-I/usr/include/freetype2" "-I/usr/include/freetype2/freetype2" "-I/usr/include/freetype2/freetype" "-I/usr/include/freetype" "-I/home/testgrid/cl-test-grid/work-dir/agent/quicklisp/dists/quicklisp/software/cffi_0.16.1/" "-o" "/home/testgrid/cl-test-grid/work-dir/agent/test-runs/20160216212151-sbcl-1.1.11-linux-x86/fasl/ql/dists/quicklisp/software/cl-freetype2-20150709-git/src/ffi/grovel/grovel-freetype2" "/home/testgrid/cl-test-grid/work-dir/agent/test-runs/20160216212151-sbcl-1.1.11-linux-x86/fasl/ql/dists/quicklisp/software/cl-freetype2-20150709-git/src/ffi/grovel/grovel-freetype2.c" Output was: In file included from /home/testgrid/cl-test-grid/work-dir/agent/test-runs/20160216212151-sbcl-1.1.11-linux-x86/fasl/ql/dists/quicklisp/software/cl-freetype2-20150709-git/src/ffi/grovel/grovel-freetype2.c:6:0: /home/testgrid/cl-test-grid/work-dir/agent/quicklisp/dists/quicklisp/software/cl-freetype2-20150709-git/src/ffi/grovel/grovel-freetype.h:2:22: fatal error: ft2build.h: No such file or directory compilation terminated.
(LOAD cl-cairo2-gtk2 FAIL) ffi-grovel, CFFI-GROVEL:GROVEL-ERROR : External process exited with code 1. Command was: "cc" "-m32" "-I/home/testgrid/cl-test-grid/work-dir/agent/quicklisp/dists/quicklisp/software/cl-freetype2-20150709-git/src/ffi/grovel/" "-I/usr/include/freetype2" "-I/usr/include/freetype2/freetype2" "-I/usr/include/freetype2/freetype" "-I/usr/include/freetype" "-I/home/testgrid/cl-test-grid/work-dir/agent/quicklisp/dists/quicklisp/software/cffi_0.16.1/" "-o" "/home/testgrid/cl-test-grid/work-dir/agent/test-runs/20160216212151-sbcl-1.1.11-linux-x86/fasl/ql/dists/quicklisp/software/cl-freetype2-20150709-git/src/ffi/grovel/grovel-freetype2" "/home/testgrid/cl-test-grid/work-dir/agent/test-runs/20160216212151-sbcl-1.1.11-linux-x86/fasl/ql/dists/quicklisp/software/cl-freetype2-20150709-git/src/ffi/grovel/grovel-freetype2.c" Output was: In file included from /home/testgrid/cl-test-grid/work-dir/agent/test-runs/20160216212151-sbcl-1.1.11-linux-x86/fasl/ql/dists/quicklisp/software/cl-freetype2-20150709-git/src/ffi/grovel/grovel-freetype2.c:6:0: /home/testgrid/cl-test-grid/work-dir/agent/quicklisp/dists/quicklisp/software/cl-freetype2-20150709-git/src/ffi/grovel/grovel-freetype.h:2:22: fatal error: ft2build.h: No such file or directory compilation terminated.
sbcl-1.1.16-linux-x86
(LOAD cl-cairo2-xlib FAIL) ASDF/FIND-SYSTEM:LOAD-SYSTEM-DEFINITION-ERROR : Error while trying to load definition for system cl-freetype2 from pathname /home/testgrid/cl-test-grid/work-dir/agent/quicklisp/dists/quicklisp/software/cl-freetype2-20150709-git/cl-freetype2.asd: Error while trying to load definition for system cffi-toolchain from pathname /home/testgrid/cl-test-grid/work-dir/agent/quicklisp/dists/quicklisp/software/cffi_0.17.1/cffi-toolchain.asd: CFFI-toolchain requires ASDF 3.1!
(LOAD cl-cairo2-gtk2 FAIL) ASDF/FIND-SYSTEM:LOAD-SYSTEM-DEFINITION-ERROR : Error while trying to load definition for system cl-freetype2 from pathname /home/testgrid/cl-test-grid/work-dir/agent/quicklisp/dists/quicklisp/software/cl-freetype2-20150709-git/cl-freetype2.asd: Error while trying to load definition for system cffi-toolchain from pathname /home/testgrid/cl-test-grid/work-dir/agent/quicklisp/dists/quicklisp/software/cffi_0.17.1/cffi-toolchain.asd: CFFI-toolchain requires ASDF 3.1!
(LOAD cl-cairo2-xlib FAIL) ffi-grovel, CFFI-GROVEL:GROVEL-ERROR : External process exited with code 1. Command was: "cc" "-m32" "-I/home/testgrid/cl-test-grid/work-dir/agent/quicklisp/dists/quicklisp/software/cl-freetype2-20150709-git/src/ffi/grovel/" "-I/usr/include/freetype2" "-I/usr/include/freetype2/freetype2" "-I/usr/include/freetype2/freetype" "-I/usr/include/freetype" "-I/home/testgrid/cl-test-grid/work-dir/agent/quicklisp/dists/quicklisp/software/cffi_0.16.1/" "-o" "/home/testgrid/cl-test-grid/work-dir/agent/test-runs/20160216184032-sbcl-1.1.16-linux-x86/fasl/ql/dists/quicklisp/software/cl-freetype2-20150709-git/src/ffi/grovel/grovel-freetype2" "/home/testgrid/cl-test-grid/work-dir/agent/test-runs/20160216184032-sbcl-1.1.16-linux-x86/fasl/ql/dists/quicklisp/software/cl-freetype2-20150709-git/src/ffi/grovel/grovel-freetype2.c" Output was: In file included from /home/testgrid/cl-test-grid/work-dir/agent/test-runs/20160216184032-sbcl-1.1.16-linux-x86/fasl/ql/dists/quicklisp/software/cl-freetype2-20150709-git/src/ffi/grovel/grovel-freetype2.c:6:0: /home/testgrid/cl-test-grid/work-dir/agent/quicklisp/dists/quicklisp/software/cl-freetype2-20150709-git/src/ffi/grovel/grovel-freetype.h:2:22: fatal error: ft2build.h: No such file or directory compilation terminated.
(LOAD cl-cairo2-gtk2 FAIL) ffi-grovel, CFFI-GROVEL:GROVEL-ERROR : External process exited with code 1. Command was: "cc" "-m32" "-I/home/testgrid/cl-test-grid/work-dir/agent/quicklisp/dists/quicklisp/software/cl-freetype2-20150709-git/src/ffi/grovel/" "-I/usr/include/freetype2" "-I/usr/include/freetype2/freetype2" "-I/usr/include/freetype2/freetype" "-I/usr/include/freetype" "-I/home/testgrid/cl-test-grid/work-dir/agent/quicklisp/dists/quicklisp/software/cffi_0.16.1/" "-o" "/home/testgrid/cl-test-grid/work-dir/agent/test-runs/20160216184032-sbcl-1.1.16-linux-x86/fasl/ql/dists/quicklisp/software/cl-freetype2-20150709-git/src/ffi/grovel/grovel-freetype2" "/home/testgrid/cl-test-grid/work-dir/agent/test-runs/20160216184032-sbcl-1.1.16-linux-x86/fasl/ql/dists/quicklisp/software/cl-freetype2-20150709-git/src/ffi/grovel/grovel-freetype2.c" Output was: In file included from /home/testgrid/cl-test-grid/work-dir/agent/test-runs/20160216184032-sbcl-1.1.16-linux-x86/fasl/ql/dists/quicklisp/software/cl-freetype2-20150709-git/src/ffi/grovel/grovel-freetype2.c:6:0: /home/testgrid/cl-test-grid/work-dir/agent/quicklisp/dists/quicklisp/software/cl-freetype2-20150709-git/src/ffi/grovel/grovel-freetype.h:2:22: fatal error: ft2build.h: No such file or directory compilation terminated.
sbcl-1.2.14-linux-arm
(LOAD cl-cairo2-xlib FAIL) ASDF/FIND-SYSTEM:LOAD-SYSTEM-DEFINITION-ERROR : Error while trying to load definition for system cl-freetype2 from pathname /home/testgrid/cl-test-grid/work-dir/agent/quicklisp/dists/quicklisp/software/cl-freetype2-20150709-git/cl-freetype2.asd: COMPILE-FILE-ERROR while compiling #<CL-SOURCE-FILE "cffi-toolchain" "toolchain" "c-toolchain">
(LOAD cl-cairo2-gtk2 FAIL) ASDF/FIND-SYSTEM:LOAD-SYSTEM-DEFINITION-ERROR : Error while trying to load definition for system cl-freetype2 from pathname /home/testgrid/cl-test-grid/work-dir/agent/quicklisp/dists/quicklisp/software/cl-freetype2-20150709-git/cl-freetype2.asd: COMPILE-FILE-ERROR while compiling #<CL-SOURCE-FILE "cffi-toolchain" "toolchain" "c-toolchain">
(LOAD cl-cairo2-xlib FAIL) ffi-grovel, CFFI-GROVEL:GROVEL-ERROR : External process exited with code 1. Command was: "cc" "-marm" "-I/home/testgrid/cl-test-grid/work-dir/agent/quicklisp/dists/quicklisp/software/cl-freetype2-20150709-git/src/ffi/grovel/" "-I/usr/include/freetype2" "-I/usr/include/freetype2/freetype2" "-I/usr/include/freetype2/freetype" "-I/usr/include/freetype" "-I/home/testgrid/cl-test-grid/work-dir/agent/quicklisp/dists/quicklisp/software/cffi_0.16.1/" "-o" "/home/testgrid/cl-test-grid/work-dir/agent/test-runs/20160214122543-sbcl-1.2.14-linux-arm/fasl/ql/dists/quicklisp/software/cl-freetype2-20150709-git/src/ffi/grovel/grovel-freetype2" "/home/testgrid/cl-test-grid/work-dir/agent/test-runs/20160214122543-sbcl-1.2.14-linux-arm/fasl/ql/dists/quicklisp/software/cl-freetype2-20150709-git/src/ffi/grovel/grovel-freetype2.c" Output was: In file included from /home/testgrid/cl-test-grid/work-dir/agent/test-runs/20160214122543-sbcl-1.2.14-linux-arm/fasl/ql/dists/quicklisp/software/cl-freetype2-20150709-git/src/ffi/grovel/grovel-freetype2.c:6:0: /home/testgrid/cl-test-grid/work-dir/agent/quicklisp/dists/quicklisp/software/cl-freetype2-20150709-git/src/ffi/grovel/grovel-freetype.h:2:22: fatal error: ft2build.h: No such file or directory #include <ft2build.h> ^ compilation terminated.
(LOAD cl-cairo2-gtk2 FAIL) ffi-grovel, CFFI-GROVEL:GROVEL-ERROR : External process exited with code 1. Command was: "cc" "-marm" "-I/home/testgrid/cl-test-grid/work-dir/agent/quicklisp/dists/quicklisp/software/cl-freetype2-20150709-git/src/ffi/grovel/" "-I/usr/include/freetype2" "-I/usr/include/freetype2/freetype2" "-I/usr/include/freetype2/freetype" "-I/usr/include/freetype" "-I/home/testgrid/cl-test-grid/work-dir/agent/quicklisp/dists/quicklisp/software/cffi_0.16.1/" "-o" "/home/testgrid/cl-test-grid/work-dir/agent/test-runs/20160214122543-sbcl-1.2.14-linux-arm/fasl/ql/dists/quicklisp/software/cl-freetype2-20150709-git/src/ffi/grovel/grovel-freetype2" "/home/testgrid/cl-test-grid/work-dir/agent/test-runs/20160214122543-sbcl-1.2.14-linux-arm/fasl/ql/dists/quicklisp/software/cl-freetype2-20150709-git/src/ffi/grovel/grovel-freetype2.c" Output was: In file included from /home/testgrid/cl-test-grid/work-dir/agent/test-runs/20160214122543-sbcl-1.2.14-linux-arm/fasl/ql/dists/quicklisp/software/cl-freetype2-20150709-git/src/ffi/grovel/grovel-freetype2.c:6:0: /home/testgrid/cl-test-grid/work-dir/agent/quicklisp/dists/quicklisp/software/cl-freetype2-20150709-git/src/ffi/grovel/grovel-freetype.h:2:22: fatal error: ft2build.h: No such file or directory #include <ft2build.h> ^ compilation terminated.
sbcl-1.2.3-linux-x64
(LOAD cl-cairo2-xlib FAIL) ASDF/FIND-SYSTEM:LOAD-SYSTEM-DEFINITION-ERROR : Error while trying to load definition for system cl-freetype2 from pathname /home/hijarian/systems/cl-test-grid/work-dir/agent/quicklisp/dists/quicklisp/software/cl-freetype2-20150709-git/cl-freetype2.asd: COMPILE-FILE-ERROR while compiling #<CL-SOURCE-FILE "cffi-toolchain" "toolchain" "asdf-compat">
(LOAD cl-cairo2-gtk2 FAIL) ASDF/FIND-SYSTEM:LOAD-SYSTEM-DEFINITION-ERROR : Error while trying to load definition for system cl-freetype2 from pathname /home/hijarian/systems/cl-test-grid/work-dir/agent/quicklisp/dists/quicklisp/software/cl-freetype2-20150709-git/cl-freetype2.asd: COMPILE-FILE-ERROR while compiling #<CL-SOURCE-FILE "cffi-toolchain" "toolchain" "asdf-compat">
sbcl-1.2.6-linux-x86
(LOAD cl-cairo2-xlib FAIL) ffi-grovel, CFFI-GROVEL:GROVEL-ERROR : External process exited with code 1. Command was: "cc" "-m32" "-I/home/testgrid/cl-test-grid/work-dir/agent/quicklisp/dists/quicklisp/software/cl-freetype2-20150709-git/src/ffi/grovel/" "-I/usr/include/freetype2" "-I/usr/include/freetype2/freetype2" "-I/usr/include/freetype2/freetype" "-I/usr/include/freetype" "-I/home/testgrid/cl-test-grid/work-dir/agent/quicklisp/dists/quicklisp/software/cffi_0.16.1/" "-o" "/home/testgrid/cl-test-grid/work-dir/agent/test-runs/20160213220313-sbcl-1.2.6-linux-x86/fasl/ql/dists/quicklisp/software/cl-freetype2-20150709-git/src/ffi/grovel/grovel-freetype2" "/home/testgrid/cl-test-grid/work-dir/agent/test-runs/20160213220313-sbcl-1.2.6-linux-x86/fasl/ql/dists/quicklisp/software/cl-freetype2-20150709-git/src/ffi/grovel/grovel-freetype2.c" Output was: In file included from /home/testgrid/cl-test-grid/work-dir/agent/test-runs/20160213220313-sbcl-1.2.6-linux-x86/fasl/ql/dists/quicklisp/software/cl-freetype2-20150709-git/src/ffi/grovel/grovel-freetype2.c:6:0: /home/testgrid/cl-test-grid/work-dir/agent/quicklisp/dists/quicklisp/software/cl-freetype2-20150709-git/src/ffi/grovel/grovel-freetype.h:2:22: fatal error: ft2build.h: No such file or directory compilation terminated.
(LOAD cl-cairo2-gtk2 FAIL) ffi-grovel, CFFI-GROVEL:GROVEL-ERROR : External process exited with code 1. Command was: "cc" "-m32" "-I/home/testgrid/cl-test-grid/work-dir/agent/quicklisp/dists/quicklisp/software/cl-freetype2-20150709-git/src/ffi/grovel/" "-I/usr/include/freetype2" "-I/usr/include/freetype2/freetype2" "-I/usr/include/freetype2/freetype" "-I/usr/include/freetype" "-I/home/testgrid/cl-test-grid/work-dir/agent/quicklisp/dists/quicklisp/software/cffi_0.16.1/" "-o" "/home/testgrid/cl-test-grid/work-dir/agent/test-runs/20160213220313-sbcl-1.2.6-linux-x86/fasl/ql/dists/quicklisp/software/cl-freetype2-20150709-git/src/ffi/grovel/grovel-freetype2" "/home/testgrid/cl-test-grid/work-dir/agent/test-runs/20160213220313-sbcl-1.2.6-linux-x86/fasl/ql/dists/quicklisp/software/cl-freetype2-20150709-git/src/ffi/grovel/grovel-freetype2.c" Output was: In file included from /home/testgrid/cl-test-grid/work-dir/agent/test-runs/20160213220313-sbcl-1.2.6-linux-x86/fasl/ql/dists/quicklisp/software/cl-freetype2-20150709-git/src/ffi/grovel/grovel-freetype2.c:6:0: /home/testgrid/cl-test-grid/work-dir/agent/quicklisp/dists/quicklisp/software/cl-freetype2-20150709-git/src/ffi/grovel/grovel-freetype.h:2:22: fatal error: ft2build.h: No such file or directory compilation terminated.
sbcl-1.3.2.92-4077405-macosx-x64
(LOAD cl-cairo2-xlib FAIL) ffi-grovel, CFFI-GROVEL:GROVEL-ERROR : External process exited with code 1. Command was: "cc" "-m64" "-I/Users/testgrid/cl-test-grid/work-dir/agent/quicklisp/dists/quicklisp/software/cl-freetype2-20150709-git/src/ffi/grovel/" "-I" "/opt/local/include/" "-I/opt/local/include/freetype2" "-I/Users/testgrid/cl-test-grid/work-dir/agent/quicklisp/dists/quicklisp/software/cffi_0.16.1/" "-o" "/Users/testgrid/cl-test-grid/work-dir/agent/test-runs/20160220052250-sbcl-1.3.2.92-4077405-macosx-x64/fasl/ql/dists/quicklisp/software/cl-freetype2-20150709-git/src/ffi/grovel/grovel-freetype2" "/Users/testgrid/cl-test-grid/work-dir/agent/test-runs/20160220052250-sbcl-1.3.2.92-4077405-macosx-x64/fasl/ql/dists/quicklisp/software/cl-freetype2-20150709-git/src/ffi/grovel/grovel-freetype2.c" Output was: In file included from /Users/testgrid/cl-test-grid/work-dir/agent/test-runs/20160220052250-sbcl-1.3.2.92-4077405-macosx-x64/fasl/ql/dists/quicklisp/software/cl-freetype2-20150709-git/src/ffi/grovel/grovel-freetype2.c:6: /Users/testgrid/cl-test-grid/work-dir/agent/quicklisp/dists/quicklisp/software/cl-freetype2-20150709-git/src/ffi/grovel/grovel-freetype.h:2:10: fatal error: 'ft2build.h' file not found #include <ft2build.h> ^ 1 error generated.
(LOAD cl-cairo2-gtk2 FAIL) ffi-grovel, CFFI-GROVEL:GROVEL-ERROR : External process exited with code 1. Command was: "cc" "-m64" "-I/Users/testgrid/cl-test-grid/work-dir/agent/quicklisp/dists/quicklisp/software/cl-freetype2-20150709-git/src/ffi/grovel/" "-I" "/opt/local/include/" "-I/opt/local/include/freetype2" "-I/Users/testgrid/cl-test-grid/work-dir/agent/quicklisp/dists/quicklisp/software/cffi_0.16.1/" "-o" "/Users/testgrid/cl-test-grid/work-dir/agent/test-runs/20160220052250-sbcl-1.3.2.92-4077405-macosx-x64/fasl/ql/dists/quicklisp/software/cl-freetype2-20150709-git/src/ffi/grovel/grovel-freetype2" "/Users/testgrid/cl-test-grid/work-dir/agent/test-runs/20160220052250-sbcl-1.3.2.92-4077405-macosx-x64/fasl/ql/dists/quicklisp/software/cl-freetype2-20150709-git/src/ffi/grovel/grovel-freetype2.c" Output was: In file included from /Users/testgrid/cl-test-grid/work-dir/agent/test-runs/20160220052250-sbcl-1.3.2.92-4077405-macosx-x64/fasl/ql/dists/quicklisp/software/cl-freetype2-20150709-git/src/ffi/grovel/grovel-freetype2.c:6: /Users/testgrid/cl-test-grid/work-dir/agent/quicklisp/dists/quicklisp/software/cl-freetype2-20150709-git/src/ffi/grovel/grovel-freetype.h:2:10: fatal error: 'ft2build.h' file not found #include <ft2build.h> ^ 1 error generated.

Breakdown by testcases: for every failed testcase the lisp implmentations it fails on

The library does not have a testsuite adapter for CL Test Grid.

To reports overview

Generated at: 2016-04-17 01:15:20 GMT.