cffi results collected by cl-test-grid

Results on the last two Quicklisp distributions

 quicklisp 2016-03-18quicklisp 2016-02-08
abcl-1.2.1-fasl42-linux-x86
(LOAD cffi-toolchain FAIL) ASDF/FIND-SYSTEM:LOAD-SYSTEM-DEFINITION-ERROR : Error while trying to load definition for system cffi-toolchain from pathname /home/testgrid/cl-test-grid/work-dir/agent/quicklisp/dists/quicklisp/software/cffi_0.17.1/cffi-toolchain.asd: CFFI-toolchain requires ASDF 3.1!
(LOAD cffi-tests FAIL) ASDF/FIND-SYSTEM:LOAD-SYSTEM-DEFINITION-ERROR : Error while trying to load definition for system cffi-tests from pathname /home/testgrid/cl-test-grid/work-dir/agent/quicklisp/dists/quicklisp/software/cffi_0.17.1/cffi-tests.asd: Error while trying to load definition for system cffi-toolchain from pathname /home/testgrid/cl-test-grid/work-dir/agent/quicklisp/dists/quicklisp/software/cffi_0.17.1/cffi-toolchain.asd: CFFI-toolchain requires ASDF 3.1!
(LOAD cffi-libffi FAIL) ASDF/FIND-SYSTEM:LOAD-SYSTEM-DEFINITION-ERROR : Error while trying to load definition for system cffi-libffi from pathname /home/testgrid/cl-test-grid/work-dir/agent/quicklisp/dists/quicklisp/software/cffi_0.17.1/cffi-libffi.asd: Error while trying to load definition for system cffi-toolchain from pathname /home/testgrid/cl-test-grid/work-dir/agent/quicklisp/dists/quicklisp/software/cffi_0.17.1/cffi-toolchain.asd: CFFI-toolchain requires ASDF 3.1!
(LOAD cffi-grovel FAIL) ASDF/FIND-SYSTEM:LOAD-SYSTEM-DEFINITION-ERROR : Error while trying to load definition for system cffi-toolchain from pathname /home/testgrid/cl-test-grid/work-dir/agent/quicklisp/dists/quicklisp/software/cffi_0.17.1/cffi-toolchain.asd: CFFI-toolchain requires ASDF 3.1!
(WHOLE-TEST-SUITE FAIL) ASDF/FIND-SYSTEM:LOAD-SYSTEM-DEFINITION-ERROR : Error while trying to load definition for system cffi-tests from pathname /home/testgrid/cl-test-grid/work-dir/agent/quicklisp/dists/quicklisp/software/cffi_0.17.1/cffi-tests.asd: Error while trying to load definition for system cffi-toolchain from pathname /home/testgrid/cl-test-grid/work-dir/agent/quicklisp/dists/quicklisp/software/cffi_0.17.1/cffi-toolchain.asd: CFFI-toolchain requires ASDF 3.1!
(LOAD cffi-tests FAIL) COMMON-LISP:TYPE-ERROR : The value NIL is not of type NUMBER.
(WHOLE-TEST-SUITE FAIL) COMMON-LISP:FILE-ERROR : File not found: /home/testgrid/cl-test-grid/work-dir/agent/test-runs/20160219104759-abcl-1.2.1-fasl42-linux-x86/fasl/test-grid/work-dir/agent/quicklisp/dists/quicklisp/software/cffi_0.16.1/libffi/libffi-unix.abcl
abcl-1.3.0-fasl42-linux-x86
(LOAD cffi-toolchain FAIL) ASDF/FIND-COMPONENT:MISSING-DEPENDENCY-OF-VERSION : Component "asdf" does not match version 3.1.2, required by #<ASDF/SYSTEM:SYSTEM "cffi-toolchain">
(LOAD cffi-tests FAIL) ASDF/FIND-SYSTEM:LOAD-SYSTEM-DEFINITION-ERROR : Error while trying to load definition for system cffi-tests from pathname /home/testgrid/cl-test-grid/work-dir/agent/quicklisp/dists/quicklisp/software/cffi_0.17.1/cffi-tests.asd: Component "asdf" does not match version 3.1.2, required by #<ASDF/SYSTEM:SYSTEM "cffi-toolchain">
(LOAD cffi-libffi FAIL) ASDF/FIND-SYSTEM:LOAD-SYSTEM-DEFINITION-ERROR : Error while trying to load definition for system cffi-libffi from pathname /home/testgrid/cl-test-grid/work-dir/agent/quicklisp/dists/quicklisp/software/cffi_0.17.1/cffi-libffi.asd: Component "asdf" does not match version 3.1.2, required by #<SYSTEM "cffi-toolchain">
(LOAD cffi-grovel FAIL) ASDF/FIND-COMPONENT:MISSING-DEPENDENCY-OF-VERSION : Component "asdf" does not match version 3.1.2, required by #<ASDF/SYSTEM:SYSTEM "cffi-toolchain">
(WHOLE-TEST-SUITE FAIL) ASDF/FIND-SYSTEM:LOAD-SYSTEM-DEFINITION-ERROR : Error while trying to load definition for system cffi-tests from pathname /home/testgrid/cl-test-grid/work-dir/agent/quicklisp/dists/quicklisp/software/cffi_0.17.1/cffi-tests.asd: Component "asdf" does not match version 3.1.2, required by #<ASDF/SYSTEM:SYSTEM "cffi-toolchain">
(LOAD cffi-tests FAIL) ASDF/FIND-SYSTEM:LOAD-SYSTEM-DEFINITION-ERROR : Error while trying to load definition for system cffi-tests from pathname /home/testgrid/cl-test-grid/work-dir/agent/quicklisp/dists/quicklisp/software/cffi_0.16.1/cffi-tests.asd: don't recognize component type :C-TEST-LIB
(WHOLE-TEST-SUITE FAIL) COMMON-LISP:FILE-ERROR : File not found: /home/testgrid/cl-test-grid/work-dir/agent/test-runs/20160218183137-abcl-1.3.0-fasl42-linux-x86/fasl/test-grid/work-dir/agent/quicklisp/dists/quicklisp/software/cffi_0.16.1/libffi/libffi-unix.abcl
abcl-1.3.1-fasl42-linux-x86
(LOAD cffi-toolchain FAIL) ASDF/FIND-COMPONENT:MISSING-DEPENDENCY-OF-VERSION : Component "asdf" does not match version 3.1.2, required by #<ASDF/SYSTEM:SYSTEM "cffi-toolchain">
(LOAD cffi-tests FAIL) ASDF/FIND-SYSTEM:LOAD-SYSTEM-DEFINITION-ERROR : Error while trying to load definition for system cffi-tests from pathname /home/testgrid/cl-test-grid/work-dir/agent/quicklisp/dists/quicklisp/software/cffi_0.17.1/cffi-tests.asd: Component "asdf" does not match version 3.1.2, required by #<ASDF/SYSTEM:SYSTEM "cffi-toolchain">
(LOAD cffi-libffi FAIL) ASDF/FIND-SYSTEM:LOAD-SYSTEM-DEFINITION-ERROR : Error while trying to load definition for system cffi-libffi from pathname /home/testgrid/cl-test-grid/work-dir/agent/quicklisp/dists/quicklisp/software/cffi_0.17.1/cffi-libffi.asd: Component "asdf" does not match version 3.1.2, required by #<SYSTEM "cffi-toolchain">
(LOAD cffi-grovel FAIL) ASDF/FIND-COMPONENT:MISSING-DEPENDENCY-OF-VERSION : Component "asdf" does not match version 3.1.2, required by #<ASDF/SYSTEM:SYSTEM "cffi-toolchain">
(WHOLE-TEST-SUITE FAIL) ASDF/FIND-SYSTEM:LOAD-SYSTEM-DEFINITION-ERROR : Error while trying to load definition for system cffi-tests from pathname /home/testgrid/cl-test-grid/work-dir/agent/quicklisp/dists/quicklisp/software/cffi_0.17.1/cffi-tests.asd: Component "asdf" does not match version 3.1.2, required by #<ASDF/SYSTEM:SYSTEM "cffi-toolchain">
(WHOLE-TEST-SUITE FAIL) COMMON-LISP:FILE-ERROR : File not found: /home/testgrid/cl-test-grid/work-dir/agent/test-runs/20160217235158-abcl-1.3.1-fasl42-linux-x86/fasl/test-grid/work-dir/agent/quicklisp/dists/quicklisp/software/cffi_0.16.1/libffi/libffi-unix.abcl
abcl-1.3.2-fasl42-linux-x86
(WHOLE-TEST-SUITE FAIL) COMMON-LISP:FILE-ERROR : File not found: /home/testgrid/cl-test-grid/work-dir/agent/test-runs/20160215090312-abcl-1.3.2-fasl42-linux-x86/fasl/test-grid/work-dir/agent/quicklisp/dists/quicklisp/software/cffi_0.16.1/libffi/libffi-unix.abcl
ccl-1.10-r16196-f101-linux-arm
(LOAD cffi-tests FAIL) ffi-grovel, CFFI-GROVEL:GROVEL-ERROR : Subprocess (:PROCESS #<EXTERNAL-PROCESS (cc -marm -o ...)[1709] (EXITED : 1) #x45447D26>) with command ("cc" "-marm" "-o" "/home/testgrid/cl-test-grid/work-dir/agent/test-runs/20160407185412-ccl-1.10-r16196-f101-linux-arm/fasl/ql/dists/quicklisp/software/cffi_0.17.1/libffi/libffi-types__grovel-tmpQDDPHH86" "-I/home/testgrid/cl-test-grid/work-dir/agent/quicklisp/dists/quicklisp/software/cffi_0.17.1/" "/home/testgrid/cl-test-grid/work-dir/agent/test-runs/20160407185412-ccl-1.10-r16196-f101-linux-arm/fasl/ql/dists/quicklisp/software/cffi_0.17.1/libffi/libffi-types__grovel.c") exited with error code 1
(LOAD cffi-libffi FAIL) ffi-grovel, CFFI-GROVEL:GROVEL-ERROR : Subprocess (:PROCESS #<EXTERNAL-PROCESS (cc -marm -o ...)[1701] (EXITED : 1) #x4543FA76>) with command ("cc" "-marm" "-o" "/home/testgrid/cl-test-grid/work-dir/agent/test-runs/20160407185412-ccl-1.10-r16196-f101-linux-arm/fasl/ql/dists/quicklisp/software/cffi_0.17.1/libffi/libffi-types__grovel-tmpQDDPHH86" "-I/home/testgrid/cl-test-grid/work-dir/agent/quicklisp/dists/quicklisp/software/cffi_0.17.1/" "/home/testgrid/cl-test-grid/work-dir/agent/test-runs/20160407185412-ccl-1.10-r16196-f101-linux-arm/fasl/ql/dists/quicklisp/software/cffi_0.17.1/libffi/libffi-types__grovel.c") exited with error code 1
(WHOLE-TEST-SUITE FAIL) ffi-grovel, CFFI-GROVEL:GROVEL-ERROR : Subprocess (:PROCESS #<EXTERNAL-PROCESS (cc -marm -o ...)[1723] (EXITED : 1) #x4546D82E>) with command ("cc" "-marm" "-o" "/home/testgrid/cl-test-grid/w... "-I/home/testgrid/cl-test-grid/work-dir/agent/quicklisp/dists/quicklisp/software/cffi_0.17.1/" "/home/testgrid/cl-test-grid/w... exited with error code 1
(LOAD cffi-tests FAIL) ffi-grovel, CFFI-GROVEL:GROVEL-ERROR : External process exited with code 1. Command was: "cc" "-marm" "-I/home/testgrid/cl-test-grid/work-dir/agent/quicklisp/dists/quicklisp/software/cffi_0.16.1/" "-o" "/home/testgrid/cl-test-grid/work-dir/agent/test-runs/20160215053538-ccl-1.10-r16196-f101-linux-arm/fasl/ql/dists/quicklisp/software/cffi_0.16.1/libffi/libffi-unix" "/home/testgrid/cl-test-grid/work-dir/agent/test-runs/20160215053538-ccl-1.10-r16196-f101-linux-arm/fasl/ql/dists/quicklisp/software/cffi_0.16.1/libffi/libffi-unix.c" Output was: /home/testgrid/cl-test-grid/work-dir/agent/test-runs/20160215053538-ccl-1.10-r16196-f101-linux-arm/fasl/ql/dists/quicklisp/software/cffi_0.16.1/libffi/libffi-unix.c: In function ‘main’: /home/testgrid/cl-test-grid/work-dir/agent/test-runs/20160215053538-ccl-1.10-r16196-f101-linux-arm/fasl/ql/dists/quicklisp/software/cffi_0.16.1/libffi/libffi-unix.c:82:41: error: ‘FFI_UNIX64’ undeclared (first use in this function) fprintf(output, "%"PRIiMAX, (intmax_t)FFI_UNIX64); ^ /home/testgrid/cl-test-grid/work-dir/agent/test-runs/20160215053538-ccl-1.10-r16196-f101-linux-arm/fasl/ql/dists/quicklisp/software/cffi_0.16.1/libffi/libffi-unix.c:82:41: note: each undeclared identifier is reported only once for each function it appears in In file included from /usr/include/string.h:32:0, from /home/testgrid/cl-test-grid/work-dir/agent/quicklisp/dists/quicklisp/software/cffi_0.16.1/grovel/common.h:4, from /home/testgrid/cl-test-grid/work-dir/agent/test-runs/20160215053538-ccl-1.10-r16196-f101-linux-arm/fasl/ql/dists/quicklisp/software/cffi_0.16.1/libffi/libffi-unix.c:9: /home/testgrid/cl-test-grid/work-dir/agent/test-runs/20160215053538-ccl-1.10-r16196-f101-linux-arm/fasl/ql/dists/quicklisp/software/cffi_0.16.1/libffi/libffi-unix.c:146:52: warning: format ‘%li’ expects argument of type ‘long int’, but argument 3 has type ‘unsigned int’ [-Wformat=] fprintf(output, " :offset %li)", offsetof(struct _ffi_type, size)); ^ /home/testgrid/cl-test-grid/work-dir/agent/test-runs/20160215053538-ccl-1.10-r16196-f101-linux-arm/fasl/ql/dists/quicklisp/software/cffi_0.16.1/libffi/libffi-unix.c:151:52: warning: format ‘%li’ expects argument of type ‘long int’, but argument 3 has type ‘unsigned int’ [-Wformat=] fprintf(output, " :offset %li)", offsetof(struct _ffi_type, alignment)); ^ /home/testgrid/cl-test-grid/work-dir/agent/test-runs/20160215053538-ccl-1.10-r16196-f101-linux-arm/fasl/ql/dists/quicklisp/software/cffi_0.16.1/libffi/libffi-unix.c:156:52: warning: format ‘%li’ expects argument of type ‘long int’, but argument 3 has type ‘unsigned int’ [-Wformat=] fprintf(output, " :offset %li)", offsetof(struct _ffi_type, type)); ^ /home/testgrid/cl-test-grid/work-dir/agent/test-runs/20160215053538-ccl-1.10-r16196-f101-linux-arm/fasl/ql/dists/quicklisp/software/cffi_0.16.1/libffi/libffi-unix.c:161:52: warning: format ‘%li’ expects argument of type ‘long int’, but argument 3 has type ‘unsigned int’ [-Wformat=] fprintf(output, " :offset %li)", offsetof(struct _ffi_type, elements)); ^
(LOAD cffi-libffi FAIL) ffi-grovel, CFFI-GROVEL:GROVEL-ERROR : External process exited with code 1. Command was: "cc" "-marm" "-I/home/testgrid/cl-test-grid/work-dir/agent/quicklisp/dists/quicklisp/software/cffi_0.16.1/" "-o" "/home/testgrid/cl-test-grid/work-dir/agent/test-runs/20160215053538-ccl-1.10-r16196-f101-linux-arm/fasl/ql/dists/quicklisp/software/cffi_0.16.1/libffi/libffi-unix" "/home/testgrid/cl-test-grid/work-dir/agent/test-runs/20160215053538-ccl-1.10-r16196-f101-linux-arm/fasl/ql/dists/quicklisp/software/cffi_0.16.1/libffi/libffi-unix.c" Output was: /home/testgrid/cl-test-grid/work-dir/agent/test-runs/20160215053538-ccl-1.10-r16196-f101-linux-arm/fasl/ql/dists/quicklisp/software/cffi_0.16.1/libffi/libffi-unix.c: In function ‘main’: /home/testgrid/cl-test-grid/work-dir/agent/test-runs/20160215053538-ccl-1.10-r16196-f101-linux-arm/fasl/ql/dists/quicklisp/software/cffi_0.16.1/libffi/libffi-unix.c:82:41: error: ‘FFI_UNIX64’ undeclared (first use in this function) fprintf(output, "%"PRIiMAX, (intmax_t)FFI_UNIX64); ^ /home/testgrid/cl-test-grid/work-dir/agent/test-runs/20160215053538-ccl-1.10-r16196-f101-linux-arm/fasl/ql/dists/quicklisp/software/cffi_0.16.1/libffi/libffi-unix.c:82:41: note: each undeclared identifier is reported only once for each function it appears in In file included from /usr/include/string.h:32:0, from /home/testgrid/cl-test-grid/work-dir/agent/quicklisp/dists/quicklisp/software/cffi_0.16.1/grovel/common.h:4, from /home/testgrid/cl-test-grid/work-dir/agent/test-runs/20160215053538-ccl-1.10-r16196-f101-linux-arm/fasl/ql/dists/quicklisp/software/cffi_0.16.1/libffi/libffi-unix.c:9: /home/testgrid/cl-test-grid/work-dir/agent/test-runs/20160215053538-ccl-1.10-r16196-f101-linux-arm/fasl/ql/dists/quicklisp/software/cffi_0.16.1/libffi/libffi-unix.c:146:52: warning: format ‘%li’ expects argument of type ‘long int’, but argument 3 has type ‘unsigned int’ [-Wformat=] fprintf(output, " :offset %li)", offsetof(struct _ffi_type, size)); ^ /home/testgrid/cl-test-grid/work-dir/agent/test-runs/20160215053538-ccl-1.10-r16196-f101-linux-arm/fasl/ql/dists/quicklisp/software/cffi_0.16.1/libffi/libffi-unix.c:151:52: warning: format ‘%li’ expects argument of type ‘long int’, but argument 3 has type ‘unsigned int’ [-Wformat=] fprintf(output, " :offset %li)", offsetof(struct _ffi_type, alignment)); ^ /home/testgrid/cl-test-grid/work-dir/agent/test-runs/20160215053538-ccl-1.10-r16196-f101-linux-arm/fasl/ql/dists/quicklisp/software/cffi_0.16.1/libffi/libffi-unix.c:156:52: warning: format ‘%li’ expects argument of type ‘long int’, but argument 3 has type ‘unsigned int’ [-Wformat=] fprintf(output, " :offset %li)", offsetof(struct _ffi_type, type)); ^ /home/testgrid/cl-test-grid/work-dir/agent/test-runs/20160215053538-ccl-1.10-r16196-f101-linux-arm/fasl/ql/dists/quicklisp/software/cffi_0.16.1/libffi/libffi-unix.c:161:52: warning: format ‘%li’ expects argument of type ‘long int’, but argument 3 has type ‘unsigned int’ [-Wformat=] fprintf(output, " :offset %li)", offsetof(struct _ffi_type, elements)); ^
(WHOLE-TEST-SUITE FAIL) ffi-grovel, CFFI-GROVEL:GROVEL-ERROR : External process exited with code 1. Command was: "cc" "-marm" "-I/home/testgrid/cl-test-grid/work-dir/agent/quicklisp/dists/quicklisp/software/cffi_0.16.1/" "-o" "/home/testgrid/cl-test-grid/work-dir/agent/test-runs/20160215053538-ccl-1.10-r16196-f101-linux-arm/fasl/test-grid/work-dir/agent/quicklisp/dists/quicklisp/software/cffi_0.16.1/libffi/libffi-unix" "/home/testgrid/cl-test-grid/work-dir/agent/test-runs/20160215053538-ccl-1.10-r16196-f101-linux-arm/fasl/test-grid/work-dir/agent/quicklisp/dists/quicklisp/software/cffi_0.16.1/libffi/libffi-unix.c" Output was: /home/testgrid/cl-test-grid/work-dir/agent/test-runs/20160215053538-ccl-1.10-r16196-f101-linux-arm/fasl/test-grid/work-dir/agent/quicklisp/dists/quicklisp/software/cffi_0.16.1/libffi/libffi-unix.c: In function ‘main’: /home/testgrid/cl-test-grid/wo... error: ‘FFI_UNIX64’ undeclared (first use in this function) fprintf(output, "%"PRIiMAX, (intmax_t)FFI_UNIX64); ^ /home/testgrid/cl-test-grid/wo... note: each undeclared identifier is reported only once for each function it appears in In file included from /usr/include/string.h:32:0, from /home/testgrid/cl-test-grid/work-dir/agent/quicklisp/dists/quicklisp/software/cffi_0.16.1/grovel/common.h:4, from /home/testgrid/cl-test-grid/work-dir/agent/test-runs/20160215053538-ccl-1.10-r16196-f101-linux-arm/fasl/test-grid/work-dir/agent/quicklisp/dists/quicklisp/software/cffi_0.16.1/libffi/libffi-unix.c:9: /home/testgrid/cl-test-grid/wo... warning: format ‘%li’ expects argument of type ‘long int’, but argument 3 has type ‘unsigned int’ [-Wformat=] fprintf(output, " :offset %li)", offsetof(struct _ffi_type, size)); ^ /home/testgrid/cl-test-grid/wo... warning: format ‘%li’ expects argument of type ‘long int’, but argument 3 has type ‘unsigned int’ [-Wformat=] fprintf(output, " :offset %li)", offsetof(struct _ffi_type, alignment)); ^ /home/testgrid/cl-test-grid/wo... warning: format ‘%li’ expects argument of type ‘long int’, but argument 3 has type ‘unsigned int’ [-Wformat=] fprintf(output, " :offset %li)", offsetof(struct _ffi_type, type)); ^ /home/testgrid/cl-test-grid/wo... warning: format ‘%li’ expects argument of type ‘long int’, but argument 3 has type ‘unsigned int’ [-Wformat=] fprintf(output, " :offset %li)", offsetof(struct _ffi_type, elements)); ^
ccl-1.10-r16196-f96-linux-x64
(LOAD cffi-toolchain FAIL) COMMON-LISP:SIMPLE-ERROR : Serious errors encountered during compilation of "/home/hijarian/systems/cl-test-grid/work-dir/agent/quicklisp/dists/quicklisp/software/cffi_0.17.1/toolchain/asdf-compat.lisp"
(LOAD cffi-tests FAIL) ASDF/FIND-SYSTEM:LOAD-SYSTEM-DEFINITION-ERROR : Error while trying to load definition for system cffi-tests from pathname /home/hijarian/systems/cl-test-grid/work-dir/agent/quicklisp/dists/quicklisp/software/cffi_0.17.1/cffi-tests.asd: Serious errors encountered during compilation of "/home/hijarian/systems/cl-test-grid/work-dir/agent/quicklisp/dists/quicklisp/software/cffi_0.17.1/toolchain/asdf-compat.lisp"
(LOAD cffi-libffi FAIL) ASDF/FIND-SYSTEM:LOAD-SYSTEM-DEFINITION-ERROR : Error while trying to load definition for system cffi-libffi from pathname /home/hijarian/systems/cl-test-grid/work-dir/agent/quicklisp/dists/quicklisp/software/cffi_0.17.1/cffi-libffi.asd: Serious errors encountered during compilation of "/home/hijarian/systems/cl-test-grid/work-dir/agent/quicklisp/dists/quicklisp/software/cffi_0.17.1/toolchain/asdf-compat.lisp"
(LOAD cffi-grovel FAIL) COMMON-LISP:SIMPLE-ERROR : Serious errors encountered during compilation of "/home/hijarian/systems/cl-test-grid/work-dir/agent/quicklisp/dists/quicklisp/software/cffi_0.17.1/toolchain/asdf-compat.lisp"
(WHOLE-TEST-SUITE FAIL) CCL::SIMPLE-PROGRAM-ERROR : Invalid program: In the form ((OS-UNIX-P) NIL), (OS-UNIX-P) is not a symbol or lambda expression.
(WHOLE-TEST-SUITE FAIL) CCL::SIMPLE-FILE-ERROR : File #P"/home/hijarian/systems/cl-test-grid/work-dir/agent/test-runs/20160309055500-ccl-1.10-r16196-f96-linux-x64/fasl/test-grid/work-dir/agent/quicklisp/dists/quicklisp/software/cffi_0.16.1/libffi/libffi-unix.lx64fsl" does not exist.
(WHOLE-TEST-SUITE FAIL) CCL::SIMPLE-FILE-ERROR : File #P"/home/hijarian/systems/cl-test-grid/work-dir/agent/test-runs/20160306095236-ccl-1.10-r16196-f96-linux-x64/fasl/test-grid/work-dir/agent/quicklisp/dists/quicklisp/software/cffi_0.16.1/libffi/libffi-unix.lx64fsl" does not exist.
(WHOLE-TEST-SUITE FAIL) CCL::SIMPLE-FILE-ERROR : File #P"/home/hijarian/systems/cl-test-grid/work-dir/agent/test-runs/20160214121759-ccl-1.10-r16196-f96-linux-x64/fasl/test-grid/work-dir/agent/quicklisp/dists/quicklisp/software/cffi_0.16.1/libffi/libffi-unix.lx64fsl" does not exist.
ccl-1.10-r16196-f96-linux-x86
ccl-1.11-r16635-f96-linux-x86
(WHOLE-TEST-SUITE FAIL) CCL::SIMPLE-FILE-ERROR : File #P"/home/testgrid/cl-test-grid/work-dir/agent/test-runs/20160216034139-ccl-1.11-r16635-f96-linux-x86/fasl/test-grid/work-dir/agent/quicklisp/dists/quicklisp/software/cffi_0.16.1/libffi/libffi-unix.lx32fsl" does not exist.
ccl-1.11-r16635-f96-macosx-x64
(WHOLE-TEST-SUITE FAIL) CCL::SIMPLE-FILE-ERROR : File #P"/Users/testgrid/cl-test-grid/work-dir/agent/test-runs/20160220010916-ccl-1.11-r16635-f96-macosx-x64/fasl/test-grid/work-dir/agent/quicklisp/dists/quicklisp/software/cffi_0.16.1/libffi/libffi-unix.dx64fsl" does not exist.
ccl-1.11-r16635-f96-macosx-x86
(LOAD cffi-tests FAIL) ffi, CFFI:LOAD-FOREIGN-LIBRARY-ERROR : Unable to load any of the alternatives: ("libfsbv.dylib" "libfsbv32.dylib")
(WHOLE-TEST-SUITE FAIL) CCL::SIMPLE-FILE-ERROR : File #P"/Users/testgrid/cl-test-grid/work-dir/agent/test-runs/20160219210452-ccl-1.11-r16635-f96-macosx-x86/fasl/test-grid/work-dir/agent/quicklisp/dists/quicklisp/software/cffi_0.16.1/libffi/libffi-unix.dx32fsl" does not exist.
ccl-1.11-r16702m-f101-linux-arm
(LOAD cffi-tests FAIL) ffi-grovel, CFFI-GROVEL:GROVEL-ERROR : External process exited with code 1. Command was: "cc" "-marm" "-I/home/testgrid/cl-test-grid/work-dir/agent/quicklisp/dists/quicklisp/software/cffi_0.16.1/" "-o" "/home/testgrid/cl-test-grid/work-dir/agent/test-runs/20160218133323-ccl-1.11-r16702m-f101-linux-arm/fasl/ql/dists/quicklisp/software/cffi_0.16.1/libffi/libffi-unix" "/home/testgrid/cl-test-grid/work-dir/agent/test-runs/20160218133323-ccl-1.11-r16702m-f101-linux-arm/fasl/ql/dists/quicklisp/software/cffi_0.16.1/libffi/libffi-unix.c" Output was: /home/testgrid/cl-test-grid/work-dir/agent/test-runs/20160218133323-ccl-1.11-r16702m-f101-linux-arm/fasl/ql/dists/quicklisp/software/cffi_0.16.1/libffi/libffi-unix.c:7:17: fatal error: ffi.h: No such file or directory compilation terminated.
(LOAD cffi-libffi FAIL) ffi-grovel, CFFI-GROVEL:GROVEL-ERROR : External process exited with code 1. Command was: "cc" "-marm" "-I/home/testgrid/cl-test-grid/work-dir/agent/quicklisp/dists/quicklisp/software/cffi_0.16.1/" "-o" "/home/testgrid/cl-test-grid/work-dir/agent/test-runs/20160218133323-ccl-1.11-r16702m-f101-linux-arm/fasl/ql/dists/quicklisp/software/cffi_0.16.1/libffi/libffi-unix" "/home/testgrid/cl-test-grid/work-dir/agent/test-runs/20160218133323-ccl-1.11-r16702m-f101-linux-arm/fasl/ql/dists/quicklisp/software/cffi_0.16.1/libffi/libffi-unix.c" Output was: /home/testgrid/cl-test-grid/work-dir/agent/test-runs/20160218133323-ccl-1.11-r16702m-f101-linux-arm/fasl/ql/dists/quicklisp/software/cffi_0.16.1/libffi/libffi-unix.c:7:17: fatal error: ffi.h: No such file or directory compilation terminated.
(WHOLE-TEST-SUITE FAIL) ffi-grovel, CFFI-GROVEL:GROVEL-ERROR : External process exited with code 1. Command was: "cc" "-marm" "-I/home/testgrid/cl-test-grid/work-dir/agent/quicklisp/dists/quicklisp/software/cffi_0.16.1/" "-o" "/home/testgrid/cl-test-grid/work-dir/agent/test-runs/20160218133323-ccl-1.11-r16702m-f101-linux-arm/fasl/test-grid/work-dir/agent/quicklisp/dists/quicklisp/software/cffi_0.16.1/libffi/libffi-unix" "/home/testgrid/cl-test-grid/work-dir/agent/test-runs/20160218133323-ccl-1.11-r16702m-f101-linux-arm/fasl/test-grid/work-dir/agent/quicklisp/dists/quicklisp/software/cffi_0.16.1/libffi/libffi-unix.c" Output was: /home/testgrid/cl-test-grid/wo... fatal error: ffi.h: No such file or directory compilation terminated.
ccl-1.11-rc1-r16536-f101-linux-arm
(LOAD cffi-tests FAIL) ffi-grovel, CFFI-GROVEL:GROVEL-ERROR : Subprocess (:PROCESS #<EXTERNAL-PROCESS (cc -marm -o ...)[21054] (EXITED : 1) #x455138A6>) with command ("cc" "-marm" "-o" "/home/testgrid/cl-test-grid/work-dir/agent/test-runs/20160409092710-ccl-1.11-rc1-r16536-f101-linux-arm/fasl/ql/dists/quicklisp/software/cffi_0.17.1/libffi/libffi-types__grovel-tmpQDDPHH86" "-I/home/testgrid/cl-test-grid/work-dir/agent/quicklisp/dists/quicklisp/software/cffi_0.17.1/" "/home/testgrid/cl-test-grid/work-dir/agent/test-runs/20160409092710-ccl-1.11-rc1-r16536-f101-linux-arm/fasl/ql/dists/quicklisp/software/cffi_0.17.1/libffi/libffi-types__grovel.c") exited with error code 1
(LOAD cffi-libffi FAIL) ffi-grovel, CFFI-GROVEL:GROVEL-ERROR : Subprocess (:PROCESS #<EXTERNAL-PROCESS (cc -marm -o ...)[21046] (EXITED : 1) #x45370BFE>) with command ("cc" "-marm" "-o" "/home/testgrid/cl-test-grid/work-dir/agent/test-runs/20160409092710-ccl-1.11-rc1-r16536-f101-linux-arm/fasl/ql/dists/quicklisp/software/cffi_0.17.1/libffi/libffi-types__grovel-tmpQDDPHH86" "-I/home/testgrid/cl-test-grid/work-dir/agent/quicklisp/dists/quicklisp/software/cffi_0.17.1/" "/home/testgrid/cl-test-grid/work-dir/agent/test-runs/20160409092710-ccl-1.11-rc1-r16536-f101-linux-arm/fasl/ql/dists/quicklisp/software/cffi_0.17.1/libffi/libffi-types__grovel.c") exited with error code 1
(WHOLE-TEST-SUITE FAIL) ffi-grovel, CFFI-GROVEL:GROVEL-ERROR : Subprocess (:PROCESS #<EXTERNAL-PROCESS (cc -marm -o ...)[21068] (EXITED : 1) #x45446F0E>) with command ("cc" "-marm" "-o" "/home/testgrid/cl-test-grid/w... "-I/home/testgrid/cl-test-grid/work-dir/agent/quicklisp/dists/quicklisp/software/cffi_0.17.1/" "/home/testgrid/cl-test-grid/w... exited with error code 1
(LOAD cffi-tests FAIL) ffi-grovel, CFFI-GROVEL:GROVEL-ERROR : External process exited with code 1. Command was: "cc" "-marm" "-I/home/testgrid/cl-test-grid/work-dir/agent/quicklisp/dists/quicklisp/software/cffi_0.16.1/" "-o" "/home/testgrid/cl-test-grid/work-dir/agent/test-runs/20160216170231-ccl-1.11-rc1-r16536-f101-linux-arm/fasl/ql/dists/quicklisp/software/cffi_0.16.1/libffi/libffi-unix" "/home/testgrid/cl-test-grid/work-dir/agent/test-runs/20160216170231-ccl-1.11-rc1-r16536-f101-linux-arm/fasl/ql/dists/quicklisp/software/cffi_0.16.1/libffi/libffi-unix.c" Output was: /home/testgrid/cl-test-grid/work-dir/agent/test-runs/20160216170231-ccl-1.11-rc1-r16536-f101-linux-arm/fasl/ql/dists/quicklisp/software/cffi_0.16.1/libffi/libffi-unix.c: In function ‘main’: /home/testgrid/cl-test-grid/work-dir/agent/test-runs/20160216170231-ccl-1.11-rc1-r16536-f101-linux-arm/fasl/ql/dists/quicklisp/software/cffi_0.16.1/libffi/libffi-unix.c:82:41: error: ‘FFI_UNIX64’ undeclared (first use in this function) fprintf(output, "%"PRIiMAX, (intmax_t)FFI_UNIX64); ^ /home/testgrid/cl-test-grid/work-dir/agent/test-runs/20160216170231-ccl-1.11-rc1-r16536-f101-linux-arm/fasl/ql/dists/quicklisp/software/cffi_0.16.1/libffi/libffi-unix.c:82:41: note: each undeclared identifier is reported only once for each function it appears in In file included from /usr/include/string.h:32:0, from /home/testgrid/cl-test-grid/work-dir/agent/quicklisp/dists/quicklisp/software/cffi_0.16.1/grovel/common.h:4, from /home/testgrid/cl-test-grid/work-dir/agent/test-runs/20160216170231-ccl-1.11-rc1-r16536-f101-linux-arm/fasl/ql/dists/quicklisp/software/cffi_0.16.1/libffi/libffi-unix.c:9: /home/testgrid/cl-test-grid/work-dir/agent/test-runs/20160216170231-ccl-1.11-rc1-r16536-f101-linux-arm/fasl/ql/dists/quicklisp/software/cffi_0.16.1/libffi/libffi-unix.c:146:52: warning: format ‘%li’ expects argument of type ‘long int’, but argument 3 has type ‘unsigned int’ [-Wformat=] fprintf(output, " :offset %li)", offsetof(struct _ffi_type, size)); ^ /home/testgrid/cl-test-grid/work-dir/agent/test-runs/20160216170231-ccl-1.11-rc1-r16536-f101-linux-arm/fasl/ql/dists/quicklisp/software/cffi_0.16.1/libffi/libffi-unix.c:151:52: warning: format ‘%li’ expects argument of type ‘long int’, but argument 3 has type ‘unsigned int’ [-Wformat=] fprintf(output, " :offset %li)", offsetof(struct _ffi_type, alignment)); ^ /home/testgrid/cl-test-grid/work-dir/agent/test-runs/20160216170231-ccl-1.11-rc1-r16536-f101-linux-arm/fasl/ql/dists/quicklisp/software/cffi_0.16.1/libffi/libffi-unix.c:156:52: warning: format ‘%li’ expects argument of type ‘long int’, but argument 3 has type ‘unsigned int’ [-Wformat=] fprintf(output, " :offset %li)", offsetof(struct _ffi_type, type)); ^ /home/testgrid/cl-test-grid/work-dir/agent/test-runs/20160216170231-ccl-1.11-rc1-r16536-f101-linux-arm/fasl/ql/dists/quicklisp/software/cffi_0.16.1/libffi/libffi-unix.c:161:52: warning: format ‘%li’ expects argument of type ‘long int’, but argument 3 has type ‘unsigned int’ [-Wformat=] fprintf(output, " :offset %li)", offsetof(struct _ffi_type, elements)); ^
(LOAD cffi-libffi FAIL) ffi-grovel, CFFI-GROVEL:GROVEL-ERROR : External process exited with code 1. Command was: "cc" "-marm" "-I/home/testgrid/cl-test-grid/work-dir/agent/quicklisp/dists/quicklisp/software/cffi_0.16.1/" "-o" "/home/testgrid/cl-test-grid/work-dir/agent/test-runs/20160216170231-ccl-1.11-rc1-r16536-f101-linux-arm/fasl/ql/dists/quicklisp/software/cffi_0.16.1/libffi/libffi-unix" "/home/testgrid/cl-test-grid/work-dir/agent/test-runs/20160216170231-ccl-1.11-rc1-r16536-f101-linux-arm/fasl/ql/dists/quicklisp/software/cffi_0.16.1/libffi/libffi-unix.c" Output was: /home/testgrid/cl-test-grid/work-dir/agent/test-runs/20160216170231-ccl-1.11-rc1-r16536-f101-linux-arm/fasl/ql/dists/quicklisp/software/cffi_0.16.1/libffi/libffi-unix.c: In function ‘main’: /home/testgrid/cl-test-grid/work-dir/agent/test-runs/20160216170231-ccl-1.11-rc1-r16536-f101-linux-arm/fasl/ql/dists/quicklisp/software/cffi_0.16.1/libffi/libffi-unix.c:82:41: error: ‘FFI_UNIX64’ undeclared (first use in this function) fprintf(output, "%"PRIiMAX, (intmax_t)FFI_UNIX64); ^ /home/testgrid/cl-test-grid/work-dir/agent/test-runs/20160216170231-ccl-1.11-rc1-r16536-f101-linux-arm/fasl/ql/dists/quicklisp/software/cffi_0.16.1/libffi/libffi-unix.c:82:41: note: each undeclared identifier is reported only once for each function it appears in In file included from /usr/include/string.h:32:0, from /home/testgrid/cl-test-grid/work-dir/agent/quicklisp/dists/quicklisp/software/cffi_0.16.1/grovel/common.h:4, from /home/testgrid/cl-test-grid/work-dir/agent/test-runs/20160216170231-ccl-1.11-rc1-r16536-f101-linux-arm/fasl/ql/dists/quicklisp/software/cffi_0.16.1/libffi/libffi-unix.c:9: /home/testgrid/cl-test-grid/work-dir/agent/test-runs/20160216170231-ccl-1.11-rc1-r16536-f101-linux-arm/fasl/ql/dists/quicklisp/software/cffi_0.16.1/libffi/libffi-unix.c:146:52: warning: format ‘%li’ expects argument of type ‘long int’, but argument 3 has type ‘unsigned int’ [-Wformat=] fprintf(output, " :offset %li)", offsetof(struct _ffi_type, size)); ^ /home/testgrid/cl-test-grid/work-dir/agent/test-runs/20160216170231-ccl-1.11-rc1-r16536-f101-linux-arm/fasl/ql/dists/quicklisp/software/cffi_0.16.1/libffi/libffi-unix.c:151:52: warning: format ‘%li’ expects argument of type ‘long int’, but argument 3 has type ‘unsigned int’ [-Wformat=] fprintf(output, " :offset %li)", offsetof(struct _ffi_type, alignment)); ^ /home/testgrid/cl-test-grid/work-dir/agent/test-runs/20160216170231-ccl-1.11-rc1-r16536-f101-linux-arm/fasl/ql/dists/quicklisp/software/cffi_0.16.1/libffi/libffi-unix.c:156:52: warning: format ‘%li’ expects argument of type ‘long int’, but argument 3 has type ‘unsigned int’ [-Wformat=] fprintf(output, " :offset %li)", offsetof(struct _ffi_type, type)); ^ /home/testgrid/cl-test-grid/work-dir/agent/test-runs/20160216170231-ccl-1.11-rc1-r16536-f101-linux-arm/fasl/ql/dists/quicklisp/software/cffi_0.16.1/libffi/libffi-unix.c:161:52: warning: format ‘%li’ expects argument of type ‘long int’, but argument 3 has type ‘unsigned int’ [-Wformat=] fprintf(output, " :offset %li)", offsetof(struct _ffi_type, elements)); ^
(WHOLE-TEST-SUITE FAIL) ffi-grovel, CFFI-GROVEL:GROVEL-ERROR : External process exited with code 1. Command was: "cc" "-marm" "-I/home/testgrid/cl-test-grid/work-dir/agent/quicklisp/dists/quicklisp/software/cffi_0.16.1/" "-o" "/home/testgrid/cl-test-grid/w... "/home/testgrid/cl-test-grid/w... Output was: /home/testgrid/cl-test-grid/wo... In function ‘main’: /home/testgrid/cl-test-grid/wo... error: ‘FFI_UNIX64’ undeclared (first use in this function) fprintf(output, "%"PRIiMAX, (intmax_t)FFI_UNIX64); ^ /home/testgrid/cl-test-grid/wo... note: each undeclared identifier is reported only once for each function it appears in In file included from /usr/include/string.h:32:0, from /home/testgrid/cl-test-grid/work-dir/agent/quicklisp/dists/quicklisp/software/cffi_0.16.1/grovel/common.h:4, from /home/testgrid/cl-test-grid/wo... /home/testgrid/cl-test-grid/wo... warning: format ‘%li’ expects argument of type ‘long int’, but argument 3 has type ‘unsigned int’ [-Wformat=] fprintf(output, " :offset %li)", offsetof(struct _ffi_type, size)); ^ /home/testgrid/cl-test-grid/wo... warning: format ‘%li’ expects argument of type ‘long int’, but argument 3 has type ‘unsigned int’ [-Wformat=] fprintf(output, " :offset %li)", offsetof(struct _ffi_type, alignment)); ^ /home/testgrid/cl-test-grid/wo... warning: format ‘%li’ expects argument of type ‘long int’, but argument 3 has type ‘unsigned int’ [-Wformat=] fprintf(output, " :offset %li)", offsetof(struct _ffi_type, type)); ^ /home/testgrid/cl-test-grid/wo... warning: format ‘%li’ expects argument of type ‘long int’, but argument 3 has type ‘unsigned int’ [-Wformat=] fprintf(output, " :offset %li)", offsetof(struct _ffi_type, elements)); ^
ccl-1.11-rc1-r16536-f96-linux-x86
(WHOLE-TEST-SUITE FAIL) CCL::SIMPLE-FILE-ERROR : File #P"/home/testgrid/cl-test-grid/work-dir/agent/test-runs/20160216134117-ccl-1.11-rc1-r16536-f96-linux-x86/fasl/test-grid/work-dir/agent/quicklisp/dists/quicklisp/software/cffi_0.16.1/libffi/libffi-unix.lx32fsl" does not exist.
ccl-1.8-r15286m-f95-linux-x86
(LOAD cffi-uffi-compat FAIL) ASDF:LOAD-SYSTEM-DEFINITION-ERROR : Error while trying to load definition for system cffi from pathname /home/testgrid/cl-test-grid/work-dir/agent/quicklisp/dists/quicklisp/software/cffi_0.17.1/cffi.asd: Extra arguments in (OPERATE 'TEST-OP :CFFI-TESTS) don't match lambda list (O C).
(LOAD cffi-toolchain FAIL) ASDF:LOAD-SYSTEM-DEFINITION-ERROR : Error while trying to load definition for system cffi-toolchain from pathname /home/testgrid/cl-test-grid/work-dir/agent/quicklisp/dists/quicklisp/software/cffi_0.17.1/cffi-toolchain.asd: CFFI-toolchain requires ASDF 3.1!
(LOAD cffi-tests FAIL) ASDF:LOAD-SYSTEM-DEFINITION-ERROR : Error while trying to load definition for system cffi-tests from pathname /home/testgrid/cl-test-grid/work-dir/agent/quicklisp/dists/quicklisp/software/cffi_0.17.1/cffi-tests.asd: Error while trying to load definition for system cffi-toolchain from pathname /home/testgrid/cl-test-grid/work-dir/agent/quicklisp/dists/quicklisp/software/cffi_0.17.1/cffi-toolchain.asd: CFFI-toolchain requires ASDF 3.1!
(LOAD cffi-libffi FAIL) ASDF:LOAD-SYSTEM-DEFINITION-ERROR : Error while trying to load definition for system cffi-libffi from pathname /home/testgrid/cl-test-grid/work-dir/agent/quicklisp/dists/quicklisp/software/cffi_0.17.1/cffi-libffi.asd: Error while trying to load definition for system cffi-toolchain from pathname /home/testgrid/cl-test-grid/work-dir/agent/quicklisp/dists/quicklisp/software/cffi_0.17.1/cffi-toolchain.asd: CFFI-toolchain requires ASDF 3.1!
(LOAD cffi-grovel FAIL) ASDF:LOAD-SYSTEM-DEFINITION-ERROR : Error while trying to load definition for system cffi-toolchain from pathname /home/testgrid/cl-test-grid/work-dir/agent/quicklisp/dists/quicklisp/software/cffi_0.17.1/cffi-toolchain.asd: CFFI-toolchain requires ASDF 3.1!
(LOAD cffi-examples FAIL) ASDF:LOAD-SYSTEM-DEFINITION-ERROR : Error while trying to load definition for system cffi from pathname /home/testgrid/cl-test-grid/work-dir/agent/quicklisp/dists/quicklisp/software/cffi_0.17.1/cffi.asd: Extra arguments in (OPERATE 'TEST-OP :CFFI-TESTS) don't match lambda list (O C).
(LOAD cffi FAIL) ASDF:LOAD-SYSTEM-DEFINITION-ERROR : Error while trying to load definition for system cffi from pathname /home/testgrid/cl-test-grid/work-dir/agent/quicklisp/dists/quicklisp/software/cffi_0.17.1/cffi.asd: Extra arguments in (OPERATE 'TEST-OP :CFFI-TESTS) don't match lambda list (O C).
(WHOLE-TEST-SUITE FAIL) ASDF:LOAD-SYSTEM-DEFINITION-ERROR : Error while trying to load definition for system cffi from pathname /home/testgrid/cl-test-grid/work-dir/agent/quicklisp/dists/quicklisp/software/cffi_0.17.1/cffi.asd: Extra arguments in (OPERATE 'TEST-OP :CFFI-TESTS) don't match lambda list (O C).
(LOAD cffi-tests FAIL) ASDF:LOAD-SYSTEM-DEFINITION-ERROR : Error while trying to load definition for system bordeaux-threads from pathname /home/testgrid/cl-test-grid/work-dir/agent/quicklisp/dists/quicklisp/software/bordeaux-threads-v0.8.4-git/bordeaux-threads.asd: There is no package named "UIOP" .
(WHOLE-TEST-SUITE FAIL) CCL::SIMPLE-FILE-ERROR : File #P"/home/testgrid/cl-test-grid/work-dir/agent/test-runs/20160217020635-ccl-1.8-r15286m-f95-linux-x86/fasl/test-grid/work-dir/agent/quicklisp/dists/quicklisp/software/cffi_0.16.1/libffi/libffi-unix.lx32fsl" does not exist.
ccl-1.8-r15286m-f97-linux-arm
(LOAD cffi-uffi-compat FAIL) ASDF:LOAD-SYSTEM-DEFINITION-ERROR : Error while trying to load definition for system cffi from pathname /home/testgrid/cl-test-grid/work-dir/agent/quicklisp/dists/quicklisp/software/cffi_0.17.1/cffi.asd: Extra arguments in (OPERATE 'TEST-OP :CFFI-TESTS) don't match lambda list (O C).
(LOAD cffi-toolchain FAIL) ASDF:LOAD-SYSTEM-DEFINITION-ERROR : Error while trying to load definition for system cffi-toolchain from pathname /home/testgrid/cl-test-grid/work-dir/agent/quicklisp/dists/quicklisp/software/cffi_0.17.1/cffi-toolchain.asd: CFFI-toolchain requires ASDF 3.1!
(LOAD cffi-tests FAIL) ASDF:LOAD-SYSTEM-DEFINITION-ERROR : Error while trying to load definition for system cffi-tests from pathname /home/testgrid/cl-test-grid/work-dir/agent/quicklisp/dists/quicklisp/software/cffi_0.17.1/cffi-tests.asd: Error while trying to load definition for system cffi-toolchain from pathname /home/testgrid/cl-test-grid/work-dir/agent/quicklisp/dists/quicklisp/software/cffi_0.17.1/cffi-toolchain.asd: CFFI-toolchain requires ASDF 3.1!
(LOAD cffi-libffi FAIL) ASDF:LOAD-SYSTEM-DEFINITION-ERROR : Error while trying to load definition for system cffi-libffi from pathname /home/testgrid/cl-test-grid/work-dir/agent/quicklisp/dists/quicklisp/software/cffi_0.17.1/cffi-libffi.asd: Error while trying to load definition for system cffi-toolchain from pathname /home/testgrid/cl-test-grid/work-dir/agent/quicklisp/dists/quicklisp/software/cffi_0.17.1/cffi-toolchain.asd: CFFI-toolchain requires ASDF 3.1!
(LOAD cffi-grovel FAIL) ASDF:LOAD-SYSTEM-DEFINITION-ERROR : Error while trying to load definition for system cffi-toolchain from pathname /home/testgrid/cl-test-grid/work-dir/agent/quicklisp/dists/quicklisp/software/cffi_0.17.1/cffi-toolchain.asd: CFFI-toolchain requires ASDF 3.1!
(LOAD cffi-examples FAIL) ASDF:LOAD-SYSTEM-DEFINITION-ERROR : Error while trying to load definition for system cffi from pathname /home/testgrid/cl-test-grid/work-dir/agent/quicklisp/dists/quicklisp/software/cffi_0.17.1/cffi.asd: Extra arguments in (OPERATE 'TEST-OP :CFFI-TESTS) don't match lambda list (O C).
(LOAD cffi FAIL) ASDF:LOAD-SYSTEM-DEFINITION-ERROR : Error while trying to load definition for system cffi from pathname /home/testgrid/cl-test-grid/work-dir/agent/quicklisp/dists/quicklisp/software/cffi_0.17.1/cffi.asd: Extra arguments in (OPERATE 'TEST-OP :CFFI-TESTS) don't match lambda list (O C).
(WHOLE-TEST-SUITE FAIL) ASDF:LOAD-SYSTEM-DEFINITION-ERROR : Error while trying to load definition for system cffi from pathname /home/testgrid/cl-test-grid/work-dir/agent/quicklisp/dists/quicklisp/software/cffi_0.17.1/cffi.asd: Extra arguments in (OPERATE 'TEST-OP :CFFI-TESTS) don't match lambda list (O C).
(LOAD cffi-tests FAIL) ASDF:LOAD-SYSTEM-DEFINITION-ERROR : Error while trying to load definition for system bordeaux-threads from pathname /home/testgrid/cl-test-grid/work-dir/agent/quicklisp/dists/quicklisp/software/bordeaux-threads-v0.8.4-git/bordeaux-threads.asd: There is no package named "UIOP" .
(LOAD cffi-libffi FAIL) ffi-grovel, CFFI-GROVEL:GROVEL-ERROR : External process exited with code 1. Command was: "cc" "-marm" "-I/home/testgrid/cl-test-grid/work-dir/agent/quicklisp/dists/quicklisp/software/cffi_0.16.1/" "-o" "/home/testgrid/cl-test-grid/work-dir/agent/test-runs/20160216093619-ccl-1.8-r15286m-f97-linux-arm/fasl/ql/dists/quicklisp/software/cffi_0.16.1/libffi/libffi-unix" "/home/testgrid/cl-test-grid/work-dir/agent/test-runs/20160216093619-ccl-1.8-r15286m-f97-linux-arm/fasl/ql/dists/quicklisp/software/cffi_0.16.1/libffi/libffi-unix.c" Output was: /home/testgrid/cl-test-grid/work-dir/agent/test-runs/20160216093619-ccl-1.8-r15286m-f97-linux-arm/fasl/ql/dists/quicklisp/software/cffi_0.16.1/libffi/libffi-unix.c: In function ‘main’: /home/testgrid/cl-test-grid/work-dir/agent/test-runs/20160216093619-ccl-1.8-r15286m-f97-linux-arm/fasl/ql/dists/quicklisp/software/cffi_0.16.1/libffi/libffi-unix.c:82:41: error: ‘FFI_UNIX64’ undeclared (first use in this function) fprintf(output, "%"PRIiMAX, (intmax_t)FFI_UNIX64); ^ /home/testgrid/cl-test-grid/work-dir/agent/test-runs/20160216093619-ccl-1.8-r15286m-f97-linux-arm/fasl/ql/dists/quicklisp/software/cffi_0.16.1/libffi/libffi-unix.c:82:41: note: each undeclared identifier is reported only once for each function it appears in In file included from /usr/include/string.h:32:0, from /home/testgrid/cl-test-grid/work-dir/agent/quicklisp/dists/quicklisp/software/cffi_0.16.1/grovel/common.h:4, from /home/testgrid/cl-test-grid/work-dir/agent/test-runs/20160216093619-ccl-1.8-r15286m-f97-linux-arm/fasl/ql/dists/quicklisp/software/cffi_0.16.1/libffi/libffi-unix.c:9: /home/testgrid/cl-test-grid/work-dir/agent/test-runs/20160216093619-ccl-1.8-r15286m-f97-linux-arm/fasl/ql/dists/quicklisp/software/cffi_0.16.1/libffi/libffi-unix.c:146:52: warning: format ‘%li’ expects argument of type ‘long int’, but argument 3 has type ‘unsigned int’ [-Wformat=] fprintf(output, " :offset %li)", offsetof(struct _ffi_type, size)); ^ /home/testgrid/cl-test-grid/work-dir/agent/test-runs/20160216093619-ccl-1.8-r15286m-f97-linux-arm/fasl/ql/dists/quicklisp/software/cffi_0.16.1/libffi/libffi-unix.c:151:52: warning: format ‘%li’ expects argument of type ‘long int’, but argument 3 has type ‘unsigned int’ [-Wformat=] fprintf(output, " :offset %li)", offsetof(struct _ffi_type, alignment)); ^ /home/testgrid/cl-test-grid/work-dir/agent/test-runs/20160216093619-ccl-1.8-r15286m-f97-linux-arm/fasl/ql/dists/quicklisp/software/cffi_0.16.1/libffi/libffi-unix.c:156:52: warning: format ‘%li’ expects argument of type ‘long int’, but argument 3 has type ‘unsigned int’ [-Wformat=] fprintf(output, " :offset %li)", offsetof(struct _ffi_type, type)); ^ /home/testgrid/cl-test-grid/work-dir/agent/test-runs/20160216093619-ccl-1.8-r15286m-f97-linux-arm/fasl/ql/dists/quicklisp/software/cffi_0.16.1/libffi/libffi-unix.c:161:52: warning: format ‘%li’ expects argument of type ‘long int’, but argument 3 has type ‘unsigned int’ [-Wformat=] fprintf(output, " :offset %li)", offsetof(struct _ffi_type, elements)); ^
(WHOLE-TEST-SUITE FAIL) ffi-grovel, CFFI-GROVEL:GROVEL-ERROR : External process exited with code 1. Command was: "cc" "-marm" "-I/home/testgrid/cl-test-grid/work-dir/agent/quicklisp/dists/quicklisp/software/cffi_0.16.1/" "-o" "/home/testgrid/cl-test-grid/work-dir/agent/test-runs/20160216093619-ccl-1.8-r15286m-f97-linux-arm/fasl/test-grid/work-dir/agent/quicklisp/dists/quicklisp/software/cffi_0.16.1/libffi/libffi-unix" "/home/testgrid/cl-test-grid/work-dir/agent/test-runs/20160216093619-ccl-1.8-r15286m-f97-linux-arm/fasl/test-grid/work-dir/agent/quicklisp/dists/quicklisp/software/cffi_0.16.1/libffi/libffi-unix.c" Output was: /home/testgrid/cl-test-grid/work-dir/agent/test-runs/20160216093619-ccl-1.8-r15286m-f97-linux-arm/fasl/test-grid/work-dir/agent/quicklisp/dists/quicklisp/software/cffi_0.16.1/libffi/libffi-unix.c: In function ‘main’: /home/testgrid/cl-test-grid/wo... error: ‘FFI_UNIX64’ undeclared (first use in this function) fprintf(output, "%"PRIiMAX, (intmax_t)FFI_UNIX64); ^ /home/testgrid/cl-test-grid/wo... note: each undeclared identifier is reported only once for each function it appears in In file included from /usr/include/string.h:32:0, from /home/testgrid/cl-test-grid/work-dir/agent/quicklisp/dists/quicklisp/software/cffi_0.16.1/grovel/common.h:4, from /home/testgrid/cl-test-grid/work-dir/agent/test-runs/20160216093619-ccl-1.8-r15286m-f97-linux-arm/fasl/test-grid/work-dir/agent/quicklisp/dists/quicklisp/software/cffi_0.16.1/libffi/libffi-unix.c:9: /home/testgrid/cl-test-grid/wo... warning: format ‘%li’ expects argument of type ‘long int’, but argument 3 has type ‘unsigned int’ [-Wformat=] fprintf(output, " :offset %li)", offsetof(struct _ffi_type, size)); ^ /home/testgrid/cl-test-grid/wo... warning: format ‘%li’ expects argument of type ‘long int’, but argument 3 has type ‘unsigned int’ [-Wformat=] fprintf(output, " :offset %li)", offsetof(struct _ffi_type, alignment)); ^ /home/testgrid/cl-test-grid/wo... warning: format ‘%li’ expects argument of type ‘long int’, but argument 3 has type ‘unsigned int’ [-Wformat=] fprintf(output, " :offset %li)", offsetof(struct _ffi_type, type)); ^ /home/testgrid/cl-test-grid/wo... warning: format ‘%li’ expects argument of type ‘long int’, but argument 3 has type ‘unsigned int’ [-Wformat=] fprintf(output, " :offset %li)", offsetof(struct _ffi_type, elements)); ^
ccl-1.9-r15756-f96-linux-x86
(LOAD cffi-toolchain FAIL) ASDF/FIND-SYSTEM:LOAD-SYSTEM-DEFINITION-ERROR : Error while trying to load definition for system cffi-toolchain from pathname /home/testgrid/cl-test-grid/work-dir/agent/quicklisp/dists/quicklisp/software/cffi_0.17.1/cffi-toolchain.asd: CFFI-toolchain requires ASDF 3.1!
(LOAD cffi-tests FAIL) ASDF/FIND-SYSTEM:LOAD-SYSTEM-DEFINITION-ERROR : Error while trying to load definition for system cffi-tests from pathname /home/testgrid/cl-test-grid/work-dir/agent/quicklisp/dists/quicklisp/software/cffi_0.17.1/cffi-tests.asd: Error while trying to load definition for system cffi-toolchain from pathname /home/testgrid/cl-test-grid/work-dir/agent/quicklisp/dists/quicklisp/software/cffi_0.17.1/cffi-toolchain.asd: CFFI-toolchain requires ASDF 3.1!
(LOAD cffi-libffi FAIL) ASDF/FIND-SYSTEM:LOAD-SYSTEM-DEFINITION-ERROR : Error while trying to load definition for system cffi-libffi from pathname /home/testgrid/cl-test-grid/work-dir/agent/quicklisp/dists/quicklisp/software/cffi_0.17.1/cffi-libffi.asd: Error while trying to load definition for system cffi-toolchain from pathname /home/testgrid/cl-test-grid/work-dir/agent/quicklisp/dists/quicklisp/software/cffi_0.17.1/cffi-toolchain.asd: CFFI-toolchain requires ASDF 3.1!
(LOAD cffi-grovel FAIL) ASDF/FIND-SYSTEM:LOAD-SYSTEM-DEFINITION-ERROR : Error while trying to load definition for system cffi-toolchain from pathname /home/testgrid/cl-test-grid/work-dir/agent/quicklisp/dists/quicklisp/software/cffi_0.17.1/cffi-toolchain.asd: CFFI-toolchain requires ASDF 3.1!
(WHOLE-TEST-SUITE FAIL) ASDF/FIND-SYSTEM:LOAD-SYSTEM-DEFINITION-ERROR : Error while trying to load definition for system cffi-tests from pathname /home/testgrid/cl-test-grid/work-dir/agent/quicklisp/dists/quicklisp/software/cffi_0.17.1/cffi-tests.asd: Error while trying to load definition for system cffi-toolchain from pathname /home/testgrid/cl-test-grid/work-dir/agent/quicklisp/dists/quicklisp/software/cffi_0.17.1/cffi-toolchain.asd: CFFI-toolchain requires ASDF 3.1!
(LOAD cffi-tests FAIL) COMMON-LISP:TYPE-ERROR : The value NIL is not of the expected type NUMBER.
(WHOLE-TEST-SUITE FAIL) COMMON-LISP:TYPE-ERROR : The value NIL is not of the expected type NUMBER.
ccl-1.9-r15767-f99-linux-arm
(LOAD cffi-toolchain FAIL) ASDF/FIND-SYSTEM:LOAD-SYSTEM-DEFINITION-ERROR : Error while trying to load definition for system cffi-toolchain from pathname /home/testgrid/cl-test-grid/work-dir/agent/quicklisp/dists/quicklisp/software/cffi_0.17.1/cffi-toolchain.asd: CFFI-toolchain requires ASDF 3.1!
(LOAD cffi-tests FAIL) ASDF/FIND-SYSTEM:LOAD-SYSTEM-DEFINITION-ERROR : Error while trying to load definition for system cffi-tests from pathname /home/testgrid/cl-test-grid/work-dir/agent/quicklisp/dists/quicklisp/software/cffi_0.17.1/cffi-tests.asd: Error while trying to load definition for system cffi-toolchain from pathname /home/testgrid/cl-test-grid/work-dir/agent/quicklisp/dists/quicklisp/software/cffi_0.17.1/cffi-toolchain.asd: CFFI-toolchain requires ASDF 3.1!
(LOAD cffi-libffi FAIL) ASDF/FIND-SYSTEM:LOAD-SYSTEM-DEFINITION-ERROR : Error while trying to load definition for system cffi-libffi from pathname /home/testgrid/cl-test-grid/work-dir/agent/quicklisp/dists/quicklisp/software/cffi_0.17.1/cffi-libffi.asd: Error while trying to load definition for system cffi-toolchain from pathname /home/testgrid/cl-test-grid/work-dir/agent/quicklisp/dists/quicklisp/software/cffi_0.17.1/cffi-toolchain.asd: CFFI-toolchain requires ASDF 3.1!
(LOAD cffi-grovel FAIL) ASDF/FIND-SYSTEM:LOAD-SYSTEM-DEFINITION-ERROR : Error while trying to load definition for system cffi-toolchain from pathname /home/testgrid/cl-test-grid/work-dir/agent/quicklisp/dists/quicklisp/software/cffi_0.17.1/cffi-toolchain.asd: CFFI-toolchain requires ASDF 3.1!
(WHOLE-TEST-SUITE FAIL) ASDF/FIND-SYSTEM:LOAD-SYSTEM-DEFINITION-ERROR : Error while trying to load definition for system cffi-tests from pathname /home/testgrid/cl-test-grid/work-dir/agent/quicklisp/dists/quicklisp/software/cffi_0.17.1/cffi-tests.asd: Error while trying to load definition for system cffi-toolchain from pathname /home/testgrid/cl-test-grid/work-dir/agent/quicklisp/dists/quicklisp/software/cffi_0.17.1/cffi-toolchain.asd: CFFI-toolchain requires ASDF 3.1!
(LOAD cffi-tests FAIL) ffi-grovel, CFFI-GROVEL:GROVEL-ERROR : External process exited with code 1. Command was: "cc" "-marm" "-I/home/testgrid/cl-test-grid/work-dir/agent/quicklisp/dists/quicklisp/software/cffi_0.16.1/" "-o" "/home/testgrid/cl-test-grid/work-dir/agent/test-runs/20160215204000-ccl-1.9-r15767-f99-linux-arm/fasl/ql/dists/quicklisp/software/cffi_0.16.1/libffi/libffi-unix" "/home/testgrid/cl-test-grid/work-dir/agent/test-runs/20160215204000-ccl-1.9-r15767-f99-linux-arm/fasl/ql/dists/quicklisp/software/cffi_0.16.1/libffi/libffi-unix.c" Output was: /home/testgrid/cl-test-grid/work-dir/agent/test-runs/20160215204000-ccl-1.9-r15767-f99-linux-arm/fasl/ql/dists/quicklisp/software/cffi_0.16.1/libffi/libffi-unix.c: In function ‘main’: /home/testgrid/cl-test-grid/work-dir/agent/test-runs/20160215204000-ccl-1.9-r15767-f99-linux-arm/fasl/ql/dists/quicklisp/software/cffi_0.16.1/libffi/libffi-unix.c:82:41: error: ‘FFI_UNIX64’ undeclared (first use in this function) fprintf(output, "%"PRIiMAX, (intmax_t)FFI_UNIX64); ^ /home/testgrid/cl-test-grid/work-dir/agent/test-runs/20160215204000-ccl-1.9-r15767-f99-linux-arm/fasl/ql/dists/quicklisp/software/cffi_0.16.1/libffi/libffi-unix.c:82:41: note: each undeclared identifier is reported only once for each function it appears in In file included from /usr/include/string.h:32:0, from /home/testgrid/cl-test-grid/work-dir/agent/quicklisp/dists/quicklisp/software/cffi_0.16.1/grovel/common.h:4, from /home/testgrid/cl-test-grid/work-dir/agent/test-runs/20160215204000-ccl-1.9-r15767-f99-linux-arm/fasl/ql/dists/quicklisp/software/cffi_0.16.1/libffi/libffi-unix.c:9: /home/testgrid/cl-test-grid/work-dir/agent/test-runs/20160215204000-ccl-1.9-r15767-f99-linux-arm/fasl/ql/dists/quicklisp/software/cffi_0.16.1/libffi/libffi-unix.c:146:52: warning: format ‘%li’ expects argument of type ‘long int’, but argument 3 has type ‘unsigned int’ [-Wformat=] fprintf(output, " :offset %li)", offsetof(struct _ffi_type, size)); ^ /home/testgrid/cl-test-grid/work-dir/agent/test-runs/20160215204000-ccl-1.9-r15767-f99-linux-arm/fasl/ql/dists/quicklisp/software/cffi_0.16.1/libffi/libffi-unix.c:151:52: warning: format ‘%li’ expects argument of type ‘long int’, but argument 3 has type ‘unsigned int’ [-Wformat=] fprintf(output, " :offset %li)", offsetof(struct _ffi_type, alignment)); ^ /home/testgrid/cl-test-grid/work-dir/agent/test-runs/20160215204000-ccl-1.9-r15767-f99-linux-arm/fasl/ql/dists/quicklisp/software/cffi_0.16.1/libffi/libffi-unix.c:156:52: warning: format ‘%li’ expects argument of type ‘long int’, but argument 3 has type ‘unsigned int’ [-Wformat=] fprintf(output, " :offset %li)", offsetof(struct _ffi_type, type)); ^ /home/testgrid/cl-test-grid/work-dir/agent/test-runs/20160215204000-ccl-1.9-r15767-f99-linux-arm/fasl/ql/dists/quicklisp/software/cffi_0.16.1/libffi/libffi-unix.c:161:52: warning: format ‘%li’ expects argument of type ‘long int’, but argument 3 has type ‘unsigned int’ [-Wformat=] fprintf(output, " :offset %li)", offsetof(struct _ffi_type, elements)); ^
(LOAD cffi-libffi FAIL) ffi-grovel, CFFI-GROVEL:GROVEL-ERROR : External process exited with code 1. Command was: "cc" "-marm" "-I/home/testgrid/cl-test-grid/work-dir/agent/quicklisp/dists/quicklisp/software/cffi_0.16.1/" "-o" "/home/testgrid/cl-test-grid/work-dir/agent/test-runs/20160215204000-ccl-1.9-r15767-f99-linux-arm/fasl/ql/dists/quicklisp/software/cffi_0.16.1/libffi/libffi-unix" "/home/testgrid/cl-test-grid/work-dir/agent/test-runs/20160215204000-ccl-1.9-r15767-f99-linux-arm/fasl/ql/dists/quicklisp/software/cffi_0.16.1/libffi/libffi-unix.c" Output was: /home/testgrid/cl-test-grid/work-dir/agent/test-runs/20160215204000-ccl-1.9-r15767-f99-linux-arm/fasl/ql/dists/quicklisp/software/cffi_0.16.1/libffi/libffi-unix.c: In function ‘main’: /home/testgrid/cl-test-grid/work-dir/agent/test-runs/20160215204000-ccl-1.9-r15767-f99-linux-arm/fasl/ql/dists/quicklisp/software/cffi_0.16.1/libffi/libffi-unix.c:82:41: error: ‘FFI_UNIX64’ undeclared (first use in this function) fprintf(output, "%"PRIiMAX, (intmax_t)FFI_UNIX64); ^ /home/testgrid/cl-test-grid/work-dir/agent/test-runs/20160215204000-ccl-1.9-r15767-f99-linux-arm/fasl/ql/dists/quicklisp/software/cffi_0.16.1/libffi/libffi-unix.c:82:41: note: each undeclared identifier is reported only once for each function it appears in In file included from /usr/include/string.h:32:0, from /home/testgrid/cl-test-grid/work-dir/agent/quicklisp/dists/quicklisp/software/cffi_0.16.1/grovel/common.h:4, from /home/testgrid/cl-test-grid/work-dir/agent/test-runs/20160215204000-ccl-1.9-r15767-f99-linux-arm/fasl/ql/dists/quicklisp/software/cffi_0.16.1/libffi/libffi-unix.c:9: /home/testgrid/cl-test-grid/work-dir/agent/test-runs/20160215204000-ccl-1.9-r15767-f99-linux-arm/fasl/ql/dists/quicklisp/software/cffi_0.16.1/libffi/libffi-unix.c:146:52: warning: format ‘%li’ expects argument of type ‘long int’, but argument 3 has type ‘unsigned int’ [-Wformat=] fprintf(output, " :offset %li)", offsetof(struct _ffi_type, size)); ^ /home/testgrid/cl-test-grid/work-dir/agent/test-runs/20160215204000-ccl-1.9-r15767-f99-linux-arm/fasl/ql/dists/quicklisp/software/cffi_0.16.1/libffi/libffi-unix.c:151:52: warning: format ‘%li’ expects argument of type ‘long int’, but argument 3 has type ‘unsigned int’ [-Wformat=] fprintf(output, " :offset %li)", offsetof(struct _ffi_type, alignment)); ^ /home/testgrid/cl-test-grid/work-dir/agent/test-runs/20160215204000-ccl-1.9-r15767-f99-linux-arm/fasl/ql/dists/quicklisp/software/cffi_0.16.1/libffi/libffi-unix.c:156:52: warning: format ‘%li’ expects argument of type ‘long int’, but argument 3 has type ‘unsigned int’ [-Wformat=] fprintf(output, " :offset %li)", offsetof(struct _ffi_type, type)); ^ /home/testgrid/cl-test-grid/work-dir/agent/test-runs/20160215204000-ccl-1.9-r15767-f99-linux-arm/fasl/ql/dists/quicklisp/software/cffi_0.16.1/libffi/libffi-unix.c:161:52: warning: format ‘%li’ expects argument of type ‘long int’, but argument 3 has type ‘unsigned int’ [-Wformat=] fprintf(output, " :offset %li)", offsetof(struct _ffi_type, elements)); ^
(WHOLE-TEST-SUITE FAIL) ffi-grovel, CFFI-GROVEL:GROVEL-ERROR : External process exited with code 1. Command was: "cc" "-marm" "-I/home/testgrid/cl-test-grid/work-dir/agent/quicklisp/dists/quicklisp/software/cffi_0.16.1/" "-o" "/home/testgrid/cl-test-grid/work-dir/agent/test-runs/20160215204000-ccl-1.9-r15767-f99-linux-arm/fasl/test-grid/work-dir/agent/quicklisp/dists/quicklisp/software/cffi_0.16.1/libffi/libffi-unix" "/home/testgrid/cl-test-grid/work-dir/agent/test-runs/20160215204000-ccl-1.9-r15767-f99-linux-arm/fasl/test-grid/work-dir/agent/quicklisp/dists/quicklisp/software/cffi_0.16.1/libffi/libffi-unix.c" Output was: /home/testgrid/cl-test-grid/work-dir/agent/test-runs/20160215204000-ccl-1.9-r15767-f99-linux-arm/fasl/test-grid/work-dir/agent/quicklisp/dists/quicklisp/software/cffi_0.16.1/libffi/libffi-unix.c: In function ‘main’: /home/testgrid/cl-test-grid/wo... error: ‘FFI_UNIX64’ undeclared (first use in this function) fprintf(output, "%"PRIiMAX, (intmax_t)FFI_UNIX64); ^ /home/testgrid/cl-test-grid/wo... note: each undeclared identifier is reported only once for each function it appears in In file included from /usr/include/string.h:32:0, from /home/testgrid/cl-test-grid/work-dir/agent/quicklisp/dists/quicklisp/software/cffi_0.16.1/grovel/common.h:4, from /home/testgrid/cl-test-grid/work-dir/agent/test-runs/20160215204000-ccl-1.9-r15767-f99-linux-arm/fasl/test-grid/work-dir/agent/quicklisp/dists/quicklisp/software/cffi_0.16.1/libffi/libffi-unix.c:9: /home/testgrid/cl-test-grid/wo... warning: format ‘%li’ expects argument of type ‘long int’, but argument 3 has type ‘unsigned int’ [-Wformat=] fprintf(output, " :offset %li)", offsetof(struct _ffi_type, size)); ^ /home/testgrid/cl-test-grid/wo... warning: format ‘%li’ expects argument of type ‘long int’, but argument 3 has type ‘unsigned int’ [-Wformat=] fprintf(output, " :offset %li)", offsetof(struct _ffi_type, alignment)); ^ /home/testgrid/cl-test-grid/wo... warning: format ‘%li’ expects argument of type ‘long int’, but argument 3 has type ‘unsigned int’ [-Wformat=] fprintf(output, " :offset %li)", offsetof(struct _ffi_type, type)); ^ /home/testgrid/cl-test-grid/wo... warning: format ‘%li’ expects argument of type ‘long int’, but argument 3 has type ‘unsigned int’ [-Wformat=] fprintf(output, " :offset %li)", offsetof(struct _ffi_type, elements)); ^
clisp-2.49-unix-armv7l
(LOAD cffi-uffi-compat FAIL) ASDF:LOAD-SYSTEM-DEFINITION-ERROR : Error while trying to load definition for system cffi from pathname /home/testgrid/cl-test-grid/work-dir/agent/quicklisp/dists/quicklisp/software/cffi_0.17.1/cffi.asd: DESTRUCTURING-BIND: (OPERATE 'TEST-OP :CFFI-TESTS) does not match lambda list element (O C)
(LOAD cffi-toolchain FAIL) ASDF:LOAD-SYSTEM-DEFINITION-ERROR : Error while trying to load definition for system cffi-toolchain from pathname /home/testgrid/cl-test-grid/work-dir/agent/quicklisp/dists/quicklisp/software/cffi_0.17.1/cffi-toolchain.asd: CFFI-toolchain requires ASDF 3.1!
(LOAD cffi-tests FAIL) ASDF:LOAD-SYSTEM-DEFINITION-ERROR : Error while trying to load definition for system cffi-tests from pathname /home/testgrid/cl-test-grid/work-dir/agent/quicklisp/dists/quicklisp/software/cffi_0.17.1/cffi-tests.asd: Error while trying to load definition for system cffi-toolchain from pathname /home/testgrid/cl-test-grid/work-dir/agent/quicklisp/dists/quicklisp/software/cffi_0.17.1/cffi-toolchain.asd: CFFI-toolchain requires ASDF 3.1!
(LOAD cffi-libffi FAIL) ASDF:LOAD-SYSTEM-DEFINITION-ERROR : Error while trying to load definition for system cffi-libffi from pathname /home/testgrid/cl-test-grid/work-dir/agent/quicklisp/dists/quicklisp/software/cffi_0.17.1/cffi-libffi.asd: Error while trying to load definition for system cffi-toolchain from pathname /home/testgrid/cl-test-grid/work-dir/agent/quicklisp/dists/quicklisp/software/cffi_0.17.1/cffi-toolchain.asd: CFFI-toolchain requires ASDF 3.1!
(LOAD cffi-grovel FAIL) ASDF:LOAD-SYSTEM-DEFINITION-ERROR : Error while trying to load definition for system cffi-toolchain from pathname /home/testgrid/cl-test-grid/work-dir/agent/quicklisp/dists/quicklisp/software/cffi_0.17.1/cffi-toolchain.asd: CFFI-toolchain requires ASDF 3.1!
(LOAD cffi-examples FAIL) ASDF:LOAD-SYSTEM-DEFINITION-ERROR : Error while trying to load definition for system cffi from pathname /home/testgrid/cl-test-grid/work-dir/agent/quicklisp/dists/quicklisp/software/cffi_0.17.1/cffi.asd: DESTRUCTURING-BIND: (OPERATE 'TEST-OP :CFFI-TESTS) does not match lambda list element (O C)
(LOAD cffi FAIL) ASDF:LOAD-SYSTEM-DEFINITION-ERROR : Error while trying to load definition for system cffi from pathname /home/testgrid/cl-test-grid/work-dir/agent/quicklisp/dists/quicklisp/software/cffi_0.17.1/cffi.asd: DESTRUCTURING-BIND: (OPERATE 'TEST-OP :CFFI-TESTS) does not match lambda list element (O C)
(WHOLE-TEST-SUITE FAIL) ASDF:LOAD-SYSTEM-DEFINITION-ERROR : Error while trying to load definition for system cffi from pathname /home/testgrid/cl-test-grid/work-dir/agent/quicklisp/dists/quicklisp/software/cffi_0.17.1/cffi.asd: DESTRUCTURING-BIND: (OPERATE 'TEST-OP :CFFI-TESTS) does not match lambda list element (O C)
(LOAD cffi-tests FAIL) ASDF:LOAD-SYSTEM-DEFINITION-ERROR : Error while trying to load definition for system bordeaux-threads from pathname /home/testgrid/cl-test-grid/work-dir/agent/quicklisp/dists/quicklisp/software/bordeaux-threads-v0.8.4-git/bordeaux-threads.asd: READ from #<INPUT BUFFERED FILE-STREAM CHARACTER #P"/home/testgrid/cl-test-grid/work-dir/agent/quicklisp/dists/quicklisp/software/bordeaux-threads-v0.8.4-git/bordeaux-threads.asd" @68>: there is no package with name "UIOP"
(LOAD cffi-libffi FAIL) ffi-grovel, CFFI-GROVEL:GROVEL-ERROR : External process exited with code 1. Command was: "cc" "-m32" "-I/home/testgrid/cl-test-grid/work-dir/agent/quicklisp/dists/quicklisp/software/cffi_0.16.1/" "-o" "/home/testgrid/cl-test-grid/work-dir/agent/test-runs/20160217083144-clisp-2.49-unix-armv7l/fasl/ql/dists/quicklisp/software/cffi_0.16.1/libffi/libffi-unix" "/home/testgrid/cl-test-grid/work-dir/agent/test-runs/20160217083144-clisp-2.49-unix-armv7l/fasl/ql/dists/quicklisp/software/cffi_0.16.1/libffi/libffi-unix.c" Output was:
(WHOLE-TEST-SUITE FAIL) ffi-grovel, CFFI-GROVEL:GROVEL-ERROR : External process exited with code 1. Command was: "cc" "-m32" "-I/home/testgrid/cl-test-grid/work-dir/agent/quicklisp/dists/quicklisp/software/cffi_0.16.1/" "-o" "/home/testgrid/cl-test-grid/work-dir/agent/test-runs/20160217083144-clisp-2.49-unix-armv7l/fasl/test-grid/work-dir/agent/quicklisp/dists/quicklisp/software/cffi_0.16.1/libffi/libffi-unix" "/home/testgrid/cl-test-grid/work-dir/agent/test-runs/20160217083144-clisp-2.49-unix-armv7l/fasl/test-grid/work-dir/agent/quicklisp/dists/quicklisp/software/cffi_0.16.1/libffi/libffi-unix.c" Output was:
clisp-2.49-unix-x86
(LOAD cffi-uffi-compat FAIL) ASDF:LOAD-SYSTEM-DEFINITION-ERROR : Error while trying to load definition for system cffi from pathname /home/testgrid/cl-test-grid/work-dir/agent/quicklisp/dists/quicklisp/software/cffi_0.17.1/cffi.asd: DESTRUCTURING-BIND: (OPERATE 'TEST-OP :CFFI-TESTS) does not match lambda list element (O C)
(LOAD cffi-toolchain FAIL) ASDF:LOAD-SYSTEM-DEFINITION-ERROR : Error while trying to load definition for system cffi-toolchain from pathname /home/testgrid/cl-test-grid/work-dir/agent/quicklisp/dists/quicklisp/software/cffi_0.17.1/cffi-toolchain.asd: CFFI-toolchain requires ASDF 3.1!
(LOAD cffi-tests FAIL) ASDF:LOAD-SYSTEM-DEFINITION-ERROR : Error while trying to load definition for system cffi-tests from pathname /home/testgrid/cl-test-grid/work-dir/agent/quicklisp/dists/quicklisp/software/cffi_0.17.1/cffi-tests.asd: Error while trying to load definition for system cffi-toolchain from pathname /home/testgrid/cl-test-grid/work-dir/agent/quicklisp/dists/quicklisp/software/cffi_0.17.1/cffi-toolchain.asd: CFFI-toolchain requires ASDF 3.1!
(LOAD cffi-libffi FAIL) ASDF:LOAD-SYSTEM-DEFINITION-ERROR : Error while trying to load definition for system cffi-libffi from pathname /home/testgrid/cl-test-grid/work-dir/agent/quicklisp/dists/quicklisp/software/cffi_0.17.1/cffi-libffi.asd: Error while trying to load definition for system cffi-toolchain from pathname /home/testgrid/cl-test-grid/work-dir/agent/quicklisp/dists/quicklisp/software/cffi_0.17.1/cffi-toolchain.asd: CFFI-toolchain requires ASDF 3.1!
(LOAD cffi-grovel FAIL) ASDF:LOAD-SYSTEM-DEFINITION-ERROR : Error while trying to load definition for system cffi-toolchain from pathname /home/testgrid/cl-test-grid/work-dir/agent/quicklisp/dists/quicklisp/software/cffi_0.17.1/cffi-toolchain.asd: CFFI-toolchain requires ASDF 3.1!
(LOAD cffi-examples FAIL) ASDF:LOAD-SYSTEM-DEFINITION-ERROR : Error while trying to load definition for system cffi from pathname /home/testgrid/cl-test-grid/work-dir/agent/quicklisp/dists/quicklisp/software/cffi_0.17.1/cffi.asd: DESTRUCTURING-BIND: (OPERATE 'TEST-OP :CFFI-TESTS) does not match lambda list element (O C)
(LOAD cffi FAIL) ASDF:LOAD-SYSTEM-DEFINITION-ERROR : Error while trying to load definition for system cffi from pathname /home/testgrid/cl-test-grid/work-dir/agent/quicklisp/dists/quicklisp/software/cffi_0.17.1/cffi.asd: DESTRUCTURING-BIND: (OPERATE 'TEST-OP :CFFI-TESTS) does not match lambda list element (O C)
(WHOLE-TEST-SUITE FAIL) ASDF:LOAD-SYSTEM-DEFINITION-ERROR : Error while trying to load definition for system cffi from pathname /home/testgrid/cl-test-grid/work-dir/agent/quicklisp/dists/quicklisp/software/cffi_0.17.1/cffi.asd: DESTRUCTURING-BIND: (OPERATE 'TEST-OP :CFFI-TESTS) does not match lambda list element (O C)
(LOAD cffi-tests FAIL) ASDF:LOAD-SYSTEM-DEFINITION-ERROR : Error while trying to load definition for system bordeaux-threads from pathname /home/testgrid/cl-test-grid/work-dir/agent/quicklisp/dists/quicklisp/software/bordeaux-threads-v0.8.4-git/bordeaux-threads.asd: READ from #<INPUT BUFFERED FILE-STREAM CHARACTER #P"/home/testgrid/cl-test-grid/work-dir/agent/quicklisp/dists/quicklisp/software/bordeaux-threads-v0.8.4-git/bordeaux-threads.asd" @68>: there is no package with name "UIOP"
(WHOLE-TEST-SUITE FAIL) SYSTEM::SIMPLE-FILE-ERROR : LOAD: A file with name /home/testgrid/cl-test-grid/work-dir/agent/test-runs/20160214095017-clisp-2.49-unix-x86/fasl/test-grid/work-dir/agent/quicklisp/dists/quicklisp/software/cffi_0.16.1/libffi/libffi-unix.fas does not exist
cmu-snapshot-2013-04__20d_unicode_-linux-x86
(LOAD cffi-toolchain FAIL) ASDF/FIND-SYSTEM:LOAD-SYSTEM-DEFINITION-ERROR : Error while trying to load definition for system cffi-toolchain from pathname /home/testgrid/cl-test-grid/work-dir/agent/quicklisp/dists/quicklisp/software/cffi_0.17.1/cffi-toolchain.asd: Error in function LISP::SLOLOAD: CFFI-toolchain requires ASDF 3.1!
(LOAD cffi-tests FAIL) ASDF/FIND-SYSTEM:LOAD-SYSTEM-DEFINITION-ERROR : Error while trying to load definition for system cffi-tests from pathname /home/testgrid/cl-test-grid/work-dir/agent/quicklisp/dists/quicklisp/software/cffi_0.17.1/cffi-tests.asd: Error while trying to load definition for system cffi-toolchain from pathname /home/testgrid/cl-test-grid/work-dir/agent/quicklisp/dists/quicklisp/software/cffi_0.17.1/cffi-toolchain.asd: Error in function LISP::SLOLOAD: CFFI-toolchain requires ASDF 3.1!
(LOAD cffi-libffi FAIL) ASDF/FIND-SYSTEM:LOAD-SYSTEM-DEFINITION-ERROR : Error while trying to load definition for system cffi-libffi from pathname /home/testgrid/cl-test-grid/work-dir/agent/quicklisp/dists/quicklisp/software/cffi_0.17.1/cffi-libffi.asd: Error while trying to load definition for system cffi-toolchain from pathname /home/testgrid/cl-test-grid/work-dir/agent/quicklisp/dists/quicklisp/software/cffi_0.17.1/cffi-toolchain.asd: Error in function LISP::SLOLOAD: CFFI-toolchain requires ASDF 3.1!
(LOAD cffi-grovel FAIL) ASDF/FIND-SYSTEM:LOAD-SYSTEM-DEFINITION-ERROR : Error while trying to load definition for system cffi-toolchain from pathname /home/testgrid/cl-test-grid/work-dir/agent/quicklisp/dists/quicklisp/software/cffi_0.17.1/cffi-toolchain.asd: Error in function LISP::SLOLOAD: CFFI-toolchain requires ASDF 3.1!
(WHOLE-TEST-SUITE FAIL) ASDF/FIND-SYSTEM:LOAD-SYSTEM-DEFINITION-ERROR : Error while trying to load definition for system cffi-tests from pathname /home/testgrid/cl-test-grid/work-dir/agent/quicklisp/dists/quicklisp/software/cffi_0.17.1/cffi-tests.asd: Error while trying to load definition for system cffi-toolchain from pathname /home/testgrid/cl-test-grid/work-dir/agent/quicklisp/dists/quicklisp/software/cffi_0.17.1/cffi-toolchain.asd: Error in function LISP::SLOLOAD: CFFI-toolchain requires ASDF 3.1!
(LOAD cffi-tests FAIL) COMMON-LISP:SIMPLE-TYPE-ERROR : Argument X is not a NUMBER: NIL.
(WHOLE-TEST-SUITE FAIL) COMMON-LISP:SIMPLE-TYPE-ERROR : Argument X is not a NUMBER: NIL.
cmu-snapshot-2014-01__20e_unicode_-linux-x86
(LOAD cffi-toolchain FAIL) ASDF/FIND-SYSTEM:LOAD-SYSTEM-DEFINITION-ERROR : Error while trying to load definition for system cffi-toolchain from pathname /home/testgrid/cl-test-grid/work-dir/agent/quicklisp/dists/quicklisp/software/cffi_0.17.1/cffi-toolchain.asd: Error in function LISP::SLOLOAD: CFFI-toolchain requires ASDF 3.1!
(LOAD cffi-tests FAIL) ASDF/FIND-SYSTEM:LOAD-SYSTEM-DEFINITION-ERROR : Error while trying to load definition for system cffi-tests from pathname /home/testgrid/cl-test-grid/work-dir/agent/quicklisp/dists/quicklisp/software/cffi_0.17.1/cffi-tests.asd: Error while trying to load definition for system cffi-toolchain from pathname /home/testgrid/cl-test-grid/work-dir/agent/quicklisp/dists/quicklisp/software/cffi_0.17.1/cffi-toolchain.asd: Error in function LISP::SLOLOAD: CFFI-toolchain requires ASDF 3.1!
(LOAD cffi-libffi FAIL) ASDF/FIND-SYSTEM:LOAD-SYSTEM-DEFINITION-ERROR : Error while trying to load definition for system cffi-libffi from pathname /home/testgrid/cl-test-grid/work-dir/agent/quicklisp/dists/quicklisp/software/cffi_0.17.1/cffi-libffi.asd: Error while trying to load definition for system cffi-toolchain from pathname /home/testgrid/cl-test-grid/work-dir/agent/quicklisp/dists/quicklisp/software/cffi_0.17.1/cffi-toolchain.asd: Error in function LISP::SLOLOAD: CFFI-toolchain requires ASDF 3.1!
(LOAD cffi-grovel FAIL) ASDF/FIND-SYSTEM:LOAD-SYSTEM-DEFINITION-ERROR : Error while trying to load definition for system cffi-toolchain from pathname /home/testgrid/cl-test-grid/work-dir/agent/quicklisp/dists/quicklisp/software/cffi_0.17.1/cffi-toolchain.asd: Error in function LISP::SLOLOAD: CFFI-toolchain requires ASDF 3.1!
(WHOLE-TEST-SUITE FAIL) ASDF/FIND-SYSTEM:LOAD-SYSTEM-DEFINITION-ERROR : Error while trying to load definition for system cffi-tests from pathname /home/testgrid/cl-test-grid/work-dir/agent/quicklisp/dists/quicklisp/software/cffi_0.17.1/cffi-tests.asd: Error while trying to load definition for system cffi-toolchain from pathname /home/testgrid/cl-test-grid/work-dir/agent/quicklisp/dists/quicklisp/software/cffi_0.17.1/cffi-toolchain.asd: Error in function LISP::SLOLOAD: CFFI-toolchain requires ASDF 3.1!
(WHOLE-TEST-SUITE FAIL) KERNEL:SIMPLE-FILE-ERROR : File-error in function LISP::INTERNAL-LOAD: "/home/testgrid/cl-test-grid/w... does not exist.
cmu-snapshot-2014-05-dirty__20e_unicode_-linux-x86
(LOAD cffi-toolchain FAIL) ASDF/FIND-SYSTEM:LOAD-SYSTEM-DEFINITION-ERROR : Error while trying to load definition for system cffi-toolchain from pathname /home/testgrid/cl-test-grid/work-dir/agent/quicklisp/dists/quicklisp/software/cffi_0.17.1/cffi-toolchain.asd: Error in function LISP::SLOLOAD: CFFI-toolchain requires ASDF 3.1!
(LOAD cffi-tests FAIL) ASDF/FIND-SYSTEM:LOAD-SYSTEM-DEFINITION-ERROR : Error while trying to load definition for system cffi-tests from pathname /home/testgrid/cl-test-grid/work-dir/agent/quicklisp/dists/quicklisp/software/cffi_0.17.1/cffi-tests.asd: Error while trying to load definition for system cffi-toolchain from pathname /home/testgrid/cl-test-grid/work-dir/agent/quicklisp/dists/quicklisp/software/cffi_0.17.1/cffi-toolchain.asd: Error in function LISP::SLOLOAD: CFFI-toolchain requires ASDF 3.1!
(LOAD cffi-libffi FAIL) ASDF/FIND-SYSTEM:LOAD-SYSTEM-DEFINITION-ERROR : Error while trying to load definition for system cffi-libffi from pathname /home/testgrid/cl-test-grid/work-dir/agent/quicklisp/dists/quicklisp/software/cffi_0.17.1/cffi-libffi.asd: Error while trying to load definition for system cffi-toolchain from pathname /home/testgrid/cl-test-grid/work-dir/agent/quicklisp/dists/quicklisp/software/cffi_0.17.1/cffi-toolchain.asd: Error in function LISP::SLOLOAD: CFFI-toolchain requires ASDF 3.1!
(LOAD cffi-grovel FAIL) ASDF/FIND-SYSTEM:LOAD-SYSTEM-DEFINITION-ERROR : Error while trying to load definition for system cffi-toolchain from pathname /home/testgrid/cl-test-grid/work-dir/agent/quicklisp/dists/quicklisp/software/cffi_0.17.1/cffi-toolchain.asd: Error in function LISP::SLOLOAD: CFFI-toolchain requires ASDF 3.1!
(WHOLE-TEST-SUITE FAIL) ASDF/FIND-SYSTEM:LOAD-SYSTEM-DEFINITION-ERROR : Error while trying to load definition for system cffi-tests from pathname /home/testgrid/cl-test-grid/work-dir/agent/quicklisp/dists/quicklisp/software/cffi_0.17.1/cffi-tests.asd: Error while trying to load definition for system cffi-toolchain from pathname /home/testgrid/cl-test-grid/work-dir/agent/quicklisp/dists/quicklisp/software/cffi_0.17.1/cffi-toolchain.asd: Error in function LISP::SLOLOAD: CFFI-toolchain requires ASDF 3.1!
(WHOLE-TEST-SUITE FAIL) KERNEL:SIMPLE-FILE-ERROR : File-error in function LISP::INTERNAL-LOAD: "/home/testgrid/cl-test-grid/w... does not exist.
cmu-snapshot-2014-12___20f_unicode_-linux-x86
(LOAD cffi-toolchain FAIL) C::COMPILER-ERROR : (during macroexpansion) Error in FDEFINITION: the function GATHER-TYPE is undefined.
(LOAD cffi-tests FAIL) ASDF/FIND-SYSTEM:LOAD-SYSTEM-DEFINITION-ERROR : Error while trying to load definition for system cffi-tests from pathname /home/testgrid/cl-test-grid/work-dir/agent/quicklisp/dists/quicklisp/software/cffi_0.17.1/cffi-tests.asd: (during macroexpansion) Error in FDEFINITION: the function GATHER-TYPE is undefined.
(LOAD cffi-libffi FAIL) ASDF/FIND-SYSTEM:LOAD-SYSTEM-DEFINITION-ERROR : Error while trying to load definition for system cffi-libffi from pathname /home/testgrid/cl-test-grid/work-dir/agent/quicklisp/dists/quicklisp/software/cffi_0.17.1/cffi-libffi.asd: (during macroexpansion) Error in FDEFINITION: the function GATHER-TYPE is undefined.
(LOAD cffi-grovel FAIL) C::COMPILER-ERROR : (during macroexpansion) Error in FDEFINITION: the function GATHER-TYPE is undefined.
(WHOLE-TEST-SUITE FAIL) ASDF/FIND-SYSTEM:LOAD-SYSTEM-DEFINITION-ERROR : Error while trying to load definition for system cffi-tests from pathname /home/testgrid/cl-test-grid/work-dir/agent/quicklisp/dists/quicklisp/software/cffi_0.17.1/cffi-tests.asd: (during macroexpansion) Error in FDEFINITION: the function GATHER-TYPE is undefined.
(WHOLE-TEST-SUITE FAIL) KERNEL:SIMPLE-FILE-ERROR : File-error in function LISP::INTERNAL-LOAD: "/home/testgrid/cl-test-grid/w... does not exist.
ecl-13.5.1-unknown-linux-i686-bytecode
(LOAD cffi-uffi-compat FAIL) SI::SIMPLE-PACKAGE-ERROR : A package with the name UFFI already exists.
(LOAD cffi-toolchain FAIL) ASDF/FIND-SYSTEM:LOAD-SYSTEM-DEFINITION-ERROR : Error while trying to load definition for system cffi-toolchain from pathname /home/testgrid/cl-test-grid/work-dir/agent/quicklisp/dists/quicklisp/software/cffi_0.17.1/cffi-toolchain.asd: CFFI-toolchain requires ASDF 3.1!
(LOAD cffi-tests FAIL) ASDF/FIND-SYSTEM:LOAD-SYSTEM-DEFINITION-ERROR : Error while trying to load definition for system cffi-tests from pathname /home/testgrid/cl-test-grid/work-dir/agent/quicklisp/dists/quicklisp/software/cffi_0.17.1/cffi-tests.asd: Error while trying to load definition for system cffi-toolchain from pathname /home/testgrid/cl-test-grid/work-dir/agent/quicklisp/dists/quicklisp/software/cffi_0.17.1/cffi-toolchain.asd: CFFI-toolchain requires ASDF 3.1!
(LOAD cffi-libffi FAIL) ASDF/FIND-SYSTEM:LOAD-SYSTEM-DEFINITION-ERROR : Error while trying to load definition for system cffi-libffi from pathname /home/testgrid/cl-test-grid/work-dir/agent/quicklisp/dists/quicklisp/software/cffi_0.17.1/cffi-libffi.asd: Error while trying to load definition for system cffi-toolchain from pathname /home/testgrid/cl-test-grid/work-dir/agent/quicklisp/dists/quicklisp/software/cffi_0.17.1/cffi-toolchain.asd: CFFI-toolchain requires ASDF 3.1!
(LOAD cffi-grovel FAIL) ASDF/FIND-SYSTEM:LOAD-SYSTEM-DEFINITION-ERROR : Error while trying to load definition for system cffi-toolchain from pathname /home/testgrid/cl-test-grid/work-dir/agent/quicklisp/dists/quicklisp/software/cffi_0.17.1/cffi-toolchain.asd: CFFI-toolchain requires ASDF 3.1!
(WHOLE-TEST-SUITE FAIL) ASDF/FIND-SYSTEM:LOAD-SYSTEM-DEFINITION-ERROR : Error while trying to load definition for system cffi-tests from pathname /home/testgrid/cl-test-grid/work-dir/agent/quicklisp/dists/quicklisp/software/cffi_0.17.1/cffi-tests.asd: Error while trying to load definition for system cffi-toolchain from pathname /home/testgrid/cl-test-grid/work-dir/agent/quicklisp/dists/quicklisp/software/cffi_0.17.1/cffi-toolchain.asd: CFFI-toolchain requires ASDF 3.1!
ecl-13.5.1-unknown-linux-i686-lisp-to-c
(LOAD cffi-uffi-compat FAIL) UIOP/LISP-BUILD:COMPILE-FILE-ERROR : COMPILE-FILE-ERROR while compiling #<cl-source-file "cffi-uffi-compat" "uffi-compat" "uffi-compat">
(LOAD cffi-toolchain FAIL) ASDF/FIND-SYSTEM:LOAD-SYSTEM-DEFINITION-ERROR : Error while trying to load definition for system cffi-toolchain from pathname /home/testgrid/cl-test-grid/work-dir/agent/quicklisp/dists/quicklisp/software/cffi_0.17.1/cffi-toolchain.asd: CFFI-toolchain requires ASDF 3.1!
(LOAD cffi-tests FAIL) ASDF/FIND-SYSTEM:LOAD-SYSTEM-DEFINITION-ERROR : Error while trying to load definition for system cffi-tests from pathname /home/testgrid/cl-test-grid/work-dir/agent/quicklisp/dists/quicklisp/software/cffi_0.17.1/cffi-tests.asd: Error while trying to load definition for system cffi-toolchain from pathname /home/testgrid/cl-test-grid/work-dir/agent/quicklisp/dists/quicklisp/software/cffi_0.17.1/cffi-toolchain.asd: CFFI-toolchain requires ASDF 3.1!
(LOAD cffi-libffi FAIL) ASDF/FIND-SYSTEM:LOAD-SYSTEM-DEFINITION-ERROR : Error while trying to load definition for system cffi-libffi from pathname /home/testgrid/cl-test-grid/work-dir/agent/quicklisp/dists/quicklisp/software/cffi_0.17.1/cffi-libffi.asd: Error while trying to load definition for system cffi-toolchain from pathname /home/testgrid/cl-test-grid/work-dir/agent/quicklisp/dists/quicklisp/software/cffi_0.17.1/cffi-toolchain.asd: CFFI-toolchain requires ASDF 3.1!
(LOAD cffi-grovel FAIL) ASDF/FIND-SYSTEM:LOAD-SYSTEM-DEFINITION-ERROR : Error while trying to load definition for system cffi-toolchain from pathname /home/testgrid/cl-test-grid/work-dir/agent/quicklisp/dists/quicklisp/software/cffi_0.17.1/cffi-toolchain.asd: CFFI-toolchain requires ASDF 3.1!
(WHOLE-TEST-SUITE FAIL) ASDF/FIND-SYSTEM:LOAD-SYSTEM-DEFINITION-ERROR : Error while trying to load definition for system cffi-tests from pathname /home/testgrid/cl-test-grid/work-dir/agent/quicklisp/dists/quicklisp/software/cffi_0.17.1/cffi-tests.asd: Error while trying to load definition for system cffi-toolchain from pathname /home/testgrid/cl-test-grid/work-dir/agent/quicklisp/dists/quicklisp/software/cffi_0.17.1/cffi-toolchain.asd: CFFI-toolchain requires ASDF 3.1!
(LOAD cffi-uffi-compat FAIL) UIOP/LISP-BUILD:COMPILE-FILE-ERROR : COMPILE-FILE-ERROR while compiling #<cl-source-file "cffi-uffi-compat" "uffi-compat" "uffi-compat">
(LOAD cffi-tests FAIL) COMMON-LISP:SIMPLE-TYPE-ERROR : In function ZEROP, the value of the only argument is NIL which is not of the expected type NUMBER
(WHOLE-TEST-SUITE FAIL) COMMON-LISP:FILE-ERROR : Filesystem error with pathname #P"/home/testgrid/cl-test-grid... Either 1) the file does not exist, or 2) we are not allowed to access the file, or 3) the pathname points to a broken symbolic link.
ecl-15.2.21-ee989b97-linux-i686-bytecode
(LOAD cffi-uffi-compat FAIL) SI::SIMPLE-PACKAGE-ERROR : A package with the name UFFI already exists.
(LOAD cffi-toolchain FAIL) COMMON-LISP:UNBOUND-VARIABLE : The variable C::*CC-FLAGS* is unbound.
(LOAD cffi-tests FAIL) ASDF/FIND-SYSTEM:LOAD-SYSTEM-DEFINITION-ERROR : Error while trying to load definition for system cffi-tests from pathname /home/testgrid/cl-test-grid/work-dir/agent/quicklisp/dists/quicklisp/software/cffi_0.17.1/cffi-tests.asd: The variable C::*CC-FLAGS* is unbound.
(LOAD cffi-libffi FAIL) ASDF/FIND-SYSTEM:LOAD-SYSTEM-DEFINITION-ERROR : Error while trying to load definition for system cffi-libffi from pathname /home/testgrid/cl-test-grid/work-dir/agent/quicklisp/dists/quicklisp/software/cffi_0.17.1/cffi-libffi.asd: The variable C::*CC-FLAGS* is unbound.
(LOAD cffi-grovel FAIL) COMMON-LISP:UNBOUND-VARIABLE : The variable C::*CC-FLAGS* is unbound.
(WHOLE-TEST-SUITE FAIL) ASDF/FIND-SYSTEM:LOAD-SYSTEM-DEFINITION-ERROR : Error while trying to load definition for system cffi-tests from pathname /home/testgrid/cl-test-grid/work-dir/agent/quicklisp/dists/quicklisp/software/cffi_0.17.1/cffi-tests.asd: The variable C::*CC-FLAGS* is unbound.
(LOAD cffi-uffi-compat FAIL) SI::SIMPLE-PACKAGE-ERROR : A package with the name UFFI already exists.
(LOAD cffi-tests FAIL) ASDF/FIND-SYSTEM:LOAD-SYSTEM-DEFINITION-ERROR : Error while trying to load definition for system cffi-libffi from pathname /home/testgrid/cl-test-grid/work-dir/agent/quicklisp/dists/quicklisp/software/cffi_0.16.1/cffi-libffi.asd: The variable C::*CC-FLAGS* is unbound.
(LOAD cffi-libffi FAIL) ASDF/FIND-SYSTEM:LOAD-SYSTEM-DEFINITION-ERROR : Error while trying to load definition for system cffi-libffi from pathname /home/testgrid/cl-test-grid/work-dir/agent/quicklisp/dists/quicklisp/software/cffi_0.16.1/cffi-libffi.asd: The variable C::*CC-FLAGS* is unbound.
(LOAD cffi-grovel FAIL) COMMON-LISP:UNBOUND-VARIABLE : The variable C::*CC-FLAGS* is unbound.
(WHOLE-TEST-SUITE FAIL) ASDF/FIND-SYSTEM:LOAD-SYSTEM-DEFINITION-ERROR : Error while trying to load definition for system cffi-libffi from pathname /home/testgrid/cl-test-grid/work-dir/agent/quicklisp/dists/quicklisp/software/cffi_0.16.1/cffi-libffi.asd: The variable C::*CC-FLAGS* is unbound.
ecl-15.2.21-ee989b97-linux-i686-lisp-to-c
(LOAD cffi-uffi-compat FAIL) UIOP/LISP-BUILD:COMPILE-FILE-ERROR : COMPILE-FILE-ERROR while compiling #<cl-source-file "cffi-uffi-compat" "uffi-compat" "uffi-compat">
(LOAD cffi-uffi-compat FAIL) UIOP/LISP-BUILD:COMPILE-FILE-ERROR : COMPILE-FILE-ERROR while compiling #<cl-source-file "cffi-uffi-compat" "uffi-compat" "uffi-compat">
(WHOLE-TEST-SUITE FAIL) COMMON-LISP:FILE-ERROR : Filesystem error with pathname #P"/home/testgrid/cl-test-grid... Either 1) the file does not exist, or 2) we are not allowed to access the file, or 3) the pathname points to a broken symbolic link.
ecl-15.2.21-ee989b97-linux-x64-bytecode
(LOAD cffi-uffi-compat FAIL) SI::SIMPLE-PACKAGE-ERROR : A package with the name UFFI already exists.
(LOAD cffi-toolchain FAIL) SI:SIMPLE-PROGRAM-ERROR : In form ((OS-UNIX-P) "o") FUNCTION: Not a valid argument (OS-UNIX-P).
(LOAD cffi-tests FAIL) ASDF/FIND-SYSTEM:LOAD-SYSTEM-DEFINITION-ERROR : Error while trying to load definition for system cffi-tests from pathname /home/hijarian/systems/cl-test-grid/work-dir/agent/quicklisp/dists/quicklisp/software/cffi_0.17.1/cffi-tests.asd: In form ((OS-UNIX-P) "o") FUNCTION: Not a valid argument (OS-UNIX-P).
(LOAD cffi-libffi FAIL) ASDF/FIND-SYSTEM:LOAD-SYSTEM-DEFINITION-ERROR : Error while trying to load definition for system cffi-libffi from pathname /home/hijarian/systems/cl-test-grid/work-dir/agent/quicklisp/dists/quicklisp/software/cffi_0.17.1/cffi-libffi.asd: In form ((OS-UNIX-P) "o") FUNCTION: Not a valid argument (OS-UNIX-P).
(LOAD cffi-grovel FAIL) SI:SIMPLE-PROGRAM-ERROR : In form ((OS-UNIX-P) "o") FUNCTION: Not a valid argument (OS-UNIX-P).
(WHOLE-TEST-SUITE FAIL) ASDF/FIND-SYSTEM:LOAD-SYSTEM-DEFINITION-ERROR : Error while trying to load definition for system cffi-tests from pathname /home/hijarian/systems/cl-test-grid/work-dir/agent/quicklisp/dists/quicklisp/software/cffi_0.17.1/cffi-tests.asd: In form ((OS-UNIX-P) "o") FUNCTION: Not a valid argument (OS-UNIX-P).
(LOAD cffi-uffi-compat FAIL) SI::SIMPLE-PACKAGE-ERROR : A package with the name UFFI already exists.
(LOAD cffi-tests FAIL) ASDF/FIND-SYSTEM:LOAD-SYSTEM-DEFINITION-ERROR : Error while trying to load definition for system cffi-libffi from pathname /home/hijarian/systems/cl-test-grid/work-dir/agent/quicklisp/dists/quicklisp/software/cffi_0.16.1/cffi-libffi.asd: The variable C::*CC-FLAGS* is unbound.
(LOAD cffi-libffi FAIL) ASDF/FIND-SYSTEM:LOAD-SYSTEM-DEFINITION-ERROR : Error while trying to load definition for system cffi-libffi from pathname /home/hijarian/systems/cl-test-grid/work-dir/agent/quicklisp/dists/quicklisp/software/cffi_0.16.1/cffi-libffi.asd: The variable C::*CC-FLAGS* is unbound.
(LOAD cffi-grovel FAIL) COMMON-LISP:UNBOUND-VARIABLE : The variable C::*CC-FLAGS* is unbound.
(WHOLE-TEST-SUITE FAIL) ASDF/FIND-SYSTEM:LOAD-SYSTEM-DEFINITION-ERROR : Error while trying to load definition for system cffi-libffi from pathname /home/hijarian/systems/cl-test-grid/work-dir/agent/quicklisp/dists/quicklisp/software/cffi_0.16.1/cffi-libffi.asd: The variable C::*CC-FLAGS* is unbound.
(LOAD cffi-uffi-compat FAIL) SI::SIMPLE-PACKAGE-ERROR : A package with the name UFFI already exists.
(LOAD cffi-tests FAIL) ASDF/FIND-SYSTEM:LOAD-SYSTEM-DEFINITION-ERROR : Error while trying to load definition for system cffi-libffi from pathname /home/hijarian/systems/cl-test-grid/work-dir/agent/quicklisp/dists/quicklisp/software/cffi_0.16.1/cffi-libffi.asd: The variable C::*CC-FLAGS* is unbound.
(LOAD cffi-libffi FAIL) ASDF/FIND-SYSTEM:LOAD-SYSTEM-DEFINITION-ERROR : Error while trying to load definition for system cffi-libffi from pathname /home/hijarian/systems/cl-test-grid/work-dir/agent/quicklisp/dists/quicklisp/software/cffi_0.16.1/cffi-libffi.asd: The variable C::*CC-FLAGS* is unbound.
(LOAD cffi-grovel FAIL) COMMON-LISP:UNBOUND-VARIABLE : The variable C::*CC-FLAGS* is unbound.
(WHOLE-TEST-SUITE FAIL) ASDF/FIND-SYSTEM:LOAD-SYSTEM-DEFINITION-ERROR : Error while trying to load definition for system cffi-libffi from pathname /home/hijarian/systems/cl-test-grid/work-dir/agent/quicklisp/dists/quicklisp/software/cffi_0.16.1/cffi-libffi.asd: The variable C::*CC-FLAGS* is unbound.
ecl-15.2.21-ee989b97-linux-x64-lisp-to-c
(LOAD cffi-uffi-compat FAIL) UIOP/LISP-BUILD:COMPILE-FILE-ERROR : COMPILE-FILE-ERROR while compiling #<cl-source-file "cffi-uffi-compat" "uffi-compat" "uffi-compat">
(LOAD cffi-toolchain FAIL) UIOP/LISP-BUILD:COMPILE-FILE-ERROR : COMPILE-FILE-ERROR while compiling #<cl-source-file "cffi-toolchain" "toolchain" "asdf-compat">
(LOAD cffi-tests FAIL) ASDF/FIND-SYSTEM:LOAD-SYSTEM-DEFINITION-ERROR : Error while trying to load definition for system cffi-tests from pathname /home/hijarian/systems/cl-test-grid/work-dir/agent/quicklisp/dists/quicklisp/software/cffi_0.17.1/cffi-tests.asd: COMPILE-FILE-ERROR while compiling #<cl-source-file "cffi-toolchain" "toolchain" "asdf-compat">
(LOAD cffi-libffi FAIL) ASDF/FIND-SYSTEM:LOAD-SYSTEM-DEFINITION-ERROR : Error while trying to load definition for system cffi-libffi from pathname /home/hijarian/systems/cl-test-grid/work-dir/agent/quicklisp/dists/quicklisp/software/cffi_0.17.1/cffi-libffi.asd: COMPILE-FILE-ERROR while compiling #<cl-source-file "cffi-toolchain" "toolchain" "asdf-compat">
(LOAD cffi-grovel FAIL) UIOP/LISP-BUILD:COMPILE-FILE-ERROR : COMPILE-FILE-ERROR while compiling #<cl-source-file "cffi-toolchain" "toolchain" "asdf-compat">
(WHOLE-TEST-SUITE FAIL) ASDF/FIND-SYSTEM:LOAD-SYSTEM-DEFINITION-ERROR : Error while trying to load definition for system cffi-tests from pathname /home/hijarian/systems/cl-test-grid/work-dir/agent/quicklisp/dists/quicklisp/software/cffi_0.17.1/cffi-tests.asd: COMPILE-FILE-ERROR while compiling #<cl-source-file "cffi-toolchain" "toolchain" "asdf-compat">
(LOAD cffi-uffi-compat FAIL) UIOP/LISP-BUILD:COMPILE-FILE-ERROR : COMPILE-FILE-ERROR while compiling #<cl-source-file "cffi-uffi-compat" "uffi-compat" "uffi-compat">
(WHOLE-TEST-SUITE FAIL) COMMON-LISP:FILE-ERROR : Filesystem error with pathname #P"/home/hijarian/systems/cl-t... Either 1) the file does not exist, or 2) we are not allowed to access the file, or 3) the pathname points to a broken symbolic link.
(LOAD cffi-uffi-compat FAIL) UIOP/LISP-BUILD:COMPILE-FILE-ERROR : COMPILE-FILE-ERROR while compiling #<cl-source-file "cffi-uffi-compat" "uffi-compat" "uffi-compat">
(WHOLE-TEST-SUITE FAIL) COMMON-LISP:FILE-ERROR : Filesystem error with pathname #P"/home/hijarian/systems/cl-t... Either 1) the file does not exist, or 2) we are not allowed to access the file, or 3) the pathname points to a broken symbolic link.
ecl-16.0.0-98fc12d3-linux-i686-bytecode
(LOAD cffi-toolchain FAIL) COMMON-LISP:UNBOUND-VARIABLE : The variable C::*CC-FLAGS* is unbound.
(LOAD cffi-tests FAIL) ASDF/FIND-SYSTEM:LOAD-SYSTEM-DEFINITION-ERROR : Error while trying to load definition for system cffi-tests from pathname /home/testgrid/cl-test-grid/work-dir/agent/quicklisp/dists/quicklisp/software/cffi_0.17.1/cffi-tests.asd: The variable C::*CC-FLAGS* is unbound.
(LOAD cffi-libffi FAIL) ASDF/FIND-SYSTEM:LOAD-SYSTEM-DEFINITION-ERROR : Error while trying to load definition for system cffi-libffi from pathname /home/testgrid/cl-test-grid/work-dir/agent/quicklisp/dists/quicklisp/software/cffi_0.17.1/cffi-libffi.asd: The variable C::*CC-FLAGS* is unbound.
(LOAD cffi-grovel FAIL) COMMON-LISP:UNBOUND-VARIABLE : The variable C::*CC-FLAGS* is unbound.
(WHOLE-TEST-SUITE FAIL) ASDF/FIND-SYSTEM:LOAD-SYSTEM-DEFINITION-ERROR : Error while trying to load definition for system cffi-tests from pathname /home/testgrid/cl-test-grid/work-dir/agent/quicklisp/dists/quicklisp/software/cffi_0.17.1/cffi-tests.asd: The variable C::*CC-FLAGS* is unbound.
(LOAD cffi-tests FAIL) ASDF/FIND-SYSTEM:LOAD-SYSTEM-DEFINITION-ERROR : Error while trying to load definition for system cffi-libffi from pathname /home/testgrid/cl-test-grid/work-dir/agent/quicklisp/dists/quicklisp/software/cffi_0.16.1/cffi-libffi.asd: The variable C::*CC-FLAGS* is unbound.
(LOAD cffi-libffi FAIL) ASDF/FIND-SYSTEM:LOAD-SYSTEM-DEFINITION-ERROR : Error while trying to load definition for system cffi-libffi from pathname /home/testgrid/cl-test-grid/work-dir/agent/quicklisp/dists/quicklisp/software/cffi_0.16.1/cffi-libffi.asd: The variable C::*CC-FLAGS* is unbound.
(LOAD cffi-grovel FAIL) COMMON-LISP:UNBOUND-VARIABLE : The variable C::*CC-FLAGS* is unbound.
(WHOLE-TEST-SUITE FAIL) ASDF/FIND-SYSTEM:LOAD-SYSTEM-DEFINITION-ERROR : Error while trying to load definition for system cffi-libffi from pathname /home/testgrid/cl-test-grid/work-dir/agent/quicklisp/dists/quicklisp/software/cffi_0.16.1/cffi-libffi.asd: The variable C::*CC-FLAGS* is unbound.
ecl-16.0.0-98fc12d3-linux-i686-lisp-to-c
ecl-16.0.0-b2661fd1-linux-x64-bytecode
(LOAD cffi-tests FAIL) ASDF/FIND-SYSTEM:LOAD-SYSTEM-DEFINITION-ERROR : Error while trying to load definition for system cffi-libffi from pathname /home/jack/quicklisp/local-projects/cl-test-grid/work-dir/agent/quicklisp/dists/quicklisp/software/cffi_0.16.1/cffi-libffi.asd: The variable C::*CC-FLAGS* is unbound.
(LOAD cffi-libffi FAIL) ASDF/FIND-SYSTEM:LOAD-SYSTEM-DEFINITION-ERROR : Error while trying to load definition for system cffi-libffi from pathname /home/jack/quicklisp/local-projects/cl-test-grid/work-dir/agent/quicklisp/dists/quicklisp/software/cffi_0.16.1/cffi-libffi.asd: The variable C::*CC-FLAGS* is unbound.
(LOAD cffi-grovel FAIL) COMMON-LISP:UNBOUND-VARIABLE : The variable C::*CC-FLAGS* is unbound.
(WHOLE-TEST-SUITE FAIL) ASDF/FIND-SYSTEM:LOAD-SYSTEM-DEFINITION-ERROR : Error while trying to load definition for system cffi-libffi from pathname /home/jack/quicklisp/local-projects/cl-test-grid/work-dir/agent/quicklisp/dists/quicklisp/software/cffi_0.16.1/cffi-libffi.asd: The variable C::*CC-FLAGS* is unbound.
ecl-16.0.0-b2661fd1-linux-x64-lisp-to-c
(WHOLE-TEST-SUITE FAIL) COMMON-LISP:FILE-ERROR : Filesystem error with pathname #P"/home/jack/quicklisp/local-... Either 1) the file does not exist, or 2) we are not allowed to access the file, or 3) the pathname points to a broken symbolic link.
ecl-16.0.0-b2661fd1-macosx-x64-bytecode
(LOAD cffi-tests FAIL) ASDF/FIND-SYSTEM:LOAD-SYSTEM-DEFINITION-ERROR : Error while trying to load definition for system cffi-libffi from pathname /Users/testgrid/cl-test-grid/work-dir/agent/quicklisp/dists/quicklisp/software/cffi_0.16.1/cffi-libffi.asd: The variable C::*CC-FLAGS* is unbound.
(LOAD cffi-libffi FAIL) ASDF/FIND-SYSTEM:LOAD-SYSTEM-DEFINITION-ERROR : Error while trying to load definition for system cffi-libffi from pathname /Users/testgrid/cl-test-grid/work-dir/agent/quicklisp/dists/quicklisp/software/cffi_0.16.1/cffi-libffi.asd: The variable C::*CC-FLAGS* is unbound.
(LOAD cffi-grovel FAIL) COMMON-LISP:UNBOUND-VARIABLE : The variable C::*CC-FLAGS* is unbound.
(WHOLE-TEST-SUITE FAIL) ASDF/FIND-SYSTEM:LOAD-SYSTEM-DEFINITION-ERROR : Error while trying to load definition for system cffi-libffi from pathname /Users/testgrid/cl-test-grid/work-dir/agent/quicklisp/dists/quicklisp/software/cffi_0.16.1/cffi-libffi.asd: The variable C::*CC-FLAGS* is unbound.
ecl-16.0.0-b2661fd1-macosx-x64-lisp-to-c
(WHOLE-TEST-SUITE FAIL) COMMON-LISP:FILE-ERROR : Filesystem error with pathname #P"/Users/testgrid/cl-test-gri... Either 1) the file does not exist, or 2) we are not allowed to access the file, or 3) the pathname points to a broken symbolic link.
ecl-16.1.2-rc2-093ba0ab-linux-x64-bytecode
(LOAD cffi-tests FAIL) ASDF/FIND-SYSTEM:LOAD-SYSTEM-DEFINITION-ERROR : Error while trying to load definition for system cffi-libffi from pathname /home/jack/quicklisp/local-projects/cl-test-grid/work-dir/agent/quicklisp/dists/quicklisp/software/cffi_0.16.1/cffi-libffi.asd: The variable C::*CC-FLAGS* is unbound.
(LOAD cffi-libffi FAIL) ASDF/FIND-SYSTEM:LOAD-SYSTEM-DEFINITION-ERROR : Error while trying to load definition for system cffi-libffi from pathname /home/jack/quicklisp/local-projects/cl-test-grid/work-dir/agent/quicklisp/dists/quicklisp/software/cffi_0.16.1/cffi-libffi.asd: The variable C::*CC-FLAGS* is unbound.
(LOAD cffi-grovel FAIL) COMMON-LISP:UNBOUND-VARIABLE : The variable C::*CC-FLAGS* is unbound.
(WHOLE-TEST-SUITE FAIL) ASDF/FIND-SYSTEM:LOAD-SYSTEM-DEFINITION-ERROR : Error while trying to load definition for system cffi-libffi from pathname /home/jack/quicklisp/local-projects/cl-test-grid/work-dir/agent/quicklisp/dists/quicklisp/software/cffi_0.16.1/cffi-libffi.asd: The variable C::*CC-FLAGS* is unbound.
ecl-16.1.2-rc2-093ba0ab-linux-x64-lisp-to-c
(WHOLE-TEST-SUITE FAIL) COMMON-LISP:FILE-ERROR : Filesystem error with pathname #P"/home/jack/quicklisp/local-... Either 1) the file does not exist, or 2) we are not allowed to access the file, or 3) the pathname points to a broken symbolic link.
ecl-16.1.2-rc3-9e5a61f4-linux-x64-bytecode
(LOAD cffi-tests FAIL) ASDF/FIND-SYSTEM:LOAD-SYSTEM-DEFINITION-ERROR : Error while trying to load definition for system cffi-libffi from pathname /home/jack/Projekty/lisp-systems/cl-test-grid/work-dir/agent/quicklisp/dists/quicklisp/software/cffi_0.16.1/cffi-libffi.asd: The variable C::*CC-FLAGS* is unbound.
(LOAD cffi-libffi FAIL) ASDF/FIND-SYSTEM:LOAD-SYSTEM-DEFINITION-ERROR : Error while trying to load definition for system cffi-libffi from pathname /home/jack/Projekty/lisp-systems/cl-test-grid/work-dir/agent/quicklisp/dists/quicklisp/software/cffi_0.16.1/cffi-libffi.asd: The variable C::*CC-FLAGS* is unbound.
(LOAD cffi-grovel FAIL) COMMON-LISP:UNBOUND-VARIABLE : The variable C::*CC-FLAGS* is unbound.
(WHOLE-TEST-SUITE FAIL) ASDF/FIND-SYSTEM:LOAD-SYSTEM-DEFINITION-ERROR : Error while trying to load definition for system cffi-libffi from pathname /home/jack/Projekty/lisp-systems/cl-test-grid/work-dir/agent/quicklisp/dists/quicklisp/software/cffi_0.16.1/cffi-libffi.asd: The variable C::*CC-FLAGS* is unbound.
ecl-16.1.2-rc3-9e5a61f4-linux-x64-lisp-to-c
(WHOLE-TEST-SUITE FAIL) COMMON-LISP:FILE-ERROR : Filesystem error with pathname #P"/home/jack/quicklisp/local-... Either 1) the file does not exist, or 2) we are not allowed to access the file, or 3) the pathname points to a broken symbolic link.
(WHOLE-TEST-SUITE FAIL) COMMON-LISP:FILE-ERROR : Filesystem error with pathname #P"/home/jack/Projekty/lisp-sy... Either 1) the file does not exist, or 2) we are not allowed to access the file, or 3) the pathname points to a broken symbolic link.
sbcl-1.0.58-linux-x86
(LOAD cffi-uffi-compat FAIL) ASDF:LOAD-SYSTEM-DEFINITION-ERROR : Error while trying to load definition for system cffi from pathname /home/testgrid/cl-test-grid/work-dir/agent/quicklisp/dists/quicklisp/software/cffi_0.17.1/cffi.asd: error while parsing arguments to DESTRUCTURING-BIND: invalid number of elements in (OPERATE 'TEST-OP :CFFI-TESTS) to satisfy lambda list (O C): exactly 2 expected, but 3 found
(LOAD cffi-toolchain FAIL) ASDF:LOAD-SYSTEM-DEFINITION-ERROR : Error while trying to load definition for system cffi-toolchain from pathname /home/testgrid/cl-test-grid/work-dir/agent/quicklisp/dists/quicklisp/software/cffi_0.17.1/cffi-toolchain.asd: CFFI-toolchain requires ASDF 3.1!
(LOAD cffi-tests FAIL) ASDF:LOAD-SYSTEM-DEFINITION-ERROR : Error while trying to load definition for system cffi-tests from pathname /home/testgrid/cl-test-grid/work-dir/agent/quicklisp/dists/quicklisp/software/cffi_0.17.1/cffi-tests.asd: Error while trying to load definition for system cffi-toolchain from pathname /home/testgrid/cl-test-grid/work-dir/agent/quicklisp/dists/quicklisp/software/cffi_0.17.1/cffi-toolchain.asd: CFFI-toolchain requires ASDF 3.1!
(LOAD cffi-libffi FAIL) ASDF:LOAD-SYSTEM-DEFINITION-ERROR : Error while trying to load definition for system cffi-libffi from pathname /home/testgrid/cl-test-grid/work-dir/agent/quicklisp/dists/quicklisp/software/cffi_0.17.1/cffi-libffi.asd: Error while trying to load definition for system cffi-toolchain from pathname /home/testgrid/cl-test-grid/work-dir/agent/quicklisp/dists/quicklisp/software/cffi_0.17.1/cffi-toolchain.asd: CFFI-toolchain requires ASDF 3.1!
(LOAD cffi-grovel FAIL) ASDF:LOAD-SYSTEM-DEFINITION-ERROR : Error while trying to load definition for system cffi-toolchain from pathname /home/testgrid/cl-test-grid/work-dir/agent/quicklisp/dists/quicklisp/software/cffi_0.17.1/cffi-toolchain.asd: CFFI-toolchain requires ASDF 3.1!
(LOAD cffi-examples FAIL) ASDF:LOAD-SYSTEM-DEFINITION-ERROR : Error while trying to load definition for system cffi from pathname /home/testgrid/cl-test-grid/work-dir/agent/quicklisp/dists/quicklisp/software/cffi_0.17.1/cffi.asd: error while parsing arguments to DESTRUCTURING-BIND: invalid number of elements in (OPERATE 'TEST-OP :CFFI-TESTS) to satisfy lambda list (O C): exactly 2 expected, but 3 found
(LOAD cffi FAIL) ASDF:LOAD-SYSTEM-DEFINITION-ERROR : Error while trying to load definition for system cffi from pathname /home/testgrid/cl-test-grid/work-dir/agent/quicklisp/dists/quicklisp/software/cffi_0.17.1/cffi.asd: error while parsing arguments to DESTRUCTURING-BIND: invalid number of elements in (OPERATE 'TEST-OP :CFFI-TESTS) to satisfy lambda list (O C): exactly 2 expected, but 3 found
(WHOLE-TEST-SUITE FAIL) ASDF:LOAD-SYSTEM-DEFINITION-ERROR : Error while trying to load definition for system cffi from pathname /home/testgrid/cl-test-grid/work-dir/agent/quicklisp/dists/quicklisp/software/cffi_0.17.1/cffi.asd: error while parsing arguments to DESTRUCTURING-BIND: invalid number of elements in (OPERATE 'TEST-OP :CFFI-TESTS) to satisfy lambda list (O C): exactly 2 expected, but 3 found
(LOAD cffi-uffi-compat FAIL) ASDF:COMPILE-ERROR : Error while invoking #<COMPILE-OP (:VERBOSE NIL) {B4B1C99}> on #<CL-SOURCE-FILE "uiop" "image">
(LOAD cffi-tests FAIL) ASDF:LOAD-SYSTEM-DEFINITION-ERROR : Error while trying to load definition for system bordeaux-threads from pathname /home/testgrid/cl-test-grid/work-dir/agent/quicklisp/dists/quicklisp/software/bordeaux-threads-v0.8.4-git/bordeaux-threads.asd: READ error during COMPILE-FILE: Package UIOP does not exist. Line: 68, Column: 19, File-Position: 2835 Stream: #<SB-SYS:FD-STREAM for "file /home/testgrid/cl-test-grid/work-dir/agent/quicklisp/dists/quicklisp/software/bordeaux-threads-v0.8.4-git/bordeaux-threads.asd" {B35D2B9}>
(LOAD cffi-libffi FAIL) ASDF:LOAD-SYSTEM-DEFINITION-ERROR : Error while trying to load definition for system cffi-libffi from pathname /home/testgrid/cl-test-grid/work-dir/agent/quicklisp/dists/quicklisp/software/cffi_0.16.1/cffi-libffi.asd: Error while invoking #<COMPILE-OP NIL {B450C71}> on #<CL-SOURCE-FILE "uiop" "image">
(LOAD cffi-grovel FAIL) ASDF:COMPILE-ERROR : Error while invoking #<COMPILE-OP (:VERBOSE NIL) {B494C99}> on #<CL-SOURCE-FILE "uiop" "image">
(LOAD cffi-examples FAIL) ASDF:COMPILE-ERROR : Error while invoking #<COMPILE-OP (:VERBOSE NIL) {B48FC99}> on #<CL-SOURCE-FILE "uiop" "image">
(LOAD cffi FAIL) ASDF:COMPILE-ERROR : Error while invoking #<COMPILE-OP (:VERBOSE NIL) {B46BC99}> on #<CL-SOURCE-FILE "uiop" "image">
(WHOLE-TEST-SUITE FAIL) ASDF:COMPILE-ERROR : Error while invoking #<COMPILE-OP (:VERBOSE NIL) {CFDC211}> on #<CL-SOURCE-FILE "uiop" "image">
sbcl-1.1.11-linux-x86
(LOAD cffi-toolchain FAIL) ASDF/FIND-SYSTEM:LOAD-SYSTEM-DEFINITION-ERROR : Error while trying to load definition for system cffi-toolchain from pathname /home/testgrid/cl-test-grid/work-dir/agent/quicklisp/dists/quicklisp/software/cffi_0.17.1/cffi-toolchain.asd: CFFI-toolchain requires ASDF 3.1!
(LOAD cffi-tests FAIL) ASDF/FIND-SYSTEM:LOAD-SYSTEM-DEFINITION-ERROR : Error while trying to load definition for system cffi-tests from pathname /home/testgrid/cl-test-grid/work-dir/agent/quicklisp/dists/quicklisp/software/cffi_0.17.1/cffi-tests.asd: Error while trying to load definition for system cffi-toolchain from pathname /home/testgrid/cl-test-grid/work-dir/agent/quicklisp/dists/quicklisp/software/cffi_0.17.1/cffi-toolchain.asd: CFFI-toolchain requires ASDF 3.1!
(LOAD cffi-libffi FAIL) ASDF/FIND-SYSTEM:LOAD-SYSTEM-DEFINITION-ERROR : Error while trying to load definition for system cffi-libffi from pathname /home/testgrid/cl-test-grid/work-dir/agent/quicklisp/dists/quicklisp/software/cffi_0.17.1/cffi-libffi.asd: Error while trying to load definition for system cffi-toolchain from pathname /home/testgrid/cl-test-grid/work-dir/agent/quicklisp/dists/quicklisp/software/cffi_0.17.1/cffi-toolchain.asd: CFFI-toolchain requires ASDF 3.1!
(LOAD cffi-grovel FAIL) ASDF/FIND-SYSTEM:LOAD-SYSTEM-DEFINITION-ERROR : Error while trying to load definition for system cffi-toolchain from pathname /home/testgrid/cl-test-grid/work-dir/agent/quicklisp/dists/quicklisp/software/cffi_0.17.1/cffi-toolchain.asd: CFFI-toolchain requires ASDF 3.1!
(WHOLE-TEST-SUITE FAIL) ASDF/FIND-SYSTEM:LOAD-SYSTEM-DEFINITION-ERROR : Error while trying to load definition for system cffi-tests from pathname /home/testgrid/cl-test-grid/work-dir/agent/quicklisp/dists/quicklisp/software/cffi_0.17.1/cffi-tests.asd: Error while trying to load definition for system cffi-toolchain from pathname /home/testgrid/cl-test-grid/work-dir/agent/quicklisp/dists/quicklisp/software/cffi_0.17.1/cffi-toolchain.asd: CFFI-toolchain requires ASDF 3.1!
(WHOLE-TEST-SUITE FAIL) SB-INT:SIMPLE-FILE-ERROR : Couldn't load #P"/home/testgrid/cl-test-grid/work-dir/agent/test-runs/20160216212151-sbcl-1.1.11-linux-x86/fasl/test-grid/work-dir/agent/quicklisp/dists/quicklisp/software/cffi_0.16.1/libffi/libffi-unix.fasl": file does not exist.
sbcl-1.1.16-linux-x86
(LOAD cffi-toolchain FAIL) ASDF/FIND-SYSTEM:LOAD-SYSTEM-DEFINITION-ERROR : Error while trying to load definition for system cffi-toolchain from pathname /home/testgrid/cl-test-grid/work-dir/agent/quicklisp/dists/quicklisp/software/cffi_0.17.1/cffi-toolchain.asd: CFFI-toolchain requires ASDF 3.1!
(LOAD cffi-tests FAIL) ASDF/FIND-SYSTEM:LOAD-SYSTEM-DEFINITION-ERROR : Error while trying to load definition for system cffi-tests from pathname /home/testgrid/cl-test-grid/work-dir/agent/quicklisp/dists/quicklisp/software/cffi_0.17.1/cffi-tests.asd: Error while trying to load definition for system cffi-toolchain from pathname /home/testgrid/cl-test-grid/work-dir/agent/quicklisp/dists/quicklisp/software/cffi_0.17.1/cffi-toolchain.asd: CFFI-toolchain requires ASDF 3.1!
(LOAD cffi-libffi FAIL) ASDF/FIND-SYSTEM:LOAD-SYSTEM-DEFINITION-ERROR : Error while trying to load definition for system cffi-libffi from pathname /home/testgrid/cl-test-grid/work-dir/agent/quicklisp/dists/quicklisp/software/cffi_0.17.1/cffi-libffi.asd: Error while trying to load definition for system cffi-toolchain from pathname /home/testgrid/cl-test-grid/work-dir/agent/quicklisp/dists/quicklisp/software/cffi_0.17.1/cffi-toolchain.asd: CFFI-toolchain requires ASDF 3.1!
(LOAD cffi-grovel FAIL) ASDF/FIND-SYSTEM:LOAD-SYSTEM-DEFINITION-ERROR : Error while trying to load definition for system cffi-toolchain from pathname /home/testgrid/cl-test-grid/work-dir/agent/quicklisp/dists/quicklisp/software/cffi_0.17.1/cffi-toolchain.asd: CFFI-toolchain requires ASDF 3.1!
(WHOLE-TEST-SUITE FAIL) ASDF/FIND-SYSTEM:LOAD-SYSTEM-DEFINITION-ERROR : Error while trying to load definition for system cffi-tests from pathname /home/testgrid/cl-test-grid/work-dir/agent/quicklisp/dists/quicklisp/software/cffi_0.17.1/cffi-tests.asd: Error while trying to load definition for system cffi-toolchain from pathname /home/testgrid/cl-test-grid/work-dir/agent/quicklisp/dists/quicklisp/software/cffi_0.17.1/cffi-toolchain.asd: CFFI-toolchain requires ASDF 3.1!
(WHOLE-TEST-SUITE FAIL) SB-INT:SIMPLE-FILE-ERROR : Couldn't load #P"/home/testgrid/cl-test-grid/work-dir/agent/test-runs/20160216184032-sbcl-1.1.16-linux-x86/fasl/test-grid/work-dir/agent/quicklisp/dists/quicklisp/software/cffi_0.16.1/libffi/libffi-unix.fasl": file does not exist.
sbcl-1.2.14-linux-arm
(LOAD cffi-toolchain FAIL) UIOP/LISP-BUILD:COMPILE-FILE-ERROR : COMPILE-FILE-ERROR while compiling #<CL-SOURCE-FILE "cffi-toolchain" "toolchain" "c-toolchain">
(LOAD cffi-tests FAIL) ASDF/FIND-SYSTEM:LOAD-SYSTEM-DEFINITION-ERROR : Error while trying to load definition for system cffi-tests from pathname /home/testgrid/cl-test-grid/work-dir/agent/quicklisp/dists/quicklisp/software/cffi_0.17.1/cffi-tests.asd: COMPILE-FILE-ERROR while compiling #<CL-SOURCE-FILE "cffi-toolchain" "toolchain" "c-toolchain">
(LOAD cffi-libffi FAIL) ASDF/FIND-SYSTEM:LOAD-SYSTEM-DEFINITION-ERROR : Error while trying to load definition for system cffi-libffi from pathname /home/testgrid/cl-test-grid/work-dir/agent/quicklisp/dists/quicklisp/software/cffi_0.17.1/cffi-libffi.asd: COMPILE-FILE-ERROR while compiling #<CL-SOURCE-FILE "cffi-toolchain" "toolchain" "c-toolchain">
(LOAD cffi-grovel FAIL) UIOP/LISP-BUILD:COMPILE-FILE-ERROR : COMPILE-FILE-ERROR while compiling #<CL-SOURCE-FILE "cffi-toolchain" "toolchain" "c-toolchain">
(WHOLE-TEST-SUITE FAIL) ASDF/FIND-SYSTEM:LOAD-SYSTEM-DEFINITION-ERROR : Error while trying to load definition for system cffi-tests from pathname /home/testgrid/cl-test-grid/work-dir/agent/quicklisp/dists/quicklisp/software/cffi_0.17.1/cffi-tests.asd: COMPILE-FILE-ERROR while compiling #<CL-SOURCE-FILE "cffi-toolchain" "toolchain" "c-toolchain">
(LOAD cffi-tests FAIL) ffi-grovel, CFFI-GROVEL:GROVEL-ERROR : External process exited with code 1. Command was: "cc" "-marm" "-I/home/testgrid/cl-test-grid/work-dir/agent/quicklisp/dists/quicklisp/software/cffi_0.16.1/" "-o" "/home/testgrid/cl-test-grid/work-dir/agent/test-runs/20160214122543-sbcl-1.2.14-linux-arm/fasl/ql/dists/quicklisp/software/cffi_0.16.1/libffi/libffi-unix" "/home/testgrid/cl-test-grid/work-dir/agent/test-runs/20160214122543-sbcl-1.2.14-linux-arm/fasl/ql/dists/quicklisp/software/cffi_0.16.1/libffi/libffi-unix.c" Output was: /home/testgrid/cl-test-grid/work-dir/agent/test-runs/20160214122543-sbcl-1.2.14-linux-arm/fasl/ql/dists/quicklisp/software/cffi_0.16.1/libffi/libffi-unix.c: In function ‘main’: /home/testgrid/cl-test-grid/work-dir/agent/test-runs/20160214122543-sbcl-1.2.14-linux-arm/fasl/ql/dists/quicklisp/software/cffi_0.16.1/libffi/libffi-unix.c:82:41: error: ‘FFI_UNIX64’ undeclared (first use in this function) fprintf(output, "%"PRIiMAX, (intmax_t)FFI_UNIX64); ^ /home/testgrid/cl-test-grid/work-dir/agent/test-runs/20160214122543-sbcl-1.2.14-linux-arm/fasl/ql/dists/quicklisp/software/cffi_0.16.1/libffi/libffi-unix.c:82:41: note: each undeclared identifier is reported only once for each function it appears in In file included from /usr/include/string.h:32:0, from /home/testgrid/cl-test-grid/work-dir/agent/quicklisp/dists/quicklisp/software/cffi_0.16.1/grovel/common.h:4, from /home/testgrid/cl-test-grid/work-dir/agent/test-runs/20160214122543-sbcl-1.2.14-linux-arm/fasl/ql/dists/quicklisp/software/cffi_0.16.1/libffi/libffi-unix.c:9: /home/testgrid/cl-test-grid/work-dir/agent/test-runs/20160214122543-sbcl-1.2.14-linux-arm/fasl/ql/dists/quicklisp/software/cffi_0.16.1/libffi/libffi-unix.c:146:52: warning: format ‘%li’ expects argument of type ‘long int’, but argument 3 has type ‘unsigned int’ [-Wformat=] fprintf(output, " :offset %li)", offsetof(struct _ffi_type, size)); ^ /home/testgrid/cl-test-grid/work-dir/agent/test-runs/20160214122543-sbcl-1.2.14-linux-arm/fasl/ql/dists/quicklisp/software/cffi_0.16.1/libffi/libffi-unix.c:151:52: warning: format ‘%li’ expects argument of type ‘long int’, but argument 3 has type ‘unsigned int’ [-Wformat=] fprintf(output, " :offset %li)", offsetof(struct _ffi_type, alignment)); ^ /home/testgrid/cl-test-grid/work-dir/agent/test-runs/20160214122543-sbcl-1.2.14-linux-arm/fasl/ql/dists/quicklisp/software/cffi_0.16.1/libffi/libffi-unix.c:156:52: warning: format ‘%li’ expects argument of type ‘long int’, but argument 3 has type ‘unsigned int’ [-Wformat=] fprintf(output, " :offset %li)", offsetof(struct _ffi_type, type)); ^ /home/testgrid/cl-test-grid/work-dir/agent/test-runs/20160214122543-sbcl-1.2.14-linux-arm/fasl/ql/dists/quicklisp/software/cffi_0.16.1/libffi/libffi-unix.c:161:52: warning: format ‘%li’ expects argument of type ‘long int’, but argument 3 has type ‘unsigned int’ [-Wformat=] fprintf(output, " :offset %li)", offsetof(struct _ffi_type, elements)); ^
(LOAD cffi-libffi FAIL) ffi-grovel, CFFI-GROVEL:GROVEL-ERROR : External process exited with code 1. Command was: "cc" "-marm" "-I/home/testgrid/cl-test-grid/work-dir/agent/quicklisp/dists/quicklisp/software/cffi_0.16.1/" "-o" "/home/testgrid/cl-test-grid/work-dir/agent/test-runs/20160214122543-sbcl-1.2.14-linux-arm/fasl/ql/dists/quicklisp/software/cffi_0.16.1/libffi/libffi-unix" "/home/testgrid/cl-test-grid/work-dir/agent/test-runs/20160214122543-sbcl-1.2.14-linux-arm/fasl/ql/dists/quicklisp/software/cffi_0.16.1/libffi/libffi-unix.c" Output was: /home/testgrid/cl-test-grid/work-dir/agent/test-runs/20160214122543-sbcl-1.2.14-linux-arm/fasl/ql/dists/quicklisp/software/cffi_0.16.1/libffi/libffi-unix.c: In function ‘main’: /home/testgrid/cl-test-grid/work-dir/agent/test-runs/20160214122543-sbcl-1.2.14-linux-arm/fasl/ql/dists/quicklisp/software/cffi_0.16.1/libffi/libffi-unix.c:82:41: error: ‘FFI_UNIX64’ undeclared (first use in this function) fprintf(output, "%"PRIiMAX, (intmax_t)FFI_UNIX64); ^ /home/testgrid/cl-test-grid/work-dir/agent/test-runs/20160214122543-sbcl-1.2.14-linux-arm/fasl/ql/dists/quicklisp/software/cffi_0.16.1/libffi/libffi-unix.c:82:41: note: each undeclared identifier is reported only once for each function it appears in In file included from /usr/include/string.h:32:0, from /home/testgrid/cl-test-grid/work-dir/agent/quicklisp/dists/quicklisp/software/cffi_0.16.1/grovel/common.h:4, from /home/testgrid/cl-test-grid/work-dir/agent/test-runs/20160214122543-sbcl-1.2.14-linux-arm/fasl/ql/dists/quicklisp/software/cffi_0.16.1/libffi/libffi-unix.c:9: /home/testgrid/cl-test-grid/work-dir/agent/test-runs/20160214122543-sbcl-1.2.14-linux-arm/fasl/ql/dists/quicklisp/software/cffi_0.16.1/libffi/libffi-unix.c:146:52: warning: format ‘%li’ expects argument of type ‘long int’, but argument 3 has type ‘unsigned int’ [-Wformat=] fprintf(output, " :offset %li)", offsetof(struct _ffi_type, size)); ^ /home/testgrid/cl-test-grid/work-dir/agent/test-runs/20160214122543-sbcl-1.2.14-linux-arm/fasl/ql/dists/quicklisp/software/cffi_0.16.1/libffi/libffi-unix.c:151:52: warning: format ‘%li’ expects argument of type ‘long int’, but argument 3 has type ‘unsigned int’ [-Wformat=] fprintf(output, " :offset %li)", offsetof(struct _ffi_type, alignment)); ^ /home/testgrid/cl-test-grid/work-dir/agent/test-runs/20160214122543-sbcl-1.2.14-linux-arm/fasl/ql/dists/quicklisp/software/cffi_0.16.1/libffi/libffi-unix.c:156:52: warning: format ‘%li’ expects argument of type ‘long int’, but argument 3 has type ‘unsigned int’ [-Wformat=] fprintf(output, " :offset %li)", offsetof(struct _ffi_type, type)); ^ /home/testgrid/cl-test-grid/work-dir/agent/test-runs/20160214122543-sbcl-1.2.14-linux-arm/fasl/ql/dists/quicklisp/software/cffi_0.16.1/libffi/libffi-unix.c:161:52: warning: format ‘%li’ expects argument of type ‘long int’, but argument 3 has type ‘unsigned int’ [-Wformat=] fprintf(output, " :offset %li)", offsetof(struct _ffi_type, elements)); ^
(WHOLE-TEST-SUITE FAIL) ffi-grovel, CFFI-GROVEL:GROVEL-ERROR : External process exited with code 1. Command was: "cc" "-marm" "-I/home/testgrid/cl-test-grid/work-dir/agent/quicklisp/dists/quicklisp/software/cffi_0.16.1/" "-o" "/home/testgrid/cl-test-grid/work-dir/agent/test-runs/20160214122543-sbcl-1.2.14-linux-arm/fasl/test-grid/work-dir/agent/quicklisp/dists/quicklisp/software/cffi_0.16.1/libffi/libffi-unix" "/home/testgrid/cl-test-grid/work-dir/agent/test-runs/20160214122543-sbcl-1.2.14-linux-arm/fasl/test-grid/work-dir/agent/quicklisp/dists/quicklisp/software/cffi_0.16.1/libffi/libffi-unix.c" Output was: /home/testgrid/cl-test-grid/work-dir/agent/test-runs/20160214122543-sbcl-1.2.14-linux-arm/fasl/test-grid/work-dir/agent/quicklisp/dists/quicklisp/software/cffi_0.16.1/libffi/libffi-unix.c: In function ‘main’: /home/testgrid/cl-test-grid/work-dir/agent/test-runs/20160214122543-sbcl-1.2.14-linux-arm/fasl/test-grid/work-dir/agent/quicklisp/dists/quicklisp/software/cffi_0.16.1/libffi/libffi-unix.c:82:41: error: ‘FFI_UNIX64’ undeclared (first use in this function) fprintf(output, "%"PRIiMAX, (intmax_t)FFI_UNIX64); ^ /home/testgrid/cl-test-grid/work-dir/agent/test-runs/20160214122543-sbcl-1.2.14-linux-arm/fasl/test-grid/work-dir/agent/quicklisp/dists/quicklisp/software/cffi_0.16.1/libffi/libffi-unix.c:82:41: note: each undeclared identifier is reported only once for each function it appears in In file included from /usr/include/string.h:32:0, from /home/testgrid/cl-test-grid/work-dir/agent/quicklisp/dists/quicklisp/software/cffi_0.16.1/grovel/common.h:4, from /home/testgrid/cl-test-grid/work-dir/agent/test-runs/20160214122543-sbcl-1.2.14-linux-arm/fasl/test-grid/work-dir/agent/quicklisp/dists/quicklisp/software/cffi_0.16.1/libffi/libffi-unix.c:9: /home/testgrid/cl-test-grid/work-dir/agent/test-runs/20160214122543-sbcl-1.2.14-linux-arm/fasl/test-grid/work-dir/agent/quicklisp/dists/quicklisp/software/cffi_0.16.1/libffi/libffi-unix.c:146:52: warning: format ‘%li’ expects argument of type ‘long int’, but argument 3 has type ‘unsigned int’ [-Wformat=] fprintf(output, " :offset %li)", offsetof(struct _ffi_type, size)); ^ /home/testgrid/cl-test-grid/work-dir/agent/test-runs/20160214122543-sbcl-1.2.14-linux-arm/fasl/test-grid/work-dir/agent/quicklisp/dists/quicklisp/software/cffi_0.16.1/libffi/libffi-unix.c:151:52: warning: format ‘%li’ expects argument of type ‘long int’, but argument 3 has type ‘unsigned int’ [-Wformat=] fprintf(output, " :offset %li)", offsetof(struct _ffi_type, alignment)); ^ /home/testgrid/cl-test-grid/work-dir/agent/test-runs/20160214122543-sbcl-1.2.14-linux-arm/fasl/test-grid/work-dir/agent/quicklisp/dists/quicklisp/software/cffi_0.16.1/libffi/libffi-unix.c:156:52: warning: format ‘%li’ expects argument of type ‘long int’, but argument 3 has type ‘unsigned int’ [-Wformat=] fprintf(output, " :offset %li)", offsetof(struct _ffi_type, type)); ^ /home/testgrid/cl-test-grid/work-dir/agent/test-runs/20160214122543-sbcl-1.2.14-linux-arm/fasl/test-grid/work-dir/agent/quicklisp/dists/quicklisp/software/cffi_0.16.1/libffi/libffi-unix.c:161:52: warning: format ‘%li’ expects argument of type ‘long int’, but argument 3 has type ‘unsigned int’ [-Wformat=] fprintf(output, " :offset %li)", offsetof(struct _ffi_type, elements)); ^
sbcl-1.2.3-linux-x64
(LOAD cffi-toolchain FAIL) UIOP/LISP-BUILD:COMPILE-FILE-ERROR : COMPILE-FILE-ERROR while compiling #<CL-SOURCE-FILE "cffi-toolchain" "toolchain" "asdf-compat">
(LOAD cffi-tests FAIL) ASDF/FIND-SYSTEM:LOAD-SYSTEM-DEFINITION-ERROR : Error while trying to load definition for system cffi-tests from pathname /home/hijarian/systems/cl-test-grid/work-dir/agent/quicklisp/dists/quicklisp/software/cffi_0.17.1/cffi-tests.asd: COMPILE-FILE-ERROR while compiling #<CL-SOURCE-FILE "cffi-toolchain" "toolchain" "asdf-compat">
(LOAD cffi-libffi FAIL) ASDF/FIND-SYSTEM:LOAD-SYSTEM-DEFINITION-ERROR : Error while trying to load definition for system cffi-libffi from pathname /home/hijarian/systems/cl-test-grid/work-dir/agent/quicklisp/dists/quicklisp/software/cffi_0.17.1/cffi-libffi.asd: COMPILE-FILE-ERROR while compiling #<CL-SOURCE-FILE "cffi-toolchain" "toolchain" "asdf-compat">
(LOAD cffi-grovel FAIL) UIOP/LISP-BUILD:COMPILE-FILE-ERROR : COMPILE-FILE-ERROR while compiling #<CL-SOURCE-FILE "cffi-toolchain" "toolchain" "asdf-compat">
(WHOLE-TEST-SUITE FAIL) ASDF/FIND-SYSTEM:LOAD-SYSTEM-DEFINITION-ERROR : Error while trying to load definition for system cffi-tests from pathname /home/hijarian/systems/cl-test-grid/work-dir/agent/quicklisp/dists/quicklisp/software/cffi_0.17.1/cffi-tests.asd: COMPILE-FILE-ERROR while compiling #<CL-SOURCE-FILE "cffi-toolchain" "toolchain" "asdf-compat">
(WHOLE-TEST-SUITE FAIL) SB-INT:SIMPLE-FILE-ERROR : Couldn't load #P"/home/hijarian/systems/cl-test-grid/work-dir/agent/test-runs/20160309091525-sbcl-1.2.3-linux-x64/fasl/test-grid/work-dir/agent/quicklisp/dists/quicklisp/software/cffi_0.16.1/libffi/libffi-unix.fasl": file does not exist.
(WHOLE-TEST-SUITE FAIL) SB-INT:SIMPLE-FILE-ERROR : Couldn't load #P"/home/hijarian/systems/cl-test-grid/work-dir/agent/test-runs/20160306151126-sbcl-1.2.3-linux-x64/fasl/test-grid/work-dir/agent/quicklisp/dists/quicklisp/software/cffi_0.16.1/libffi/libffi-unix.fasl": file does not exist.
(WHOLE-TEST-SUITE FAIL) SB-INT:SIMPLE-FILE-ERROR : Couldn't load #P"/home/hijarian/systems/cl-test-grid/work-dir/agent/test-runs/20160215081554-sbcl-1.2.3-linux-x64/fasl/test-grid/work-dir/agent/quicklisp/dists/quicklisp/software/cffi_0.16.1/libffi/libffi-unix.fasl": file does not exist.
sbcl-1.2.6-linux-x86
(WHOLE-TEST-SUITE FAIL) SB-INT:SIMPLE-FILE-ERROR : Couldn't load #P"/home/testgrid/cl-test-grid/work-dir/agent/test-runs/20160213220313-sbcl-1.2.6-linux-x86/fasl/test-grid/work-dir/agent/quicklisp/dists/quicklisp/software/cffi_0.16.1/libffi/libffi-unix.fasl": file does not exist.
sbcl-1.3.2.92-4077405-macosx-x64
(WHOLE-TEST-SUITE FAIL) SB-INT:SIMPLE-FILE-ERROR : Couldn't load #P"/Users/testgrid/cl-test-grid/work-dir/agent/test-runs/20160220052250-sbcl-1.3.2.92-4077405-macosx-x64/fasl/test-grid/work-dir/agent/quicklisp/dists/quicklisp/software/cffi_0.16.1/libffi/libffi-unix.fasl": file does not exist.

Breakdown by testcases: for every failed testcase the lisp implmentations it fails on

 quicklisp 2016-03-18
(test-case callbacks.bff.1 known-fail)
(test-case callbacks.bff.2 known-fail)
(test-case callbacks.long-long unexpected-ok)
(test-case defcfun.bff.2 fail)
(test-case defcfun.noop known-fail)
(test-case defcfun.varargs.docstrings unexpected-ok)
(test-case foreign-alloc.10 fail)
(test-case foreign-globals.set.long-long unexpected-ok)
(test-case fsbv.makepair.1 known-fail)
(test-case fsbv.makepair.2 known-fail)
(test-case fsbv.wfo known-fail)
(test-case shareable-vector.1 unexpected-ok)
(test-case shareable-vector.2 unexpected-ok)
(test-case string.encoding.utf-16.basic unexpected-ok)
(test-case struct.alignment.3 fail)
(test-case struct.alignment.4 fail)
(test-case struct.alignment.5 fail)
(test-case struct.alignment.6 fail)
(test-case struct.alignment.7 fail)
(test-case struct.alignment.8 fail)

To reports overview

Generated at: 2016-04-17 01:15:38 GMT.