antik results collected by cl-test-grid

Results on the last two Quicklisp distributions

 quicklisp 2015-12-18quicklisp 2015-10-31
abcl-1.2.1-fasl42-linux-x86
(LOAD science-data FAIL) COMMON-LISP:SIMPLE-ERROR : Parameter G13616:G13615 not defined.
(LOAD physical-dimension FAIL) COMMON-LISP:SIMPLE-ERROR : Parameter G13616:G13615 not defined.
(LOAD antik FAIL) COMMON-LISP:SIMPLE-ERROR : Parameter G61813:G61812 not defined.
(LOAD antik FAIL) COMMON-LISP:SIMPLE-ERROR : Parameter G35908:G35907 not defined.
abcl-1.3.0-fasl42-linux-x86
(LOAD science-data FAIL) ASDF/FIND-SYSTEM:LOAD-SYSTEM-DEFINITION-ERROR : Error while trying to load definition for system chipz from pathname /home/testgrid/cl-test-grid/work-dir/agent/quicklisp/dists/quicklisp/software/chipz-20150505-git/chipz.asd: don't recognize component type :TXT-FILE
(LOAD physical-dimension FAIL) COMMON-LISP:SIMPLE-ERROR : Parameter G13649:G13648 not defined.
(LOAD antik FAIL) COMMON-LISP:SIMPLE-ERROR : Parameter G153320:G153319 not defined.
(LOAD antik FAIL) ASDF/FIND-SYSTEM:LOAD-SYSTEM-DEFINITION-ERROR : Error while trying to load definition for system chipz from pathname /home/testgrid/cl-test-grid/work-dir/agent/quicklisp/dists/quicklisp/software/chipz-20150505-git/chipz.asd: don't recognize component type :TXT-FILE
abcl-1.3.1-fasl42-linux-x86
(LOAD science-data FAIL) COMMON-LISP:SIMPLE-ERROR : Parameter G13649:G13648 not defined.
(LOAD physical-dimension FAIL) COMMON-LISP:SIMPLE-ERROR : Parameter G13649:G13648 not defined.
(LOAD antik FAIL) COMMON-LISP:SIMPLE-ERROR : Parameter G61810:G61809 not defined.
(LOAD antik FAIL) COMMON-LISP:SIMPLE-ERROR : Parameter G35935:G35934 not defined.
abcl-1.3.1-fasl42-macosx-x64
(LOAD antik FAIL) COMMON-LISP:FILE-ERROR : The file http does not exist.
abcl-1.3.2-fasl42-linux-x86
(LOAD science-data FAIL) COMMON-LISP:SIMPLE-ERROR : Parameter G13671:G13670 not defined.
(LOAD physical-dimension FAIL) COMMON-LISP:SIMPLE-ERROR : Parameter G13671:G13670 not defined.
(LOAD antik FAIL) COMMON-LISP:SIMPLE-ERROR : Parameter G61795:G61794 not defined.
(LOAD antik FAIL) COMMON-LISP:SIMPLE-ERROR : Parameter G35957:G35956 not defined.
ccl-1.10-r16196-f101-linux-arm
(LOAD antik FAIL) ASDF/FIND-SYSTEM:LOAD-SYSTEM-DEFINITION-ERROR : Error while trying to load definition for system gsll from pathname /home/testgrid/cl-test-grid/work-dir/agent/quicklisp/dists/quicklisp/software/gsll-master-6e6df93e-git/gsll.asd: External process exited with code 1. Command was: "cc" "-marm" "-I/home/testgrid/cl-test-grid/work-dir/agent/quicklisp/dists/quicklisp/software/cffi_0.16.1/" "-o" "/home/testgrid/cl-test-grid/work-dir/agent/test-runs/20151221221845-ccl-1.10-r16196-f101-linux-arm/fasl/ql/dists/quicklisp/software/cffi_0.16.1/libffi/libffi-unix" "/home/testgrid/cl-test-grid/work-dir/agent/test-runs/20151221221845-ccl-1.10-r16196-f101-linux-arm/fasl/ql/dists/quicklisp/software/cffi_0.16.1/libffi/libffi-unix.c" Output was: /home/testgrid/cl-test-grid/work-dir/agent/test-runs/20151221221845-ccl-1.10-r16196-f101-linux-arm/fasl/ql/dists/quicklisp/software/cffi_0.16.1/libffi/libffi-unix.c: In function ‘main’: /home/testgrid/cl-test-grid/work-dir/agent/test-runs/20151221221845-ccl-1.10-r16196-f101-linux-arm/fasl/ql/dists/quicklisp/software/cffi_0.16.1/libffi/libffi-unix.c:82:41: error: ‘FFI_UNIX64’ undeclared (first use in this function) fprintf(output, "%"PRIiMAX, (intmax_t)FFI_UNIX64); ^ /home/testgrid/cl-test-grid/work-dir/agent/test-runs/20151221221845-ccl-1.10-r16196-f101-linux-arm/fasl/ql/dists/quicklisp/software/cffi_0.16.1/libffi/libffi-unix.c:82:41: note: each undeclared identifier is reported only once for each function it appears in In file included from /usr/include/string.h:32:0, from /home/testgrid/cl-test-grid/work-dir/agent/quicklisp/dists/quicklisp/software/cffi_0.16.1/grovel/common.h:4, from /home/testgrid/cl-test-grid/work-dir/agent/test-runs/20151221221845-ccl-1.10-r16196-f101-linux-arm/fasl/ql/dists/quicklisp/software/cffi_0.16.1/libffi/libffi-unix.c:9: /home/testgrid/cl-test-grid/work-dir/agent/test-runs/20151221221845-ccl-1.10-r16196-f101-linux-arm/fasl/ql/dists/quicklisp/software/cffi_0.16.1/libffi/libffi-unix.c:146:52: warning: format ‘%li’ expects argument of type ‘long int’, but argument 3 has type ‘unsigned int’ [-Wformat=] fprintf(output, " :offset %li)", offsetof(struct _ffi_type, size)); ^ /home/testgrid/cl-test-grid/work-dir/agent/test-runs/20151221221845-ccl-1.10-r16196-f101-linux-arm/fasl/ql/dists/quicklisp/software/cffi_0.16.1/libffi/libffi-unix.c:151:52: warning: format ‘%li’ expects argument of type ‘long int’, but argument 3 has type ‘unsigned int’ [-Wformat=] fprintf(output, " :offset %li)", offsetof(struct _ffi_type, alignment)); ^ /home/testgrid/cl-test-grid/work-dir/agent/test-runs/20151221221845-ccl-1.10-r16196-f101-linux-arm/fasl/ql/dists/quicklisp/software/cffi_0.16.1/libffi/libffi-unix.c:156:52: warning: format ‘%li’ expects argument of type ‘long int’, but argument 3 has type ‘unsigned int’ [-Wformat=] fprintf(output, " :offset %li)", offsetof(struct _ffi_type, type)); ^ /home/testgrid/cl-test-grid/work-dir/agent/test-runs/20151221221845-ccl-1.10-r16196-f101-linux-arm/fasl/ql/dists/quicklisp/software/cffi_0.16.1/libffi/libffi-unix.c:161:52: warning: format ‘%li’ expects argument of type ‘long int’, but argument 3 has type ‘unsigned int’ [-Wformat=] fprintf(output, " :offset %li)", offsetof(struct _ffi_type, elements)); ^
ccl-1.10-r16196-f96-linux-x64
(LOAD antik FAIL) ffi-grovel, CFFI-GROVEL:GROVEL-ERROR : External process exited with code 1. Command was: "cc" "-m64" "-I/home/hijarian/systems/cl-test-grid/work-dir/agent/quicklisp/dists/quicklisp/software/cffi_0.16.1/" "-o" "/home/hijarian/systems/cl-test-grid/work-dir/agent/test-runs/20151220050834-ccl-1.10-r16196-f96-linux-x64/fasl/ql/dists/quicklisp/software/gsll-master-6e6df93e-git/init/libgsl-unix" "/home/hijarian/systems/cl-test-grid/work-dir/agent/test-runs/20151220050834-ccl-1.10-r16196-f96-linux-x64/fasl/ql/dists/quicklisp/software/gsll-master-6e6df93e-git/init/libgsl-unix.c" Output was: /home/hijarian/systems/cl-test-grid/work-dir/agent/test-runs/20151220050834-ccl-1.10-r16196-f96-linux-x64/fasl/ql/dists/quicklisp/software/gsll-master-6e6df93e-git/init/libgsl-unix.c:7:33: fatal error: gsl/gsl_integration.h: Нет такого файла или каталога #include <gsl/gsl_integration.h> ^ compilation terminated.
ccl-1.10-r16196-f96-linux-x86
(LOAD antik FAIL) ffi, CFFI:LOAD-FOREIGN-LIBRARY-ERROR : Unable to load any of the alternatives: ("libgslcblas.so.0" "libgslcblas.so")
ccl-1.10-r16196-f96-macosx-x86
ccl-1.10-r16393-f96-macosx-x64
ccl-1.11-r16635-f96-linux-x86
(LOAD antik FAIL) ffi, CFFI:LOAD-FOREIGN-LIBRARY-ERROR : Unable to load any of the alternatives: ("libgslcblas.so.0" "libgslcblas.so")
ccl-1.11-rc1-r16536-f101-linux-arm
(LOAD antik FAIL) ASDF/FIND-SYSTEM:LOAD-SYSTEM-DEFINITION-ERROR : Error while trying to load definition for system gsll from pathname /home/testgrid/cl-test-grid/work-dir/agent/quicklisp/dists/quicklisp/software/gsll-master-6e6df93e-git/gsll.asd: External process exited with code 1. Command was: "cc" "-marm" "-I/home/testgrid/cl-test-grid/work-dir/agent/quicklisp/dists/quicklisp/software/cffi_0.16.1/" "-o" "/home/testgrid/cl-test-grid/work-dir/agent/test-runs/20151224090851-ccl-1.11-rc1-r16536-f101-linux-arm/fasl/ql/dists/quicklisp/software/cffi_0.16.1/libffi/libffi-unix" "/home/testgrid/cl-test-grid/work-dir/agent/test-runs/20151224090851-ccl-1.11-rc1-r16536-f101-linux-arm/fasl/ql/dists/quicklisp/software/cffi_0.16.1/libffi/libffi-unix.c" Output was: /home/testgrid/cl-test-grid/work-dir/agent/test-runs/20151224090851-ccl-1.11-rc1-r16536-f101-linux-arm/fasl/ql/dists/quicklisp/software/cffi_0.16.1/libffi/libffi-unix.c: In function ‘main’: /home/testgrid/cl-test-grid/work-dir/agent/test-runs/20151224090851-ccl-1.11-rc1-r16536-f101-linux-arm/fasl/ql/dists/quicklisp/software/cffi_0.16.1/libffi/libffi-unix.c:82:41: error: ‘FFI_UNIX64’ undeclared (first use in this function) fprintf(output, "%"PRIiMAX, (intmax_t)FFI_UNIX64); ^ /home/testgrid/cl-test-grid/work-dir/agent/test-runs/20151224090851-ccl-1.11-rc1-r16536-f101-linux-arm/fasl/ql/dists/quicklisp/software/cffi_0.16.1/libffi/libffi-unix.c:82:41: note: each undeclared identifier is reported only once for each function it appears in In file included from /usr/include/string.h:32:0, from /home/testgrid/cl-test-grid/work-dir/agent/quicklisp/dists/quicklisp/software/cffi_0.16.1/grovel/common.h:4, from /home/testgrid/cl-test-grid/work-dir/agent/test-runs/20151224090851-ccl-1.11-rc1-r16536-f101-linux-arm/fasl/ql/dists/quicklisp/software/cffi_0.16.1/libffi/libffi-unix.c:9: /home/testgrid/cl-test-grid/work-dir/agent/test-runs/20151224090851-ccl-1.11-rc1-r16536-f101-linux-arm/fasl/ql/dists/quicklisp/software/cffi_0.16.1/libffi/libffi-unix.c:146:52: warning: format ‘%li’ expects argument of type ‘long int’, but argument 3 has type ‘unsigned int’ [-Wformat=] fprintf(output, " :offset %li)", offsetof(struct _ffi_type, size)); ^ /home/testgrid/cl-test-grid/work-dir/agent/test-runs/20151224090851-ccl-1.11-rc1-r16536-f101-linux-arm/fasl/ql/dists/quicklisp/software/cffi_0.16.1/libffi/libffi-unix.c:151:52: warning: format ‘%li’ expects argument of type ‘long int’, but argument 3 has type ‘unsigned int’ [-Wformat=] fprintf(output, " :offset %li)", offsetof(struct _ffi_type, alignment)); ^ /home/testgrid/cl-test-grid/work-dir/agent/test-runs/20151224090851-ccl-1.11-rc1-r16536-f101-linux-arm/fasl/ql/dists/quicklisp/software/cffi_0.16.1/libffi/libffi-unix.c:156:52: warning: format ‘%li’ expects argument of type ‘long int’, but argument 3 has type ‘unsigned int’ [-Wformat=] fprintf(output, " :offset %li)", offsetof(struct _ffi_type, type)); ^ /home/testgrid/cl-test-grid/work-dir/agent/test-runs/20151224090851-ccl-1.11-rc1-r16536-f101-linux-arm/fasl/ql/dists/quicklisp/software/cffi_0.16.1/libffi/libffi-unix.c:161:52: warning: format ‘%li’ expects argument of type ‘long int’, but argument 3 has type ‘unsigned int’ [-Wformat=] fprintf(output, " :offset %li)", offsetof(struct _ffi_type, elements)); ^
ccl-1.11-rc1-r16536-f96-linux-x86
(LOAD antik FAIL) ffi, CFFI:LOAD-FOREIGN-LIBRARY-ERROR : Unable to load any of the alternatives: ("libgslcblas.so.0" "libgslcblas.so")
ccl-1.11-rc1-r16536-f96-macosx-x86
ccl-1.11-rc1-r16540-f96-macosx-x64
(LOAD antik FAIL) COMMON-LISP:END-OF-FILE : Unexpected end of file on #<STRING-INPUT-STREAM #x302001E0057D>, near position 24, within " \"--libs\" "
(LOAD antik FAIL) COMMON-LISP:END-OF-FILE : Unexpected end of file on #<STRING-INPUT-STREAM #x302001E0057D>, near position 24, within " \"--libs\" "
ccl-1.11-rc1-r16542m-f101-linux-arm
(LOAD antik FAIL) ASDF/FIND-SYSTEM:LOAD-SYSTEM-DEFINITION-ERROR : Error while trying to load definition for system gsll from pathname /home/testgrid/cl-test-grid/work-dir/agent/quicklisp/dists/quicklisp/software/gsll-master-6e6df93e-git/gsll.asd: External process exited with code 1. Command was: "cc" "-marm" "-I/home/testgrid/cl-test-grid/work-dir/agent/quicklisp/dists/quicklisp/software/cffi_0.16.1/" "-o" "/home/testgrid/cl-test-grid/work-dir/agent/test-runs/20151229150230-ccl-1.11-rc1-r16542m-f101-linux-arm/fasl/ql/dists/quicklisp/software/cffi_0.16.1/libffi/libffi-unix" "/home/testgrid/cl-test-grid/work-dir/agent/test-runs/20151229150230-ccl-1.11-rc1-r16542m-f101-linux-arm/fasl/ql/dists/quicklisp/software/cffi_0.16.1/libffi/libffi-unix.c" Output was: /home/testgrid/cl-test-grid/work-dir/agent/test-runs/20151229150230-ccl-1.11-rc1-r16542m-f101-linux-arm/fasl/ql/dists/quicklisp/software/cffi_0.16.1/libffi/libffi-unix.c:7:17: fatal error: ffi.h: No such file or directory compilation terminated.
ccl-1.8-r15286m-f95-linux-x86
(LOAD science-data FAIL) ASDF:LOAD-SYSTEM-DEFINITION-ERROR : Error while trying to load definition for system drakma from pathname /home/testgrid/cl-test-grid/work-dir/agent/quicklisp/dists/quicklisp/software/drakma-2.0.2/drakma.asd: While compiling (PERFORM (T T)) : In the form ((LOAD-SYSTEM TEST-OP) (:DRAKMA-TEST (EQL #<SYSTEM "drakma">))), (LOAD-SYSTEM TEST-OP) is not a symbol or lambda expression.
(LOAD physical-dimension FAIL) ASDF:MISSING-DEPENDENCY-OF-VERSION : Component "asdf" does not match version 3.0, required by #<SYSTEM "fare-utils">
(LOAD foreign-array FAIL) ASDF:LOAD-SYSTEM-DEFINITION-ERROR : Error while trying to load definition for system foreign-array from pathname /home/testgrid/cl-test-grid/work-dir/agent/quicklisp/dists/quicklisp/software/antik-master-03507b1b-git/foreign-array.asd: Error while trying to load definition for system static-vectors from pathname /home/testgrid/cl-test-grid/work-dir/agent/quicklisp/dists/quicklisp/software/static-vectors-1.6/static-vectors.asd: You need ASDF >= 2.32 to load this system correctly.
(LOAD antik-base FAIL) needs newer ASDF, ASDF:LOAD-SYSTEM-DEFINITION-ERROR : Error while trying to load definition for system named-readtables from pathname /home/testgrid/cl-test-grid/work-dir/agent/quicklisp/dists/quicklisp/software/named-readtables-20150923-git/named-readtables.asd: :MAILTO is an invalid initarg to REINITIALIZE-INSTANCE for #<STANDARD-CLASS SYSTEM>. Valid initargs: (:NAME :VERSION :DESCRIPTION :LONG-DESCRIPTION :IN-ORDER-TO :DO-FIRST :PARENT :PATHNAME :AROUND-COMPILE :ENCODING :PROPERTIES :COMPONENTS :IF-COMPONENT-DEP-FAILS :DEFAULT-COMPONENT-CLASS :AUTHOR :MAINTAINER :LICENCE :LICENSE :SOURCE-FILE :DEFSYSTEM-DEPENDS-ON).
(LOAD antik FAIL) ASDF:LOAD-SYSTEM-DEFINITION-ERROR : Error while trying to load definition for system antik from pathname /home/testgrid/cl-test-grid/work-dir/agent/quicklisp/dists/quicklisp/software/antik-master-03507b1b-git/antik.asd: There is no package named "UIOP" .
(LOAD antik FAIL) ASDF:LOAD-SYSTEM-DEFINITION-ERROR : Error while trying to load definition for system antik from pathname /home/testgrid/cl-test-grid/work-dir/agent/quicklisp/dists/quicklisp/software/antik-master-b6c0fc62-git/antik.asd: Error while trying to load definition for system static-vectors from pathname /home/testgrid/cl-test-grid/work-dir/agent/quicklisp/dists/quicklisp/software/static-vectors-1.6/static-vectors.asd: You need ASDF >= 2.32 to load this system correctly.
ccl-1.8-r15286m-f97-linux-arm
(LOAD science-data FAIL) ASDF:LOAD-SYSTEM-DEFINITION-ERROR : Error while trying to load definition for system drakma from pathname /home/testgrid/cl-test-grid/work-dir/agent/quicklisp/dists/quicklisp/software/drakma-2.0.2/drakma.asd: While compiling (PERFORM (T T)) : In the form ((LOAD-SYSTEM TEST-OP) (:DRAKMA-TEST (EQL #<SYSTEM "drakma">))), (LOAD-SYSTEM TEST-OP) is not a symbol or lambda expression.
(LOAD physical-dimension FAIL) ASDF:MISSING-DEPENDENCY-OF-VERSION : Component "asdf" does not match version 3.0, required by #<SYSTEM "fare-utils">
(LOAD foreign-array FAIL) ASDF:LOAD-SYSTEM-DEFINITION-ERROR : Error while trying to load definition for system foreign-array from pathname /home/testgrid/cl-test-grid/work-dir/agent/quicklisp/dists/quicklisp/software/antik-master-03507b1b-git/foreign-array.asd: Error while trying to load definition for system static-vectors from pathname /home/testgrid/cl-test-grid/work-dir/agent/quicklisp/dists/quicklisp/software/static-vectors-1.6/static-vectors.asd: You need ASDF >= 2.32 to load this system correctly.
(LOAD antik-base FAIL) needs newer ASDF, ASDF:LOAD-SYSTEM-DEFINITION-ERROR : Error while trying to load definition for system named-readtables from pathname /home/testgrid/cl-test-grid/work-dir/agent/quicklisp/dists/quicklisp/software/named-readtables-20150923-git/named-readtables.asd: :MAILTO is an invalid initarg to REINITIALIZE-INSTANCE for #<STANDARD-CLASS SYSTEM>. Valid initargs: (:NAME :VERSION :DESCRIPTION :LONG-DESCRIPTION :IN-ORDER-TO :DO-FIRST :PARENT :PATHNAME :AROUND-COMPILE :ENCODING :PROPERTIES :COMPONENTS :IF-COMPONENT-DEP-FAILS :DEFAULT-COMPONENT-CLASS :AUTHOR :MAINTAINER :LICENCE :LICENSE :SOURCE-FILE :DEFSYSTEM-DEPENDS-ON).
(LOAD antik FAIL) ASDF:LOAD-SYSTEM-DEFINITION-ERROR : Error while trying to load definition for system antik from pathname /home/testgrid/cl-test-grid/work-dir/agent/quicklisp/dists/quicklisp/software/antik-master-03507b1b-git/antik.asd: There is no package named "UIOP" .
(LOAD science-data FAIL) ASDF:LOAD-SYSTEM-DEFINITION-ERROR : Error while trying to load definition for system drakma from pathname /home/testgrid/cl-test-grid/work-dir/agent/quicklisp/dists/quicklisp/software/drakma-2.0.2/drakma.asd: While compiling (PERFORM (T T)) : In the form ((LOAD-SYSTEM TEST-OP) (:DRAKMA-TEST (EQL #<SYSTEM "drakma">))), (LOAD-SYSTEM TEST-OP) is not a symbol or lambda expression.
(LOAD physical-dimension FAIL) ASDF:MISSING-DEPENDENCY-OF-VERSION : Component "asdf" does not match version 3.0, required by #<SYSTEM "fare-utils">
(LOAD foreign-array FAIL) ASDF:LOAD-SYSTEM-DEFINITION-ERROR : Error while trying to load definition for system foreign-array from pathname /home/testgrid/cl-test-grid/work-dir/agent/quicklisp/dists/quicklisp/software/antik-master-03507b1b-git/foreign-array.asd: Error while trying to load definition for system static-vectors from pathname /home/testgrid/cl-test-grid/work-dir/agent/quicklisp/dists/quicklisp/software/static-vectors-1.6/static-vectors.asd: You need ASDF >= 2.32 to load this system correctly.
(LOAD antik-base FAIL) needs newer ASDF, ASDF:LOAD-SYSTEM-DEFINITION-ERROR : Error while trying to load definition for system named-readtables from pathname /home/testgrid/cl-test-grid/work-dir/agent/quicklisp/dists/quicklisp/software/named-readtables-20150923-git/named-readtables.asd: :MAILTO is an invalid initarg to REINITIALIZE-INSTANCE for #<STANDARD-CLASS SYSTEM>. Valid initargs: (:NAME :VERSION :DESCRIPTION :LONG-DESCRIPTION :IN-ORDER-TO :DO-FIRST :PARENT :PATHNAME :AROUND-COMPILE :ENCODING :PROPERTIES :COMPONENTS :IF-COMPONENT-DEP-FAILS :DEFAULT-COMPONENT-CLASS :AUTHOR :MAINTAINER :LICENCE :LICENSE :SOURCE-FILE :DEFSYSTEM-DEPENDS-ON).
(LOAD antik FAIL) ASDF:LOAD-SYSTEM-DEFINITION-ERROR : Error while trying to load definition for system antik from pathname /home/testgrid/cl-test-grid/work-dir/agent/quicklisp/dists/quicklisp/software/antik-master-03507b1b-git/antik.asd: There is no package named "UIOP" .
(LOAD science-data FAIL) ASDF:LOAD-SYSTEM-DEFINITION-ERROR : Error while trying to load definition for system drakma from pathname /home/testgrid/cl-test-grid/work-dir/agent/quicklisp/dists/quicklisp/software/drakma-2.0.2/drakma.asd: While compiling (PERFORM (T T)) : In the form ((LOAD-SYSTEM TEST-OP) (:DRAKMA-TEST (EQL #<SYSTEM "drakma">))), (LOAD-SYSTEM TEST-OP) is not a symbol or lambda expression.
(LOAD physical-dimension FAIL) ASDF:MISSING-DEPENDENCY-OF-VERSION : Component "asdf" does not match version 3.0, required by #<SYSTEM "fare-utils">
(LOAD foreign-array FAIL) ASDF:LOAD-SYSTEM-DEFINITION-ERROR : Error while trying to load definition for system foreign-array from pathname /home/testgrid/cl-test-grid/work-dir/agent/quicklisp/dists/quicklisp/software/antik-master-03507b1b-git/foreign-array.asd: Error while trying to load definition for system static-vectors from pathname /home/testgrid/cl-test-grid/work-dir/agent/quicklisp/dists/quicklisp/software/static-vectors-1.6/static-vectors.asd: You need ASDF >= 2.32 to load this system correctly.
(LOAD antik-base FAIL) needs newer ASDF, ASDF:LOAD-SYSTEM-DEFINITION-ERROR : Error while trying to load definition for system named-readtables from pathname /home/testgrid/cl-test-grid/work-dir/agent/quicklisp/dists/quicklisp/software/named-readtables-20150923-git/named-readtables.asd: :MAILTO is an invalid initarg to REINITIALIZE-INSTANCE for #<STANDARD-CLASS SYSTEM>. Valid initargs: (:NAME :VERSION :DESCRIPTION :LONG-DESCRIPTION :IN-ORDER-TO :DO-FIRST :PARENT :PATHNAME :AROUND-COMPILE :ENCODING :PROPERTIES :COMPONENTS :IF-COMPONENT-DEP-FAILS :DEFAULT-COMPONENT-CLASS :AUTHOR :MAINTAINER :LICENCE :LICENSE :SOURCE-FILE :DEFSYSTEM-DEPENDS-ON).
(LOAD antik FAIL) ASDF:LOAD-SYSTEM-DEFINITION-ERROR : Error while trying to load definition for system antik from pathname /home/testgrid/cl-test-grid/work-dir/agent/quicklisp/dists/quicklisp/software/antik-master-03507b1b-git/antik.asd: There is no package named "UIOP" .
(LOAD antik FAIL) ASDF:LOAD-SYSTEM-DEFINITION-ERROR : Error while trying to load definition for system antik from pathname /home/testgrid/cl-test-grid/work-dir/agent/quicklisp/dists/quicklisp/software/antik-master-b6c0fc62-git/antik.asd: Error while trying to load definition for system static-vectors from pathname /home/testgrid/cl-test-grid/work-dir/agent/quicklisp/dists/quicklisp/software/static-vectors-1.6/static-vectors.asd: You need ASDF >= 2.32 to load this system correctly.
ccl-1.9-r15756-f96-linux-x86
(LOAD science-data FAIL) ASDF/FIND-COMPONENT:MISSING-DEPENDENCY-OF-VERSION : Component "asdf" does not match version 3.0, required by #<SYSTEM "fare-utils">
(LOAD physical-dimension FAIL) ASDF/FIND-COMPONENT:MISSING-DEPENDENCY-OF-VERSION : Component "asdf" does not match version 3.0, required by #<SYSTEM "fare-utils">
(LOAD antik FAIL) ASDF/FIND-COMPONENT:MISSING-DEPENDENCY-OF-VERSION : Component "asdf" does not match version 3.0, required by #<SYSTEM "fare-utils">
ccl-1.9-r15767-f99-linux-arm
(LOAD science-data FAIL) ASDF/FIND-COMPONENT:MISSING-DEPENDENCY-OF-VERSION : Component "asdf" does not match version 3.0, required by #<SYSTEM "fare-utils">
(LOAD physical-dimension FAIL) ASDF/FIND-COMPONENT:MISSING-DEPENDENCY-OF-VERSION : Component "asdf" does not match version 3.0, required by #<SYSTEM "fare-utils">
(LOAD antik FAIL) ASDF/FIND-SYSTEM:LOAD-SYSTEM-DEFINITION-ERROR : Error while trying to load definition for system gsll from pathname /home/testgrid/cl-test-grid/work-dir/agent/quicklisp/dists/quicklisp/software/gsll-master-6e6df93e-git/gsll.asd: External process exited with code 1. Command was: "cc" "-marm" "-I/home/testgrid/cl-test-grid/work-dir/agent/quicklisp/dists/quicklisp/software/cffi_0.16.1/" "-o" "/home/testgrid/cl-test-grid/work-dir/agent/test-runs/20151222132702-ccl-1.9-r15767-f99-linux-arm/fasl/ql/dists/quicklisp/software/cffi_0.16.1/libffi/libffi-unix" "/home/testgrid/cl-test-grid/work-dir/agent/test-runs/20151222132702-ccl-1.9-r15767-f99-linux-arm/fasl/ql/dists/quicklisp/software/cffi_0.16.1/libffi/libffi-unix.c" Output was: /home/testgrid/cl-test-grid/work-dir/agent/test-runs/20151222132702-ccl-1.9-r15767-f99-linux-arm/fasl/ql/dists/quicklisp/software/cffi_0.16.1/libffi/libffi-unix.c: In function ‘main’: /home/testgrid/cl-test-grid/work-dir/agent/test-runs/20151222132702-ccl-1.9-r15767-f99-linux-arm/fasl/ql/dists/quicklisp/software/cffi_0.16.1/libffi/libffi-unix.c:82:41: error: ‘FFI_UNIX64’ undeclared (first use in this function) fprintf(output, "%"PRIiMAX, (intmax_t)FFI_UNIX64); ^ /home/testgrid/cl-test-grid/work-dir/agent/test-runs/20151222132702-ccl-1.9-r15767-f99-linux-arm/fasl/ql/dists/quicklisp/software/cffi_0.16.1/libffi/libffi-unix.c:82:41: note: each undeclared identifier is reported only once for each function it appears in In file included from /usr/include/string.h:32:0, from /home/testgrid/cl-test-grid/work-dir/agent/quicklisp/dists/quicklisp/software/cffi_0.16.1/grovel/common.h:4, from /home/testgrid/cl-test-grid/work-dir/agent/test-runs/20151222132702-ccl-1.9-r15767-f99-linux-arm/fasl/ql/dists/quicklisp/software/cffi_0.16.1/libffi/libffi-unix.c:9: /home/testgrid/cl-test-grid/work-dir/agent/test-runs/20151222132702-ccl-1.9-r15767-f99-linux-arm/fasl/ql/dists/quicklisp/software/cffi_0.16.1/libffi/libffi-unix.c:146:52: warning: format ‘%li’ expects argument of type ‘long int’, but argument 3 has type ‘unsigned int’ [-Wformat=] fprintf(output, " :offset %li)", offsetof(struct _ffi_type, size)); ^ /home/testgrid/cl-test-grid/work-dir/agent/test-runs/20151222132702-ccl-1.9-r15767-f99-linux-arm/fasl/ql/dists/quicklisp/software/cffi_0.16.1/libffi/libffi-unix.c:151:52: warning: format ‘%li’ expects argument of type ‘long int’, but argument 3 has type ‘unsigned int’ [-Wformat=] fprintf(output, " :offset %li)", offsetof(struct _ffi_type, alignment)); ^ /home/testgrid/cl-test-grid/work-dir/agent/test-runs/20151222132702-ccl-1.9-r15767-f99-linux-arm/fasl/ql/dists/quicklisp/software/cffi_0.16.1/libffi/libffi-unix.c:156:52: warning: format ‘%li’ expects argument of type ‘long int’, but argument 3 has type ‘unsigned int’ [-Wformat=] fprintf(output, " :offset %li)", offsetof(struct _ffi_type, type)); ^ /home/testgrid/cl-test-grid/work-dir/agent/test-runs/20151222132702-ccl-1.9-r15767-f99-linux-arm/fasl/ql/dists/quicklisp/software/cffi_0.16.1/libffi/libffi-unix.c:161:52: warning: format ‘%li’ expects argument of type ‘long int’, but argument 3 has type ‘unsigned int’ [-Wformat=] fprintf(output, " :offset %li)", offsetof(struct _ffi_type, elements)); ^
clisp-2.49-unix-armv7l
(LOAD science-data FAIL) ASDF:LOAD-SYSTEM-DEFINITION-ERROR : Error while trying to load definition for system drakma from pathname /home/testgrid/cl-test-grid/work-dir/agent/quicklisp/dists/quicklisp/software/drakma-2.0.2/drakma.asd: SYSTEM::%EXPAND-FORM: (LOAD-SYSTEM TEST-OP) should be a lambda expression
(LOAD physical-dimension FAIL) ASDF:MISSING-DEPENDENCY-OF-VERSION : Component "asdf" does not match version 3.0, required by #<SYSTEM "fare-utils">
(LOAD foreign-array FAIL) needs newer ASDF, ASDF:LOAD-SYSTEM-DEFINITION-ERROR : Error while trying to load definition for system named-readtables from pathname /home/testgrid/cl-test-grid/work-dir/agent/quicklisp/dists/quicklisp/software/named-readtables-20150923-git/named-readtables.asd: REINITIALIZE-INSTANCE: illegal keyword/value pair :MAILTO, "mega@retes.hu" in argument list. The allowed keywords are (:NAME :VERSION :IN-ORDER-TO :DO-FIRST :PARENT :PATHNAME :AROUND-COMPILE :ENCODING :PROPERTIES :COMPONENTS :IF-COMPONENT-DEP-FAILS :DEFAULT-COMPONENT-CLASS :DESCRIPTION :LONG-DESCRIPTION :AUTHOR :MAINTAINER :LICENCE :LICENSE :SOURCE-FILE :DEFSYSTEM-DEPENDS-ON)
(LOAD antik-base FAIL) needs newer ASDF, ASDF:LOAD-SYSTEM-DEFINITION-ERROR : Error while trying to load definition for system named-readtables from pathname /home/testgrid/cl-test-grid/work-dir/agent/quicklisp/dists/quicklisp/software/named-readtables-20150923-git/named-readtables.asd: REINITIALIZE-INSTANCE: illegal keyword/value pair :MAILTO, "mega@retes.hu" in argument list. The allowed keywords are (:NAME :VERSION :IN-ORDER-TO :DO-FIRST :PARENT :PATHNAME :AROUND-COMPILE :ENCODING :PROPERTIES :COMPONENTS :IF-COMPONENT-DEP-FAILS :DEFAULT-COMPONENT-CLASS :DESCRIPTION :LONG-DESCRIPTION :AUTHOR :MAINTAINER :LICENCE :LICENSE :SOURCE-FILE :DEFSYSTEM-DEPENDS-ON)
(LOAD antik FAIL) ASDF:LOAD-SYSTEM-DEFINITION-ERROR : Error while trying to load definition for system antik from pathname /home/testgrid/cl-test-grid/work-dir/agent/quicklisp/dists/quicklisp/software/antik-master-03507b1b-git/antik.asd: READ from #<INPUT BUFFERED FILE-STREAM CHARACTER #P"/home/testgrid/cl-test-grid/work-dir/agent/quicklisp/dists/quicklisp/software/antik-master-03507b1b-git/antik.asd" @51>: there is no package with name "UIOP"
(LOAD antik FAIL) ASDF:LOAD-SYSTEM-DEFINITION-ERROR : Error while trying to load definition for system drakma from pathname /home/testgrid/cl-test-grid/work-dir/agent/quicklisp/dists/quicklisp/software/drakma-2.0.2/drakma.asd: SYSTEM::%EXPAND-FORM: (LOAD-SYSTEM TEST-OP) should be a lambda expression
clisp-2.49-unix-x86
(LOAD science-data FAIL) ASDF:LOAD-SYSTEM-DEFINITION-ERROR : Error while trying to load definition for system drakma from pathname /home/testgrid/cl-test-grid/work-dir/agent/quicklisp/dists/quicklisp/software/drakma-2.0.2/drakma.asd: SYSTEM::%EXPAND-FORM: (LOAD-SYSTEM TEST-OP) should be a lambda expression
(LOAD physical-dimension FAIL) ASDF:MISSING-DEPENDENCY-OF-VERSION : Component "asdf" does not match version 3.0, required by #<SYSTEM "fare-utils">
(LOAD foreign-array FAIL) needs newer ASDF, ASDF:LOAD-SYSTEM-DEFINITION-ERROR : Error while trying to load definition for system named-readtables from pathname /home/testgrid/cl-test-grid/work-dir/agent/quicklisp/dists/quicklisp/software/named-readtables-20150923-git/named-readtables.asd: REINITIALIZE-INSTANCE: illegal keyword/value pair :MAILTO, "mega@retes.hu" in argument list. The allowed keywords are (:NAME :VERSION :IN-ORDER-TO :DO-FIRST :PARENT :PATHNAME :AROUND-COMPILE :ENCODING :PROPERTIES :COMPONENTS :IF-COMPONENT-DEP-FAILS :DEFAULT-COMPONENT-CLASS :DESCRIPTION :LONG-DESCRIPTION :AUTHOR :MAINTAINER :LICENCE :LICENSE :SOURCE-FILE :DEFSYSTEM-DEPENDS-ON)
(LOAD antik-base FAIL) needs newer ASDF, ASDF:LOAD-SYSTEM-DEFINITION-ERROR : Error while trying to load definition for system named-readtables from pathname /home/testgrid/cl-test-grid/work-dir/agent/quicklisp/dists/quicklisp/software/named-readtables-20150923-git/named-readtables.asd: REINITIALIZE-INSTANCE: illegal keyword/value pair :MAILTO, "mega@retes.hu" in argument list. The allowed keywords are (:NAME :VERSION :IN-ORDER-TO :DO-FIRST :PARENT :PATHNAME :AROUND-COMPILE :ENCODING :PROPERTIES :COMPONENTS :IF-COMPONENT-DEP-FAILS :DEFAULT-COMPONENT-CLASS :DESCRIPTION :LONG-DESCRIPTION :AUTHOR :MAINTAINER :LICENCE :LICENSE :SOURCE-FILE :DEFSYSTEM-DEPENDS-ON)
(LOAD antik FAIL) ASDF:LOAD-SYSTEM-DEFINITION-ERROR : Error while trying to load definition for system antik from pathname /home/testgrid/cl-test-grid/work-dir/agent/quicklisp/dists/quicklisp/software/antik-master-03507b1b-git/antik.asd: READ from #<INPUT BUFFERED FILE-STREAM CHARACTER #P"/home/testgrid/cl-test-grid/work-dir/agent/quicklisp/dists/quicklisp/software/antik-master-03507b1b-git/antik.asd" @51>: there is no package with name "UIOP"
(LOAD antik FAIL) ASDF:LOAD-SYSTEM-DEFINITION-ERROR : Error while trying to load definition for system drakma from pathname /home/testgrid/cl-test-grid/work-dir/agent/quicklisp/dists/quicklisp/software/drakma-2.0.2/drakma.asd: SYSTEM::%EXPAND-FORM: (LOAD-SYSTEM TEST-OP) should be a lambda expression
cmu-snapshot-2013-04__20d_unicode_-linux-x86
(LOAD science-data FAIL) ASDF/FIND-COMPONENT:MISSING-DEPENDENCY-OF-VERSION : Component "asdf" does not match version 3.0, required by #<SYSTEM "fare-utils">
(LOAD physical-dimension FAIL) ASDF/FIND-COMPONENT:MISSING-DEPENDENCY-OF-VERSION : Component "asdf" does not match version 3.0, required by #<SYSTEM "fare-utils">
(LOAD foreign-array FAIL) C::COMPILER-ERROR : (during macroexpansion) Error in function LISP::ASSERT-ERROR: The assertion (OR (NULL OPTS) (EQ (POP TYPE-LIST) '&OPTIONAL)) failed.
(LOAD antik-base FAIL) C::COMPILER-ERROR : (during macroexpansion) Error in function LISP::ASSERT-ERROR: The assertion (OR (NULL OPTS) (EQ (POP TYPE-LIST) '&OPTIONAL)) failed.
(LOAD antik FAIL) ASDF/FIND-COMPONENT:MISSING-DEPENDENCY-OF-VERSION : Component "asdf" does not match version 3.0, required by #<SYSTEM "fare-utils">
(LOAD antik FAIL) C::COMPILER-ERROR : (during macroexpansion) Error in function FIND-PARAMETER: Parameter G2:G1 not defined.
cmu-snapshot-2014-01__20e_unicode_-linux-x86
(LOAD science-data FAIL) C::COMPILER-ERROR : (during macroexpansion) Error in function LISP::ASSERT-ERROR: The assertion (OR (NULL OPTS) (EQ (POP TYPE-LIST) '&OPTIONAL)) failed.
(LOAD physical-dimension FAIL) C::COMPILER-ERROR : (during macroexpansion) Error in function LISP::ASSERT-ERROR: The assertion (OR (NULL OPTS) (EQ (POP TYPE-LIST) '&OPTIONAL)) failed.
(LOAD foreign-array FAIL) C::COMPILER-ERROR : (during macroexpansion) Error in function LISP::ASSERT-ERROR: The assertion (OR (NULL OPTS) (EQ (POP TYPE-LIST) '&OPTIONAL)) failed.
(LOAD antik-base FAIL) C::COMPILER-ERROR : (during macroexpansion) Error in function LISP::ASSERT-ERROR: The assertion (OR (NULL OPTS) (EQ (POP TYPE-LIST) '&OPTIONAL)) failed.
(LOAD antik FAIL) C::COMPILER-ERROR : (during macroexpansion) Error in function LISP::ASSERT-ERROR: The assertion (OR (NULL OPTS) (EQ (POP TYPE-LIST) '&OPTIONAL)) failed.
(LOAD antik FAIL) COMMON-LISP:TYPE-ERROR : #
cmu-snapshot-2014-05-dirty__20e_unicode_-linux-x86
(LOAD science-data FAIL) C::COMPILER-ERROR : (during macroexpansion) Error in function LISP::ASSERT-ERROR: The assertion (OR (NULL OPTS) (EQ (POP TYPE-LIST) '&OPTIONAL)) failed.
(LOAD physical-dimension FAIL) C::COMPILER-ERROR : (during macroexpansion) Error in function LISP::ASSERT-ERROR: The assertion (OR (NULL OPTS) (EQ (POP TYPE-LIST) '&OPTIONAL)) failed.
(LOAD foreign-array FAIL) C::COMPILER-ERROR : (during macroexpansion) Error in function LISP::ASSERT-ERROR: The assertion (OR (NULL OPTS) (EQ (POP TYPE-LIST) '&OPTIONAL)) failed.
(LOAD antik-base FAIL) C::COMPILER-ERROR : (during macroexpansion) Error in function LISP::ASSERT-ERROR: The assertion (OR (NULL OPTS) (EQ (POP TYPE-LIST) '&OPTIONAL)) failed.
(LOAD antik FAIL) C::COMPILER-ERROR : (during macroexpansion) Error in function LISP::ASSERT-ERROR: The assertion (OR (NULL OPTS) (EQ (POP TYPE-LIST) '&OPTIONAL)) failed.
(LOAD antik FAIL) COMMON-LISP:TYPE-ERROR : #
cmu-snapshot-2014-12___20f_unicode_-linux-x86
(LOAD science-data FAIL) C::COMPILER-ERROR : (during macroexpansion) Error in function LISP::ASSERT-ERROR: The assertion (OR (NULL OPTS) (EQ (POP TYPE-LIST) '&OPTIONAL)) failed.
(LOAD physical-dimension FAIL) C::COMPILER-ERROR : (during macroexpansion) Error in function LISP::ASSERT-ERROR: The assertion (OR (NULL OPTS) (EQ (POP TYPE-LIST) '&OPTIONAL)) failed.
(LOAD foreign-array FAIL) C::COMPILER-ERROR : (during macroexpansion) Error in function LISP::ASSERT-ERROR: The assertion (OR (NULL OPTS) (EQ (POP TYPE-LIST) '&OPTIONAL)) failed.
(LOAD antik-base FAIL) C::COMPILER-ERROR : (during macroexpansion) Error in function LISP::ASSERT-ERROR: The assertion (OR (NULL OPTS) (EQ (POP TYPE-LIST) '&OPTIONAL)) failed.
(LOAD antik FAIL) C::COMPILER-ERROR : (during macroexpansion) Error in function LISP::ASSERT-ERROR: The assertion (OR (NULL OPTS) (EQ (POP TYPE-LIST) '&OPTIONAL)) failed.
(LOAD antik FAIL) C::COMPILER-ERROR : (during macroexpansion) Error in function FIND-PARAMETER: Parameter G2:G1 not defined.
ecl-13.5.1-44c86e08-macosx-x86-bytecode
(LOAD antik FAIL) ASDF/FIND-SYSTEM:LOAD-SYSTEM-DEFINITION-ERROR : Error while trying to load definition for system antik from pathname /Users/testgrid/cl-test-grid/work-dir/agent/quicklisp/dists/quicklisp/software/antik-master-b6c0fc62-git/antik.asd: Error while trying to load definition for system static-vectors from pathname /Users/testgrid/cl-test-grid/work-dir/agent/quicklisp/dists/quicklisp/software/static-vectors-1.6/static-vectors.asd: The variable C::*CC-FLAGS* is unbound.
ecl-13.5.1-44c86e08-macosx-x86-lisp-to-c
(LOAD antik FAIL) UIOP/LISP-BUILD:COMPILE-FILE-ERROR : COMPILE-FILE-ERROR while compiling #<cl-source-file "antik" "physical-quantities" "format-output">
ecl-13.5.1-unknown-linux-i686-bytecode
(LOAD science-data FAIL) ASDF/FIND-SYSTEM:LOAD-SYSTEM-DEFINITION-ERROR : Error while trying to load definition for system foreign-array from pathname /home/testgrid/cl-test-grid/work-dir/agent/quicklisp/dists/quicklisp/software/antik-master-03507b1b-git/foreign-array.asd: Error while trying to load definition for system static-vectors from pathname /home/testgrid/cl-test-grid/work-dir/agent/quicklisp/dists/quicklisp/software/static-vectors-1.6/static-vectors.asd: The variable C::*CC-FLAGS* is unbound.
(LOAD physical-dimension FAIL) ASDF/FIND-SYSTEM:LOAD-SYSTEM-DEFINITION-ERROR : Error while trying to load definition for system foreign-array from pathname /home/testgrid/cl-test-grid/work-dir/agent/quicklisp/dists/quicklisp/software/antik-master-03507b1b-git/foreign-array.asd: Error while trying to load definition for system static-vectors from pathname /home/testgrid/cl-test-grid/work-dir/agent/quicklisp/dists/quicklisp/software/static-vectors-1.6/static-vectors.asd: The variable C::*CC-FLAGS* is unbound.
(LOAD foreign-array FAIL) ASDF/FIND-SYSTEM:LOAD-SYSTEM-DEFINITION-ERROR : Error while trying to load definition for system foreign-array from pathname /home/testgrid/cl-test-grid/work-dir/agent/quicklisp/dists/quicklisp/software/antik-master-03507b1b-git/foreign-array.asd: Error while trying to load definition for system static-vectors from pathname /home/testgrid/cl-test-grid/work-dir/agent/quicklisp/dists/quicklisp/software/static-vectors-1.6/static-vectors.asd: The variable C::*CC-FLAGS* is unbound.
(LOAD antik FAIL) ASDF/FIND-SYSTEM:LOAD-SYSTEM-DEFINITION-ERROR : Error while trying to load definition for system gsll from pathname /home/testgrid/cl-test-grid/work-dir/agent/quicklisp/dists/quicklisp/software/gsll-master-6e6df93e-git/gsll.asd: Error while trying to load definition for system cffi-libffi from pathname /home/testgrid/cl-test-grid/work-dir/agent/quicklisp/dists/quicklisp/software/cffi_0.16.1/cffi-libffi.asd: The variable C::*CC-FLAGS* is unbound.
(LOAD antik FAIL) ASDF/FIND-SYSTEM:LOAD-SYSTEM-DEFINITION-ERROR : Error while trying to load definition for system antik from pathname /home/testgrid/cl-test-grid/work-dir/agent/quicklisp/dists/quicklisp/software/antik-master-b6c0fc62-git/antik.asd: Error while trying to load definition for system static-vectors from pathname /home/testgrid/cl-test-grid/work-dir/agent/quicklisp/dists/quicklisp/software/static-vectors-1.6/static-vectors.asd: The variable C::*CC-FLAGS* is unbound.
ecl-13.5.1-unknown-linux-i686-lisp-to-c
(LOAD science-data FAIL) ASDF/FIND-COMPONENT:MISSING-DEPENDENCY-OF-VERSION : Component "asdf" does not match version 3.0, required by #<system "fare-utils">
(LOAD physical-dimension FAIL) ASDF/FIND-COMPONENT:MISSING-DEPENDENCY-OF-VERSION : Component "asdf" does not match version 3.0, required by #<system "fare-utils">
(LOAD antik FAIL) ASDF/FIND-COMPONENT:MISSING-DEPENDENCY-OF-VERSION : Component "asdf" does not match version 3.0, required by #<system "fare-utils">
(LOAD antik FAIL) UIOP/LISP-BUILD:COMPILE-FILE-ERROR : COMPILE-FILE-ERROR while compiling #<cl-source-file "antik" "physical-quantities" "format-output">
ecl-15.2.21-ee989b97-linux-i686-bytecode
(LOAD science-data FAIL) ASDF/FIND-SYSTEM:LOAD-SYSTEM-DEFINITION-ERROR : Error while trying to load definition for system foreign-array from pathname /home/testgrid/cl-test-grid/work-dir/agent/quicklisp/dists/quicklisp/software/antik-master-03507b1b-git/foreign-array.asd: Error while trying to load definition for system static-vectors from pathname /home/testgrid/cl-test-grid/work-dir/agent/quicklisp/dists/quicklisp/software/static-vectors-1.6/static-vectors.asd: The variable C::*CC-FLAGS* is unbound.
(LOAD physical-dimension FAIL) ASDF/FIND-SYSTEM:LOAD-SYSTEM-DEFINITION-ERROR : Error while trying to load definition for system foreign-array from pathname /home/testgrid/cl-test-grid/work-dir/agent/quicklisp/dists/quicklisp/software/antik-master-03507b1b-git/foreign-array.asd: Error while trying to load definition for system static-vectors from pathname /home/testgrid/cl-test-grid/work-dir/agent/quicklisp/dists/quicklisp/software/static-vectors-1.6/static-vectors.asd: The variable C::*CC-FLAGS* is unbound.
(LOAD foreign-array FAIL) ASDF/FIND-SYSTEM:LOAD-SYSTEM-DEFINITION-ERROR : Error while trying to load definition for system foreign-array from pathname /home/testgrid/cl-test-grid/work-dir/agent/quicklisp/dists/quicklisp/software/antik-master-03507b1b-git/foreign-array.asd: Error while trying to load definition for system static-vectors from pathname /home/testgrid/cl-test-grid/work-dir/agent/quicklisp/dists/quicklisp/software/static-vectors-1.6/static-vectors.asd: The variable C::*CC-FLAGS* is unbound.
(LOAD antik FAIL) ASDF/FIND-SYSTEM:LOAD-SYSTEM-DEFINITION-ERROR : Error while trying to load definition for system foreign-array from pathname /home/testgrid/cl-test-grid/work-dir/agent/quicklisp/dists/quicklisp/software/antik-master-03507b1b-git/foreign-array.asd: Error while trying to load definition for system static-vectors from pathname /home/testgrid/cl-test-grid/work-dir/agent/quicklisp/dists/quicklisp/software/static-vectors-1.6/static-vectors.asd: The variable C::*CC-FLAGS* is unbound.
(LOAD antik FAIL) ASDF/FIND-SYSTEM:LOAD-SYSTEM-DEFINITION-ERROR : Error while trying to load definition for system antik from pathname /home/testgrid/cl-test-grid/work-dir/agent/quicklisp/dists/quicklisp/software/antik-master-b6c0fc62-git/antik.asd: Error while trying to load definition for system static-vectors from pathname /home/testgrid/cl-test-grid/work-dir/agent/quicklisp/dists/quicklisp/software/static-vectors-1.6/static-vectors.asd: The variable C::*CC-FLAGS* is unbound.
ecl-15.2.21-ee989b97-linux-i686-lisp-to-c
(LOAD science-data FAIL) SI::SIMPLE-PACKAGE-ERROR : Cannot export symbol TENTH from locked package #<"COMMON-LISP" package>.
(LOAD physical-dimension FAIL) SI::SIMPLE-PACKAGE-ERROR : Cannot export symbol TENTH from locked package #<"COMMON-LISP" package>.
(LOAD antik FAIL) SI::SIMPLE-PACKAGE-ERROR : Cannot export symbol TENTH from locked package #<"COMMON-LISP" package>.
(LOAD antik FAIL) UIOP/LISP-BUILD:COMPILE-FILE-ERROR : COMPILE-FILE-ERROR while compiling #<cl-source-file "antik" "physical-quantities" "format-output">
ecl-15.2.21-ee989b97-linux-x64-bytecode
(LOAD science-data FAIL) ASDF/FIND-SYSTEM:LOAD-SYSTEM-DEFINITION-ERROR : Error while trying to load definition for system foreign-array from pathname /home/hijarian/systems/cl-test-grid/work-dir/agent/quicklisp/dists/quicklisp/software/antik-master-03507b1b-git/foreign-array.asd: Error while trying to load definition for system static-vectors from pathname /home/hijarian/systems/cl-test-grid/work-dir/agent/quicklisp/dists/quicklisp/software/static-vectors-1.6/static-vectors.asd: The variable C::*CC-FLAGS* is unbound.
(LOAD physical-dimension FAIL) ASDF/FIND-SYSTEM:LOAD-SYSTEM-DEFINITION-ERROR : Error while trying to load definition for system foreign-array from pathname /home/hijarian/systems/cl-test-grid/work-dir/agent/quicklisp/dists/quicklisp/software/antik-master-03507b1b-git/foreign-array.asd: Error while trying to load definition for system static-vectors from pathname /home/hijarian/systems/cl-test-grid/work-dir/agent/quicklisp/dists/quicklisp/software/static-vectors-1.6/static-vectors.asd: The variable C::*CC-FLAGS* is unbound.
(LOAD foreign-array FAIL) ASDF/FIND-SYSTEM:LOAD-SYSTEM-DEFINITION-ERROR : Error while trying to load definition for system foreign-array from pathname /home/hijarian/systems/cl-test-grid/work-dir/agent/quicklisp/dists/quicklisp/software/antik-master-03507b1b-git/foreign-array.asd: Error while trying to load definition for system static-vectors from pathname /home/hijarian/systems/cl-test-grid/work-dir/agent/quicklisp/dists/quicklisp/software/static-vectors-1.6/static-vectors.asd: The variable C::*CC-FLAGS* is unbound.
(LOAD antik FAIL) ASDF/FIND-SYSTEM:LOAD-SYSTEM-DEFINITION-ERROR : Error while trying to load definition for system foreign-array from pathname /home/hijarian/systems/cl-test-grid/work-dir/agent/quicklisp/dists/quicklisp/software/antik-master-03507b1b-git/foreign-array.asd: Error while trying to load definition for system static-vectors from pathname /home/hijarian/systems/cl-test-grid/work-dir/agent/quicklisp/dists/quicklisp/software/static-vectors-1.6/static-vectors.asd: The variable C::*CC-FLAGS* is unbound.
(LOAD antik FAIL) ASDF/FIND-SYSTEM:LOAD-SYSTEM-DEFINITION-ERROR : Error while trying to load definition for system antik from pathname /home/hijarian/systems/cl-test-grid/work-dir/agent/quicklisp/dists/quicklisp/software/antik-master-b6c0fc62-git/antik.asd: Error while trying to load definition for system static-vectors from pathname /home/hijarian/systems/cl-test-grid/work-dir/agent/quicklisp/dists/quicklisp/software/static-vectors-1.6/static-vectors.asd: The variable C::*CC-FLAGS* is unbound.
ecl-15.2.21-ee989b97-linux-x64-lisp-to-c
(LOAD science-data FAIL) SI::SIMPLE-PACKAGE-ERROR : Cannot export symbol TENTH from locked package #<"COMMON-LISP" package>.
(LOAD physical-dimension FAIL) SI::SIMPLE-PACKAGE-ERROR : Cannot export symbol TENTH from locked package #<"COMMON-LISP" package>.
(LOAD antik FAIL) SI::SIMPLE-PACKAGE-ERROR : Cannot export symbol TENTH from locked package #<"COMMON-LISP" package>.
(LOAD antik FAIL) UIOP/LISP-BUILD:COMPILE-FILE-ERROR : COMPILE-FILE-ERROR while compiling #<cl-source-file "antik" "physical-quantities" "format-output">
ecl-16.0.0-98fc12d3-linux-i686-bytecode
(LOAD science-data FAIL) ASDF/FIND-SYSTEM:LOAD-SYSTEM-DEFINITION-ERROR : Error while trying to load definition for system foreign-array from pathname /home/testgrid/cl-test-grid/work-dir/agent/quicklisp/dists/quicklisp/software/antik-master-03507b1b-git/foreign-array.asd: Error while trying to load definition for system static-vectors from pathname /home/testgrid/cl-test-grid/work-dir/agent/quicklisp/dists/quicklisp/software/static-vectors-1.6/static-vectors.asd: The variable C::*CC-FLAGS* is unbound.
(LOAD physical-dimension FAIL) ASDF/FIND-SYSTEM:LOAD-SYSTEM-DEFINITION-ERROR : Error while trying to load definition for system foreign-array from pathname /home/testgrid/cl-test-grid/work-dir/agent/quicklisp/dists/quicklisp/software/antik-master-03507b1b-git/foreign-array.asd: Error while trying to load definition for system static-vectors from pathname /home/testgrid/cl-test-grid/work-dir/agent/quicklisp/dists/quicklisp/software/static-vectors-1.6/static-vectors.asd: The variable C::*CC-FLAGS* is unbound.
(LOAD foreign-array FAIL) ASDF/FIND-SYSTEM:LOAD-SYSTEM-DEFINITION-ERROR : Error while trying to load definition for system foreign-array from pathname /home/testgrid/cl-test-grid/work-dir/agent/quicklisp/dists/quicklisp/software/antik-master-03507b1b-git/foreign-array.asd: Error while trying to load definition for system static-vectors from pathname /home/testgrid/cl-test-grid/work-dir/agent/quicklisp/dists/quicklisp/software/static-vectors-1.6/static-vectors.asd: The variable C::*CC-FLAGS* is unbound.
(LOAD antik FAIL) ASDF/FIND-SYSTEM:LOAD-SYSTEM-DEFINITION-ERROR : Error while trying to load definition for system foreign-array from pathname /home/testgrid/cl-test-grid/work-dir/agent/quicklisp/dists/quicklisp/software/antik-master-03507b1b-git/foreign-array.asd: Error while trying to load definition for system static-vectors from pathname /home/testgrid/cl-test-grid/work-dir/agent/quicklisp/dists/quicklisp/software/static-vectors-1.6/static-vectors.asd: The variable C::*CC-FLAGS* is unbound.
(LOAD antik FAIL) ASDF/FIND-SYSTEM:LOAD-SYSTEM-DEFINITION-ERROR : Error while trying to load definition for system antik from pathname /home/testgrid/cl-test-grid/work-dir/agent/quicklisp/dists/quicklisp/software/antik-master-b6c0fc62-git/antik.asd: Error while trying to load definition for system static-vectors from pathname /home/testgrid/cl-test-grid/work-dir/agent/quicklisp/dists/quicklisp/software/static-vectors-1.6/static-vectors.asd: The variable C::*CC-FLAGS* is unbound.
ecl-16.0.0-98fc12d3-linux-i686-lisp-to-c
(LOAD science-data FAIL) SI::SIMPLE-PACKAGE-ERROR : Cannot export symbol TENTH from locked package #<"COMMON-LISP" package>.
(LOAD physical-dimension FAIL) SI::SIMPLE-PACKAGE-ERROR : Cannot export symbol TENTH from locked package #<"COMMON-LISP" package>.
(LOAD antik FAIL) SI::SIMPLE-PACKAGE-ERROR : Cannot export symbol TENTH from locked package #<"COMMON-LISP" package>.
(LOAD antik FAIL) UIOP/LISP-BUILD:COMPILE-FILE-ERROR : COMPILE-FILE-ERROR while compiling #<cl-source-file "antik" "physical-quantities" "format-output">
ecl-16.1.2-093ba0ab-linux-x64-bytecode
(LOAD science-data FAIL) SI::SIMPLE-PACKAGE-ERROR : Cannot export symbol TENTH from locked package #<"COMMON-LISP" package>.
(LOAD physical-dimension FAIL) SI::SIMPLE-PACKAGE-ERROR : Cannot export symbol TENTH from locked package #<"COMMON-LISP" package>.
(LOAD antik FAIL) ASDF/FIND-SYSTEM:LOAD-SYSTEM-DEFINITION-ERROR : Error while trying to load definition for system cffi-libffi from pathname /home/jack/quicklisp/local-projects/cl-test-grid/work-dir/agent/quicklisp/dists/quicklisp/software/cffi_0.16.1/cffi-libffi.asd: The variable C::*CC-FLAGS* is unbound.
ecl-16.1.2-093ba0ab-linux-x64-lisp-to-c
(LOAD science-data FAIL) SI::SIMPLE-PACKAGE-ERROR : Cannot export symbol TENTH from locked package #<"COMMON-LISP" package>.
(LOAD physical-dimension FAIL) SI::SIMPLE-PACKAGE-ERROR : Cannot export symbol TENTH from locked package #<"COMMON-LISP" package>.
(LOAD antik FAIL) UIOP/LISP-BUILD:COMPILE-FILE-ERROR : COMPILE-FILE-ERROR while compiling #<cl-source-file "gsll" "polynomial">
ecl-16.1.2-093ba0ab-linux-x86-bytecode
(LOAD science-data FAIL) SI::SIMPLE-PACKAGE-ERROR : Cannot export symbol TENTH from locked package #<"COMMON-LISP" package>.
(LOAD physical-dimension FAIL) SI::SIMPLE-PACKAGE-ERROR : Cannot export symbol TENTH from locked package #<"COMMON-LISP" package>.
(LOAD antik FAIL) ASDF/FIND-SYSTEM:LOAD-SYSTEM-DEFINITION-ERROR : Error while trying to load definition for system cffi-libffi from pathname /home/dk/Workspace/cl-test-grid/work-dir/agent/quicklisp/dists/quicklisp/software/cffi_0.16.1/cffi-libffi.asd: The variable C::*CC-FLAGS* is unbound.
ecl-16.1.2-093ba0ab-win-x86-bytecode
sbcl-1.0.58-linux-x86
(LOAD science-data FAIL) ASDF:LOAD-SYSTEM-DEFINITION-ERROR : Error while trying to load definition for system drakma from pathname /home/testgrid/cl-test-grid/work-dir/agent/quicklisp/dists/quicklisp/software/drakma-2.0.2/drakma.asd: Illegal function call in method body: ((LOAD-SYSTEM TEST-OP) (:DRAKMA-TEST (EQL #<SYSTEM "drakma">)))
(LOAD physical-dimension FAIL) ASDF:MISSING-DEPENDENCY-OF-VERSION : Component "asdf" does not match version 3.0, required by #<SYSTEM "fare-utils">
(LOAD foreign-array FAIL) ASDF:LOAD-SYSTEM-DEFINITION-ERROR : Error while trying to load definition for system foreign-array from pathname /home/testgrid/cl-test-grid/work-dir/agent/quicklisp/dists/quicklisp/software/antik-master-03507b1b-git/foreign-array.asd: Error while trying to load definition for system static-vectors from pathname /home/testgrid/cl-test-grid/work-dir/agent/quicklisp/dists/quicklisp/software/static-vectors-1.6/static-vectors.asd: READ error during COMPILE-FILE: You need ASDF >= 2.32 to load this system correctly. (in form starting at line: 1, column: 0, file-position: 0)
(LOAD antik-base FAIL) ASDF:LOAD-SYSTEM-DEFINITION-ERROR : Error while trying to load definition for system named-readtables from pathname /home/testgrid/cl-test-grid/work-dir/agent/quicklisp/dists/quicklisp/software/named-readtables-20150923-git/named-readtables.asd: READ error during COMPILE-FILE: :ASCII stream decoding error on #<SB-SYS:FD-STREAM for "file /home/testgrid/cl-test-grid/work-dir/agent/quicklisp/dists/quicklisp/software/named-readtables-20150923-git/named-readtables.asd" {B33A591}>: the octet sequence #(195) cannot be decoded. (in form starting at line: 11, column: 25, file-position: 286)
(LOAD antik FAIL) ASDF:LOAD-SYSTEM-DEFINITION-ERROR : Error while trying to load definition for system antik from pathname /home/testgrid/cl-test-grid/work-dir/agent/quicklisp/dists/quicklisp/software/antik-master-03507b1b-git/antik.asd: READ error during COMPILE-FILE: Package UIOP does not exist. Line: 51, Column: 22, File-Position: 1570 Stream: #<SB-SYS:FD-STREAM for "file /home/testgrid/cl-test-grid/work-dir/agent/quicklisp/dists/quicklisp/software/antik-master-03507b1b-git/antik.asd" {B068DD9}>
(LOAD antik FAIL) ASDF:LOAD-SYSTEM-DEFINITION-ERROR : Error while trying to load definition for system antik from pathname /home/testgrid/cl-test-grid/work-dir/agent/quicklisp/dists/quicklisp/software/antik-master-b6c0fc62-git/antik.asd: Error while trying to load definition for system static-vectors from pathname /home/testgrid/cl-test-grid/work-dir/agent/quicklisp/dists/quicklisp/software/static-vectors-1.6/static-vectors.asd: READ error during COMPILE-FILE: You need ASDF >= 2.32 to load this system correctly. (in form starting at line: 1, column: 0, file-position: 0)
sbcl-1.1.11-linux-x86
(LOAD science-data FAIL) COMMON-LISP:SIMPLE-ERROR : The dispatch character #\# already exists.
(LOAD physical-dimension FAIL) COMMON-LISP:SIMPLE-ERROR : The dispatch character #\# already exists.
(LOAD foreign-array FAIL) COMMON-LISP:SIMPLE-ERROR : The dispatch character #\# already exists.
(LOAD antik-base FAIL) COMMON-LISP:SIMPLE-ERROR : The dispatch character #\# already exists.
(LOAD antik FAIL) COMMON-LISP:SIMPLE-ERROR : The dispatch character #\# already exists.
sbcl-1.1.16-linux-x86
(LOAD science-data FAIL) COMMON-LISP:SIMPLE-ERROR : The dispatch character #\# already exists.
(LOAD physical-dimension FAIL) COMMON-LISP:SIMPLE-ERROR : The dispatch character #\# already exists.
(LOAD foreign-array FAIL) COMMON-LISP:SIMPLE-ERROR : The dispatch character #\# already exists.
(LOAD antik-base FAIL) COMMON-LISP:SIMPLE-ERROR : The dispatch character #\# already exists.
(LOAD antik FAIL) COMMON-LISP:SIMPLE-ERROR : The dispatch character #\# already exists.
sbcl-1.2.14-linux-arm
(LOAD antik FAIL) ASDF/FIND-SYSTEM:LOAD-SYSTEM-DEFINITION-ERROR : Error while trying to load definition for system gsll from pathname /home/testgrid/cl-test-grid/work-dir/agent/quicklisp/dists/quicklisp/software/gsll-master-6e6df93e-git/gsll.asd: External process exited with code 1. Command was: "cc" "-marm" "-I/home/testgrid/cl-test-grid/work-dir/agent/quicklisp/dists/quicklisp/software/cffi_0.16.1/" "-o" "/home/testgrid/cl-test-grid/work-dir/agent/test-runs/20160104153451-sbcl-1.2.14-linux-arm/fasl/ql/dists/quicklisp/software/cffi_0.16.1/libffi/libffi-unix" "/home/testgrid/cl-test-grid/work-dir/agent/test-runs/20160104153451-sbcl-1.2.14-linux-arm/fasl/ql/dists/quicklisp/software/cffi_0.16.1/libffi/libffi-unix.c" Output was: /home/testgrid/cl-test-grid/work-dir/agent/test-runs/20160104153451-sbcl-1.2.14-linux-arm/fasl/ql/dists/quicklisp/software/cffi_0.16.1/libffi/libffi-unix.c:7:17: fatal error: ffi.h: No such file or directory compilation terminated.
(LOAD antik FAIL) ASDF/FIND-SYSTEM:LOAD-SYSTEM-DEFINITION-ERROR : Error while trying to load definition for system gsll from pathname /home/testgrid/cl-test-grid/work-dir/agent/quicklisp/dists/quicklisp/software/gsll-master-6e6df93e-git/gsll.asd: External process exited with code 1. Command was: "cc" "-marm" "-I/home/testgrid/cl-test-grid/work-dir/agent/quicklisp/dists/quicklisp/software/cffi_0.16.1/" "-o" "/home/testgrid/cl-test-grid/work-dir/agent/test-runs/20151220100748-sbcl-1.2.14-linux-arm/fasl/ql/dists/quicklisp/software/cffi_0.16.1/libffi/libffi-unix" "/home/testgrid/cl-test-grid/work-dir/agent/test-runs/20151220100748-sbcl-1.2.14-linux-arm/fasl/ql/dists/quicklisp/software/cffi_0.16.1/libffi/libffi-unix.c" Output was: /home/testgrid/cl-test-grid/work-dir/agent/test-runs/20151220100748-sbcl-1.2.14-linux-arm/fasl/ql/dists/quicklisp/software/cffi_0.16.1/libffi/libffi-unix.c: In function ‘main’: /home/testgrid/cl-test-grid/work-dir/agent/test-runs/20151220100748-sbcl-1.2.14-linux-arm/fasl/ql/dists/quicklisp/software/cffi_0.16.1/libffi/libffi-unix.c:82:41: error: ‘FFI_UNIX64’ undeclared (first use in this function) fprintf(output, "%"PRIiMAX, (intmax_t)FFI_UNIX64); ^ /home/testgrid/cl-test-grid/work-dir/agent/test-runs/20151220100748-sbcl-1.2.14-linux-arm/fasl/ql/dists/quicklisp/software/cffi_0.16.1/libffi/libffi-unix.c:82:41: note: each undeclared identifier is reported only once for each function it appears in In file included from /usr/include/string.h:32:0, from /home/testgrid/cl-test-grid/work-dir/agent/quicklisp/dists/quicklisp/software/cffi_0.16.1/grovel/common.h:4, from /home/testgrid/cl-test-grid/work-dir/agent/test-runs/20151220100748-sbcl-1.2.14-linux-arm/fasl/ql/dists/quicklisp/software/cffi_0.16.1/libffi/libffi-unix.c:9: /home/testgrid/cl-test-grid/work-dir/agent/test-runs/20151220100748-sbcl-1.2.14-linux-arm/fasl/ql/dists/quicklisp/software/cffi_0.16.1/libffi/libffi-unix.c:146:52: warning: format ‘%li’ expects argument of type ‘long int’, but argument 3 has type ‘unsigned int’ [-Wformat=] fprintf(output, " :offset %li)", offsetof(struct _ffi_type, size)); ^ /home/testgrid/cl-test-grid/work-dir/agent/test-runs/20151220100748-sbcl-1.2.14-linux-arm/fasl/ql/dists/quicklisp/software/cffi_0.16.1/libffi/libffi-unix.c:151:52: warning: format ‘%li’ expects argument of type ‘long int’, but argument 3 has type ‘unsigned int’ [-Wformat=] fprintf(output, " :offset %li)", offsetof(struct _ffi_type, alignment)); ^ /home/testgrid/cl-test-grid/work-dir/agent/test-runs/20151220100748-sbcl-1.2.14-linux-arm/fasl/ql/dists/quicklisp/software/cffi_0.16.1/libffi/libffi-unix.c:156:52: warning: format ‘%li’ expects argument of type ‘long int’, but argument 3 has type ‘unsigned int’ [-Wformat=] fprintf(output, " :offset %li)", offsetof(struct _ffi_type, type)); ^ /home/testgrid/cl-test-grid/work-dir/agent/test-runs/20151220100748-sbcl-1.2.14-linux-arm/fasl/ql/dists/quicklisp/software/cffi_0.16.1/libffi/libffi-unix.c:161:52: warning: format ‘%li’ expects argument of type ‘long int’, but argument 3 has type ‘unsigned int’ [-Wformat=] fprintf(output, " :offset %li)", offsetof(struct _ffi_type, elements)); ^
sbcl-1.2.3-linux-x64
(LOAD antik FAIL) ffi-grovel, CFFI-GROVEL:GROVEL-ERROR : External process exited with code 1. Command was: "cc" "-m64" "-I/home/hijarian/systems/cl-test-grid/work-dir/agent/quicklisp/dists/quicklisp/software/cffi_0.16.1/" "-o" "/home/hijarian/systems/cl-test-grid/work-dir/agent/test-runs/20151220080801-sbcl-1.2.3-linux-x64/fasl/ql/dists/quicklisp/software/gsll-master-6e6df93e-git/init/libgsl-unix" "/home/hijarian/systems/cl-test-grid/work-dir/agent/test-runs/20151220080801-sbcl-1.2.3-linux-x64/fasl/ql/dists/quicklisp/software/gsll-master-6e6df93e-git/init/libgsl-unix.c" Output was: /home/hijarian/systems/cl-test-grid/work-dir/agent/test-runs/20151220080801-sbcl-1.2.3-linux-x64/fasl/ql/dists/quicklisp/software/gsll-master-6e6df93e-git/init/libgsl-unix.c:7:33: fatal error: gsl/gsl_integration.h: Нет такого файла или каталога #include <gsl/gsl_integration.h> ^ compilation terminated.
sbcl-1.2.3.13-3446e1a-dirty-macosx-x64
sbcl-1.2.6-linux-x86
(LOAD antik FAIL) ffi, CFFI:LOAD-FOREIGN-LIBRARY-ERROR : Unable to load any of the alternatives: ("libgslcblas.so.0" "libgslcblas.so")

Breakdown by testcases: for every failed testcase the lisp implmentations it fails on

The library does not have a testsuite adapter for CL Test Grid.

To reports overview

Generated at: 2016-02-04 21:46:33 GMT.