/[cxml]/cxml/DOMTEST
ViewVC logotype

Log of /cxml/DOMTEST

Parent Directory Parent Directory | Revision Log Revision Log


Links to HEAD: (view) (annotate)
Sticky Tag:

Revision 1.33 - (view) (annotate) - [select for diffs]
Thu Dec 29 00:37:57 2005 UTC (8 years, 3 months ago) by dlichteblau
Branch: MAIN
CVS Tags: HEAD
Changes since 1.32: +822 -822 lines
Diff to previous 1.32
sb-unicode backport

Revision 1.32 - (view) (annotate) - [select for diffs]
Sun Dec 11 20:13:04 2005 UTC (8 years, 4 months ago) by dlichteblau
Branch: MAIN
Changes since 1.31: +1 -3 lines
Diff to previous 1.31
 755/808 nodenormalize01.xml
-TEST FAILED: NOT_SUPPORTED_ERR (9):
-No entity resolver registered.

Revision 1.31 - (view) (annotate) - [select for diffs]
Sun Dec 11 20:07:44 2005 UTC (8 years, 4 months ago) by dlichteblau
Branch: MAIN
Changes since 1.30: +1 -3 lines
Diff to previous 1.30
 687/808 importNode11.xml
-TEST FAILED: NOT_SUPPORTED_ERR (9):
-not implemented

Revision 1.30 - (view) (annotate) - [select for diffs]
Sun Dec 11 20:04:06 2005 UTC (8 years, 4 months ago) by dlichteblau
Branch: MAIN
Changes since 1.29: +1 -5 lines
Diff to previous 1.29
 782/808 removeAttributeNS02.xml
-TEST FAILED: There is no applicable method for the generic function
-               #<STANDARD-GENERIC-FUNCTION DOM:NAMESPACE-URI (2)>
-             when called with arguments
-               (NIL).

Revision 1.29 - (view) (annotate) - [select for diffs]
Sun Dec 11 19:54:56 2005 UTC (8 years, 4 months ago) by dlichteblau
Branch: MAIN
Changes since 1.28: +1 -2 lines
Diff to previous 1.28
 777/808 prefix09.xml
-TEST FAILED: expected exception NAMESPACE_ERR

Revision 1.28 - (view) (annotate) - [select for diffs]
Sun Dec 11 19:46:20 2005 UTC (8 years, 4 months ago) by dlichteblau
Branch: MAIN
Changes since 1.27: +1 -9 lines
Diff to previous 1.27
 756/808 nodesetprefix01.xml
-TEST FAILED: The assertion (DOMTEST::EQUALSP DOMTEST-TESTS::|elementTagName|
-                                             #(100 109 115 116 99 58 97 100 100
-                                               114 101 115 115)
-                                             'DOMTEST::%EQUAL) failed.
 757/808 nodesetprefix02.xml
-TEST FAILED: The assertion (DOMTEST::EQUALSP DOMTEST-TESTS::|newAttrName|
-                                             #(100 111 109 58 97 100 100 114
-                                               101 115 115)
-                                             'DOMTEST::%EQUAL) failed.

Revision 1.27 - (view) (annotate) - [select for diffs]
Sun Dec 11 19:38:09 2005 UTC (8 years, 4 months ago) by dlichteblau
Branch: MAIN
Changes since 1.26: +1 -5 lines
Diff to previous 1.26
tolles OO ist das.

 747/808 nodehasattributes02.xml
-TEST FAILED: There is no applicable method for the generic function
-               #<STANDARD-GENERIC-FUNCTION DOM:HAS-ATTRIBUTES (1)>
-             when called with arguments
-               (#<DOM-IMPL::DOCUMENT-TYPE {xxxxxxxx}>).

Revision 1.26 - (view) (annotate) - [select for diffs]
Sun Dec 11 19:35:05 2005 UTC (8 years, 4 months ago) by dlichteblau
Branch: MAIN
Changes since 1.25: +1 -2 lines
Diff to previous 1.25
 694/808 internalSubset01.xml
-TEST FAILED: The assertion (NULL DOMTEST-TESTS::|internal|) failed.

Revision 1.25 - (view) (annotate) - [select for diffs]
Sun Dec 11 19:27:59 2005 UTC (8 years, 4 months ago) by dlichteblau
Branch: MAIN
Changes since 1.24: +1 -6 lines
Diff to previous 1.24
importnode07 und namednodemapremovenameditemns02.xml geworkaroundet
*nichtueberzeugtsei*

Revision 1.24 - (view) (annotate) - [select for diffs]
Sun Dec 11 18:47:27 2005 UTC (8 years, 4 months ago) by dlichteblau
Branch: MAIN
Changes since 1.23: +1 -2 lines
Diff to previous 1.23
 674/808 hc_nodedocumentfragmentnormalize2.xml
-TEST FAILED: The assertion (NULL DOMTEST-TESTS::|txtNode|) failed.

Revision 1.23 - (view) (annotate) - [select for diffs]
Sun Dec 11 18:43:45 2005 UTC (8 years, 4 months ago) by dlichteblau
Branch: MAIN
Changes since 1.22: +1 -5 lines
Diff to previous 1.22
 639/808 getElementById01.xml
-TEST FAILED: There is no applicable method for the generic function
-               #<STANDARD-GENERIC-FUNCTION DOM:TAG-NAME (1)>
-             when called with arguments
-               (NIL).

Revision 1.22 - (view) (annotate) - [select for diffs]
Sun Dec 11 18:36:13 2005 UTC (8 years, 4 months ago) by dlichteblau
Branch: MAIN
Changes since 1.21: +1 -6 lines
Diff to previous 1.21
 731/808 namednodemapsetnameditemns06.xml
-TEST FAILED: expected exception INUSE_ATTRIBUTE_ERR
 732/808 namednodemapsetnameditemns07.xml
-TEST FAILED: expected exception INUSE_ATTRIBUTE_ERR
 733/808 namednodemapsetnameditemns08.xml
-TEST FAILED: expected exception INUSE_ATTRIBUTE_ERR
 800/808 setNamedItemNS01.xml
-TEST FAILED: expected exception INUSE_ATTRIBUTE_ERR

Revision 1.21 - (view) (annotate) - [select for diffs]
Sun Dec 11 18:30:45 2005 UTC (8 years, 4 months ago) by dlichteblau
Branch: MAIN
Changes since 1.20: +1 -4 lines
Diff to previous 1.20
 600/808 domimplementationfeaturecore.xml
-TEST FAILED: The assertion DOMTEST-TESTS::|state| failed.
 601/808 domimplementationfeaturexmlversion2.xml
-TEST FAILED: The assertion DOMTEST-TESTS::|state| failed.
 602/808 domimplementationhasfeature01.xml
-TEST FAILED: The assertion DOMTEST-TESTS::|success| failed.

Revision 1.20 - (view) (annotate) - [select for diffs]
Sun Dec 11 18:17:30 2005 UTC (8 years, 4 months ago) by dlichteblau
Branch: MAIN
Changes since 1.19: +1 -2 lines
Diff to previous 1.19
 586/808 documentimportnode19.xml
-TEST FAILED: The slot DOM-IMPL::NAME is unbound in the object #<DOM-IMPL::ENTIT
Y {xxxxxxxx}>.

Revision 1.19 - (view) (annotate) - [select for diffs]
Sun Dec 11 18:13:00 2005 UTC (8 years, 4 months ago) by dlichteblau
Branch: MAIN
Changes since 1.18: +1 -6 lines
Diff to previous 1.18
 582/808 documentimportnode14.xml
-TEST FAILED: The assertion (DOMTEST::EQUALSP DOMTEST-TESTS::|attrValue|
-                                             #(104 116 116 112 58 47 47 119 119
-                                               119 46 110 105 115 116 46 103
-                                               111 118)
-                                             'DOMTEST::%EQUAL) failed.

Revision 1.18 - (view) (annotate) - [select for diffs]
Sat Dec 10 20:06:02 2005 UTC (8 years, 4 months ago) by dlichteblau
Branch: MAIN
Changes since 1.17: +1 -6 lines
Diff to previous 1.17
keine version == egal

Revision 1.17 - (view) (annotate) - [select for diffs]
Sun Dec 4 23:26:47 2005 UTC (8 years, 4 months ago) by dlichteblau
Branch: MAIN
Changes since 1.16: +1 -26 lines
Diff to previous 1.16
nicht spezifizierte importe sollen NOT_SUPPORTED_ERR geben

Revision 1.16 - (view) (annotate) - [select for diffs]
Sun Dec 4 23:23:24 2005 UTC (8 years, 4 months ago) by dlichteblau
Branch: MAIN
Changes since 1.15: +1 -3 lines
Diff to previous 1.15
attributknotennamespace beim klonen mitnehmen

Revision 1.15 - (view) (annotate) - [select for diffs]
Sun Dec 4 23:20:22 2005 UTC (8 years, 4 months ago) by dlichteblau
Branch: MAIN
Changes since 1.14: +2 -7 lines
Diff to previous 1.14
auch qname "xmlns" hat einen namespace, falls sax:*sowieso* an ist.
und im dom-builder nicht den namen des doctypes pruefen

Revision 1.14 - (view) (annotate) - [select for diffs]
Sun Dec 4 22:57:30 2005 UTC (8 years, 4 months ago) by dlichteblau
Branch: MAIN
Changes since 1.13: +6 -16 lines
Diff to previous 1.13
dom murmel dom

Revision 1.13 - (view) (annotate) - [select for diffs]
Sun Dec 4 22:25:34 2005 UTC (8 years, 4 months ago) by dlichteblau
Branch: MAIN
Changes since 1.12: +1 -3 lines
Diff to previous 1.12
MORE WRONG_DOCUMENT_ERR

Revision 1.12 - (view) (annotate) - [select for diffs]
Sun Dec 4 22:22:29 2005 UTC (8 years, 4 months ago) by dlichteblau
Branch: MAIN
Changes since 1.11: +16 -28 lines
Diff to previous 1.11
praefix ohne uri ist verboten

Revision 1.11 - (view) (annotate) - [select for diffs]
Sun Dec 4 22:18:33 2005 UTC (8 years, 4 months ago) by dlichteblau
Branch: MAIN
Changes since 1.10: +16 -31 lines
Diff to previous 1.10
ohne prefix haben wir beim namespace-processing aber trotzdem einen lname

Revision 1.10 - (view) (annotate) - [select for diffs]
Sun Dec 4 21:44:06 2005 UTC (8 years, 4 months ago) by dlichteblau
Branch: MAIN
Changes since 1.9: +1 -2 lines
Diff to previous 1.9
(import-node attribute)

Revision 1.9 - (view) (annotate) - [select for diffs]
Sun Dec 4 21:41:13 2005 UTC (8 years, 4 months ago) by dlichteblau
Branch: MAIN
Changes since 1.8: +18 -172 lines
Diff to previous 1.8
uh oh.  (rod nil) => "NIL"

Revision 1.8 - (view) (annotate) - [select for diffs]
Sun Dec 4 21:22:47 2005 UTC (8 years, 4 months ago) by dlichteblau
Branch: MAIN
Changes since 1.7: +1 -2 lines
Diff to previous 1.7
 785/808 removeNamedItemNS03.xml
-TEST FAILED: expected exception NO_MODIFICATION_ALLOWED_ERR

Revision 1.7 - (view) (annotate) - [select for diffs]
Sun Dec 4 21:15:35 2005 UTC (8 years, 4 months ago) by dlichteblau
Branch: MAIN
Changes since 1.6: +10 -133 lines
Diff to previous 1.6
noch ne runde dom-fixes

Revision 1.6 - (view) (annotate) - [select for diffs]
Sun Dec 4 20:46:28 2005 UTC (8 years, 4 months ago) by dlichteblau
Branch: MAIN
Changes since 1.5: +4 -11 lines
Diff to previous 1.5
(setf dom:prefix) korrigiert

Revision 1.5 - (view) (annotate) - [select for diffs]
Sun Dec 4 20:35:13 2005 UTC (8 years, 4 months ago) by dlichteblau
Branch: MAIN
Changes since 1.4: +88 -85 lines
Diff to previous 1.4
am dom rumgeschraubt und sax-defaults geaendert
vielleicht teilweise verkehrt

Revision 1.4 - (view) (annotate) - [select for diffs]
Sun Dec 4 19:25:08 2005 UTC (8 years, 4 months ago) by dlichteblau
Branch: MAIN
Changes since 1.3: +405 -0 lines
Diff to previous 1.3
fehlermeldungen mitdribbeln

Revision 1.3 - (view) (annotate) - [select for diffs]
Sun Dec 4 19:19:16 2005 UTC (8 years, 4 months ago) by dlichteblau
Branch: MAIN
Changes since 1.2: +289 -1 lines
Diff to previous 1.2
rein mit den dom 2 tests

Revision 1.2 - (view) (annotate) - [select for diffs]
Sun Dec 4 18:43:49 2005 UTC (8 years, 4 months ago) by dlichteblau
Branch: MAIN
Changes since 1.1: +542 -540 lines
Diff to previous 1.1
DOM 2 Core.  Ungetestet, aber die 1er tests laufen wieder, daher rein damit.

Revision 1.1 - (view) (annotate) - [select for diffs]
Sat Nov 26 22:55:22 2005 UTC (8 years, 4 months ago) by dlichteblau
Branch: MAIN
run not-wf tests

This form allows you to request diffs between any two revisions of this file. For each of the two "sides" of the diff, select a symbolic revision name using the selection box, or choose 'Use Text Field' and enter a numeric revision.

  Diffs between and
  Type of Diff should be a

Sort log by:

  ViewVC Help
Powered by ViewVC 1.1.5