shuffletron results collected by cl-test-grid

Results on the last two Quicklisp distributions

 quicklisp 2014-09-14quicklisp 2014-08-26
abcl-1.2.0-fasl42-linux-x86
(LOAD shuffletron FAIL) ffi, CFFI:LOAD-FOREIGN-LIBRARY-ERROR : Unable to load any of the alternatives: ("libmixalot-mpg123.so.0" "libmpg123.so.0" "/usr/lib/libmpg123.so" "/usr/local/lib/libmpg123.so")
(LOAD shuffletron FAIL) ffi, CFFI:LOAD-FOREIGN-LIBRARY-ERROR : Unable to load any of the alternatives: ("libmixalot-mpg123.so.0" "libmpg123.so.0" "/usr/lib/libmpg123.so" "/usr/local/lib/libmpg123.so")
abcl-1.2.1-fasl42-linux-x86
(LOAD shuffletron FAIL) ffi, CFFI:LOAD-FOREIGN-LIBRARY-ERROR : Unable to load any of the alternatives: ("libmixalot-mpg123.so.0" "libmpg123.so.0" "/usr/lib/libmpg123.so" "/usr/local/lib/libmpg123.so")
(LOAD shuffletron FAIL) ffi, CFFI:LOAD-FOREIGN-LIBRARY-ERROR : Unable to load any of the alternatives: ("libmixalot-mpg123.so.0" "libmpg123.so.0" "/usr/lib/libmpg123.so" "/usr/local/lib/libmpg123.so")
abcl-1.2.1-fasl42-macosx-x64
(LOAD shuffletron FAIL) ffi, ASDF/FIND-SYSTEM:LOAD-SYSTEM-DEFINITION-ERROR : Error while trying to load definition for system osicat from pathname /Users/pnathan/cl-test-grid/work-dir/agent/quicklisp/dists/quicklisp/software/osicat-20140211-git/osicat.asd: Don't know how to COMMON-LISP:REQUIRE JNA.
(LOAD shuffletron FAIL) ffi, ASDF/FIND-SYSTEM:LOAD-SYSTEM-DEFINITION-ERROR : Error while trying to load definition for system osicat from pathname /Users/pnathan/cl-test-grid/work-dir/agent/quicklisp/dists/quicklisp/software/osicat-20140211-git/osicat.asd: Don't know how to COMMON-LISP:REQUIRE JNA.
abcl-1.3.0-fasl42-linux-x86
(LOAD shuffletron FAIL) ASDF/FIND-SYSTEM:LOAD-SYSTEM-DEFINITION-ERROR : Error while trying to load definition for system osicat from pathname /home/testgrid/cl-test-grid/work-dir/agent/quicklisp/dists/quicklisp/software/osicat-20140211-git/osicat.asd: don't recognize component type :GROVEL-FILE
(LOAD shuffletron FAIL) ASDF/FIND-SYSTEM:LOAD-SYSTEM-DEFINITION-ERROR : Error while trying to load definition for system osicat from pathname /home/testgrid/cl-test-grid/work-dir/agent/quicklisp/dists/quicklisp/software/osicat-20140211-git/osicat.asd: don't recognize component type :GROVEL-FILE
abcl-1.3.1-fasl42-linux-x86
(LOAD shuffletron FAIL) ffi, CFFI:LOAD-FOREIGN-LIBRARY-ERROR : Unable to load any of the alternatives: ("libmixalot-mpg123.so.0" "libmpg123.so.0" "/usr/lib/libmpg123.so" "/usr/local/lib/libmpg123.so")
(LOAD shuffletron FAIL) ffi, CFFI:LOAD-FOREIGN-LIBRARY-ERROR : Unable to load any of the alternatives: ("libmixalot-mpg123.so.0" "libmpg123.so.0" "/usr/lib/libmpg123.so" "/usr/local/lib/libmpg123.so")
ccl-1.10-f96-macosx-x86
(LOAD shuffletron FAIL) ffi, CFFI:LOAD-FOREIGN-LIBRARY-ERROR : Unable to load any of the alternatives: ("libao.4.dylib" "/opt/local/lib/libao.4.dylib")
ccl-1.10-rc1-r16192-f96-macosx-x86
(LOAD shuffletron FAIL) ffi, CFFI:LOAD-FOREIGN-LIBRARY-ERROR : Unable to load any of the alternatives: ("libao.4.dylib" "/opt/local/lib/libao.4.dylib")
ccl-1.8-r15286m-f95-linux-x86
(LOAD shuffletron FAIL) ffi-grovel, CFFI-GROVEL:GROVEL-ERROR : External process exited with code 1. Command was: "cc" "-m32" "-lFLAC" "-lm" "-I/home/testgrid/cl-test-grid/work-dir/agent/quicklisp/dists/quicklisp/software/cffi_0.13.0/" "-o" "/home/testgrid/cl-test-grid/work-dir/agent/test-runs/20140916134836-ccl-1.8-r15286m-f95-linux-x86/fasl/ql/dists/quicklisp/software/mixalot-20131111-git/flac-grovelling" "/home/testgrid/cl-test-grid/work-dir/agent/test-runs/20140916134836-ccl-1.8-r15286m-f95-linux-x86/fasl/ql/dists/quicklisp/software/mixalot-20131111-git/flac-grovelling.c" Output was: /home/testgrid/cl-test-grid/work-dir/agent/test-runs/20140916134836-ccl-1.8-r15286m-f95-linux-x86/fasl/ql/dists/quicklisp/software/mixalot-20131111-git/flac-grovelling.c:6:33: fatal error: FLAC/stream_decoder.h: No such file or directory compilation terminated.
(LOAD shuffletron FAIL) ffi-grovel, CFFI-GROVEL:GROVEL-ERROR : External process exited with code 1. Command was: "cc" "-m32" "-lFLAC" "-lm" "-I/home/testgrid/cl-test-grid/work-dir/agent/quicklisp/dists/quicklisp/software/cffi_0.13.0/" "-o" "/home/testgrid/cl-test-grid/work-dir/agent/test-runs/20140829155837-ccl-1.8-f95-linux-x86/fasl/ql/dists/quicklisp/software/mixalot-20131111-git/flac-grovelling" "/home/testgrid/cl-test-grid/work-dir/agent/test-runs/20140829155837-ccl-1.8-f95-linux-x86/fasl/ql/dists/quicklisp/software/mixalot-20131111-git/flac-grovelling.c" Output was: /home/testgrid/cl-test-grid/work-dir/agent/test-runs/20140829155837-ccl-1.8-f95-linux-x86/fasl/ql/dists/quicklisp/software/mixalot-20131111-git/flac-grovelling.c:6:33: fatal error: FLAC/stream_decoder.h: No such file or directory compilation terminated.
ccl-1.9-f96-linux-x64
(LOAD shuffletron FAIL) ffi-grovel, CFFI-GROVEL:GROVEL-ERROR : External process exited with code 1. Command was: "cc" "-m64" "-lvorbisfile" "-I/home/hijarian/systems/cl-test-grid/work-dir/agent/quicklisp/dists/quicklisp/software/cffi_0.13.0/" "-o" "/home/hijarian/systems/cl-test-grid/work-dir/agent/test-runs/20140915142853-ccl-1.9-f96-linux-x64/fasl/ql/dists/quicklisp/software/mixalot-20131111-git/vorbisfile-grovelling" "/home/hijarian/systems/cl-test-grid/work-dir/agent/test-runs/20140915142853-ccl-1.9-f96-linux-x64/fasl/ql/dists/quicklisp/software/mixalot-20131111-git/vorbisfile-grovelling.c" Output was: /home/hijarian/systems/cl-test-grid/work-dir/agent/test-runs/20140915142853-ccl-1.9-f96-linux-x64/fasl/ql/dists/quicklisp/software/mixalot-20131111-git/vorbisfile-grovelling.c:6:31: fatal error: vorbis/vorbisfile.h: Нет такого файла или каталога compilation terminated.
(LOAD shuffletron FAIL) ffi-grovel, CFFI-GROVEL:GROVEL-ERROR : External process exited with code 1. Command was: "cc" "-m64" "-lFLAC" "-lm" "-I/home/hijarian/projects/others/cl-test-grid/work-dir/agent/quicklisp/dists/quicklisp/software/cffi_0.13.0/" "-o" "/home/hijarian/projects/others/cl-test-grid/work-dir/agent/test-runs/20140827185358-ccl-1.9-f96-linux-x64/fasl/ql/dists/quicklisp/software/mixalot-20131111-git/flac-grovelling" "/home/hijarian/projects/others/cl-test-grid/work-dir/agent/test-runs/20140827185358-ccl-1.9-f96-linux-x64/fasl/ql/dists/quicklisp/software/mixalot-20131111-git/flac-grovelling.c" Output was: /home/hijarian/projects/others/cl-test-grid/work-dir/agent/test-runs/20140827185358-ccl-1.9-f96-linux-x64/fasl/ql/dists/quicklisp/software/mixalot-20131111-git/flac-grovelling.c:6:33: fatal error: FLAC/stream_decoder.h: Нет такого файла или каталога #include <FLAC/stream_decoder.h> ^ compilation terminated.
ccl-1.9-f96-linux-x86
(LOAD shuffletron FAIL) ffi-grovel, CFFI-GROVEL:GROVEL-ERROR : External process exited with code 1. Command was: "cc" "-m32" "-lvorbisfile" "-I/home/hijarian/projects/others/cl-test-grid/work-dir/agent/quicklisp/dists/quicklisp/software/cffi_0.13.0/" "-o" "/home/hijarian/projects/others/cl-test-grid/work-dir/agent/test-runs/20140827164806-ccl-1.9-f96-linux-x86/fasl/ql/dists/quicklisp/software/mixalot-20131111-git/vorbisfile-grovelling" "/home/hijarian/projects/others/cl-test-grid/work-dir/agent/test-runs/20140827164806-ccl-1.9-f96-linux-x86/fasl/ql/dists/quicklisp/software/mixalot-20131111-git/vorbisfile-grovelling.c" Output was: /usr/bin/ld: cannot find -lvorbisfile collect2: error: ld returned 1 exit status
ccl-1.9-r15756-f96-linux-x86
(LOAD shuffletron FAIL) ffi, CFFI:LOAD-FOREIGN-LIBRARY-ERROR : Unable to load any of the alternatives: ("libmixalot-mpg123.so.0" "libmpg123.so.0" "/usr/lib/libmpg123.so" "/usr/local/lib/libmpg123.so")
(LOAD shuffletron FAIL) ffi, CFFI:LOAD-FOREIGN-LIBRARY-ERROR : Unable to load any of the alternatives: ("libmixalot-mpg123.so.0" "libmpg123.so.0" "/usr/lib/libmpg123.so" "/usr/local/lib/libmpg123.so")
clisp-2.49-unix-i386
(LOAD shuffletron FAIL) ffi, ASDF:LOAD-SYSTEM-DEFINITION-ERROR : Error while trying to load definition for system flac from pathname /Users/pnathan/cl-test-grid/work-dir/agent/quicklisp/dists/quicklisp/software/mixalot-20131111-git/flac.asd: CFFI requires CLISP compiled with dynamic FFI support.
clisp-2.49-unix-x64
(LOAD shuffletron FAIL) ffi-grovel, CFFI-GROVEL:GROVEL-ERROR : External process exited with code 1. Command was: "cc" "-m64" "-lFLAC" "-lm" "-I/home/hijarian/systems/cl-test-grid/work-dir/agent/quicklisp/dists/quicklisp/software/cffi_0.13.0/" "-o" "/home/hijarian/systems/cl-test-grid/work-dir/agent/test-runs/20140915121117-clisp-2.49-unix-x64/fasl/ql/dists/quicklisp/software/mixalot-20131111-git/flac-grovelling" "/home/hijarian/systems/cl-test-grid/work-dir/agent/test-runs/20140915121117-clisp-2.49-unix-x64/fasl/ql/dists/quicklisp/software/mixalot-20131111-git/flac-grovelling.c" Output was: <see above>
(LOAD shuffletron FAIL) ffi-grovel, CFFI-GROVEL:GROVEL-ERROR : External process exited with code 1. Command was: "cc" "-m64" "-lFLAC" "-lm" "-I/home/hijarian/projects/others/cl-test-grid/work-dir/agent/quicklisp/dists/quicklisp/software/cffi_0.13.0/" "-o" "/home/hijarian/projects/others/cl-test-grid/work-dir/agent/test-runs/20140827103854-clisp-2.49-unix-x64/fasl/ql/dists/quicklisp/software/mixalot-20131111-git/flac-grovelling" "/home/hijarian/projects/others/cl-test-grid/work-dir/agent/test-runs/20140827103854-clisp-2.49-unix-x64/fasl/ql/dists/quicklisp/software/mixalot-20131111-git/flac-grovelling.c" Output was: <see above>
clisp-2.49-unix-x86
(LOAD shuffletron FAIL) ffi-grovel, CFFI-GROVEL:GROVEL-ERROR : External process exited with code 1. Command was: "cc" "-m32" "-lFLAC" "-lm" "-I/home/testgrid/cl-test-grid/work-dir/agent/quicklisp/dists/quicklisp/software/cffi_0.13.0/" "-o" "/home/testgrid/cl-test-grid/work-dir/agent/test-runs/20140830012552-clisp-2.49-unix-x86/fasl/ql/dists/quicklisp/software/mixalot-20131111-git/flac-grovelling" "/home/testgrid/cl-test-grid/work-dir/agent/test-runs/20140830012552-clisp-2.49-unix-x86/fasl/ql/dists/quicklisp/software/mixalot-20131111-git/flac-grovelling.c" Output was: <see above>
cmu-snapshot-2013-04__20d_unicode_-linux-x86
(LOAD shuffletron FAIL) ffi, CFFI:LOAD-FOREIGN-LIBRARY-ERROR : Error in function CFFI::FL-ERROR: Unable to load any of the alternatives: ("libmixalot-mpg123.so.0" "libmpg123.so.0" "/usr/lib/libmpg123.so" "/usr/local/lib/libmpg123.so")
(LOAD shuffletron FAIL) ffi, CFFI:LOAD-FOREIGN-LIBRARY-ERROR : Error in function CFFI::FL-ERROR: Unable to load any of the alternatives: ("libmixalot-mpg123.so.0" "libmpg123.so.0" "/usr/lib/libmpg123.so" "/usr/local/lib/libmpg123.so")
cmu-snapshot-2014-01__20e_unicode_-linux-x86
(LOAD shuffletron FAIL) ffi, CFFI:LOAD-FOREIGN-LIBRARY-ERROR : Error in function CFFI::FL-ERROR: Unable to load any of the alternatives: ("libmixalot-mpg123.so.0" "libmpg123.so.0" "/usr/lib/libmpg123.so" "/usr/local/lib/libmpg123.so")
(LOAD shuffletron FAIL) ffi, CFFI:LOAD-FOREIGN-LIBRARY-ERROR : Error in function CFFI::FL-ERROR: Unable to load any of the alternatives: ("libmixalot-mpg123.so.0" "libmpg123.so.0" "/usr/lib/libmpg123.so" "/usr/local/lib/libmpg123.so")
cmu-snapshot-2014-05-dirty__20e_unicode_-linux-x86
(LOAD shuffletron FAIL) ffi, CFFI:LOAD-FOREIGN-LIBRARY-ERROR : Error in function CFFI::FL-ERROR: Unable to load any of the alternatives: ("libmixalot-mpg123.so.0" "libmpg123.so.0" "/usr/lib/libmpg123.so" "/usr/local/lib/libmpg123.so")
(LOAD shuffletron FAIL) ffi, CFFI:LOAD-FOREIGN-LIBRARY-ERROR : Error in function CFFI::FL-ERROR: Unable to load any of the alternatives: ("libmixalot-mpg123.so.0" "libmpg123.so.0" "/usr/lib/libmpg123.so" "/usr/local/lib/libmpg123.so")
ecl-13.5.1-76a84246-linux-x64-bytecode
(LOAD shuffletron FAIL) ASDF/FIND-SYSTEM:LOAD-SYSTEM-DEFINITION-ERROR : Error while trying to load definition for system osicat from pathname /home/hijarian/systems/cl-test-grid/work-dir/agent/quicklisp/dists/quicklisp/software/osicat-20140211-git/osicat.asd: The variable C::*CC-FLAGS* is unbound.
(LOAD shuffletron FAIL) ASDF/FIND-SYSTEM:LOAD-SYSTEM-DEFINITION-ERROR : Error while trying to load definition for system osicat from pathname /home/hijarian/systems/cl-test-grid/work-dir/agent/quicklisp/dists/quicklisp/software/osicat-20140211-git/osicat.asd: The variable C::*CC-FLAGS* is unbound.
ecl-13.5.1-76a84246-linux-x64-lisp-to-c
(LOAD shuffletron FAIL) ffi-grovel, CFFI-GROVEL:GROVEL-ERROR : External process exited with code 1. Command was: "cc" "-m64" " -D_GNU_SOURCE -D_FILE_OFFSET_BITS=64 -g -O2 -fPIC -D_THREAD_SAFE -Dlinux" "-lvorbisfile" "-I/home/hijarian/systems/cl-test-grid/work-dir/agent/quicklisp/dists/quicklisp/software/cffi_0.13.0/" "-o" "/home/hijarian/systems/cl-test-grid/work-dir/agent/test-runs/20140915180851-ecl-13.5.1-76a84246-linux-x64-lisp-to-c/fasl/ql/dists/quicklisp/software/mixalot-20131111-git/vorbisfile-grovelling" "/home/hijarian/systems/cl-test-grid/work-dir/agent/test-runs/20140915180851-ecl-13.5.1-76a84246-linux-x64-lisp-to-c/fasl/ql/dists/quicklisp/software/mixalot-20131111-git/vorbisfile-grovelling.c" Output was: <see above>
(LOAD shuffletron FAIL) ffi-grovel, CFFI-GROVEL:GROVEL-ERROR : External process exited with code 1. Command was: "cc" "-m64" " -D_GNU_SOURCE -D_FILE_OFFSET_BITS=64 -g -O2 -fPIC -D_THREAD_SAFE -Dlinux" "-lvorbisfile" "-I/home/hijarian/systems/cl-test-grid/work-dir/agent/quicklisp/dists/quicklisp/software/cffi_0.13.0/" "-o" "/home/hijarian/systems/cl-test-grid/work-dir/agent/test-runs/20140908163429-ecl-13.5.1-76a84246-linux-x64-lisp-to-c/fasl/ql/dists/quicklisp/software/mixalot-20131111-git/vorbisfile-grovelling" "/home/hijarian/systems/cl-test-grid/work-dir/agent/test-runs/20140908163429-ecl-13.5.1-76a84246-linux-x64-lisp-to-c/fasl/ql/dists/quicklisp/software/mixalot-20131111-git/vorbisfile-grovelling.c" Output was: <see above>
ecl-13.5.1-efec0ee0-linux-x64-bytecode
(LOAD shuffletron FAIL) ASDF/FIND-SYSTEM:LOAD-SYSTEM-DEFINITION-ERROR : Error while trying to load definition for system osicat from pathname /home/hijarian/projects/others/cl-test-grid/work-dir/agent/quicklisp/dists/quicklisp/software/osicat-20140211-git/osicat.asd: The variable C::*CC-FLAGS* is unbound.
ecl-13.5.1-efec0ee0-linux-x64-lisp-to-c
(LOAD shuffletron FAIL) ffi-grovel, CFFI-GROVEL:GROVEL-ERROR : External process exited with code 1. Command was: "cc" "-m64" " -D_GNU_SOURCE -D_FILE_OFFSET_BITS=64 -g -O2 -fPIC -D_THREAD_SAFE -Dlinux" "-lvorbisfile" "-lFLAC" "-lm" "-I/home/hijarian/projects/others/cl-test-grid/work-dir/agent/quicklisp/dists/quicklisp/software/cffi_0.13.0/" "-o" "/home/hijarian/projects/others/cl-test-grid/work-dir/agent/test-runs/20140829071213-ecl-13.5.1-efec0ee0-linux-x64-lisp-to-c/fasl/ql/dists/quicklisp/software/mixalot-20131111-git/flac-grovelling" "/home/hijarian/projects/others/cl-test-grid/work-dir/agent/test-runs/20140829071213-ecl-13.5.1-efec0ee0-linux-x64-lisp-to-c/fasl/ql/dists/quicklisp/software/mixalot-20131111-git/flac-grovelling.c" Output was: <see above>
ecl-13.5.1-unknown-linux-i686-bytecode
(LOAD shuffletron FAIL) ASDF/FIND-SYSTEM:LOAD-SYSTEM-DEFINITION-ERROR : Error while trying to load definition for system osicat from pathname /home/testgrid/cl-test-grid/work-dir/agent/quicklisp/dists/quicklisp/software/osicat-20140211-git/osicat.asd: The variable C::*CC-FLAGS* is unbound.
(LOAD shuffletron FAIL) ASDF/FIND-SYSTEM:LOAD-SYSTEM-DEFINITION-ERROR : Error while trying to load definition for system osicat from pathname /home/testgrid/cl-test-grid/work-dir/agent/quicklisp/dists/quicklisp/software/osicat-20140211-git/osicat.asd: The variable C::*CC-FLAGS* is unbound.
ecl-13.5.1-unknown-linux-i686-lisp-to-c
(LOAD shuffletron FAIL) ffi, CFFI:LOAD-FOREIGN-LIBRARY-ERROR : Unable to load any of the alternatives: ("libmixalot-mpg123.so.0" "libmpg123.so.0" "/usr/lib/libmpg123.so" "/usr/local/lib/libmpg123.so")
sbcl-1.1.11-linux-x86
(LOAD shuffletron FAIL) ffi, CFFI:LOAD-FOREIGN-LIBRARY-ERROR : Unable to load any of the alternatives: ("libmixalot-mpg123.so.0" "libmpg123.so.0" "/usr/lib/libmpg123.so" "/usr/local/lib/libmpg123.so")
(LOAD shuffletron FAIL) ffi, CFFI:LOAD-FOREIGN-LIBRARY-ERROR : Unable to load any of the alternatives: ("libmixalot-mpg123.so.0" "libmpg123.so.0" "/usr/lib/libmpg123.so" "/usr/local/lib/libmpg123.so")
sbcl-1.1.16-linux-x86
(LOAD shuffletron FAIL) ffi, CFFI:LOAD-FOREIGN-LIBRARY-ERROR : Unable to load any of the alternatives: ("libmixalot-mpg123.so.0" "libmpg123.so.0" "/usr/lib/libmpg123.so" "/usr/local/lib/libmpg123.so")
(LOAD shuffletron FAIL) ffi, CFFI:LOAD-FOREIGN-LIBRARY-ERROR : Unable to load any of the alternatives: ("libmixalot-mpg123.so.0" "libmpg123.so.0" "/usr/lib/libmpg123.so" "/usr/local/lib/libmpg123.so")
sbcl-1.2.0.debian-linux-x64
(LOAD shuffletron FAIL) ffi-grovel, CFFI-GROVEL:GROVEL-ERROR : External process exited with code 1. Command was: "cc" "-m64" "-lFLAC" "-lm" "-I/home/hijarian/projects/others/cl-test-grid/work-dir/agent/quicklisp/dists/quicklisp/software/cffi_0.13.0/" "-o" "/home/hijarian/projects/others/cl-test-grid/work-dir/agent/test-runs/20140827210726-sbcl-1.2.0.debian-linux-x64/fasl/ql/dists/quicklisp/software/mixalot-20131111-git/flac-grovelling" "/home/hijarian/projects/others/cl-test-grid/work-dir/agent/test-runs/20140827210726-sbcl-1.2.0.debian-linux-x64/fasl/ql/dists/quicklisp/software/mixalot-20131111-git/flac-grovelling.c" Output was: /home/hijarian/projects/others/cl-test-grid/work-dir/agent/test-runs/20140827210726-sbcl-1.2.0.debian-linux-x64/fasl/ql/dists/quicklisp/software/mixalot-20131111-git/flac-grovelling.c:6:33: fatal error: FLAC/stream_decoder.h: Нет такого файла или каталога #include <FLAC/stream_decoder.h> ^ compilation terminated.
sbcl-1.2.3-linux-x64
(LOAD shuffletron FAIL) ffi-grovel, CFFI-GROVEL:GROVEL-ERROR : External process exited with code 1. Command was: "cc" "-m64" "-lvorbisfile" "-I/home/hijarian/systems/cl-test-grid/work-dir/agent/quicklisp/dists/quicklisp/software/cffi_0.13.0/" "-o" "/home/hijarian/systems/cl-test-grid/work-dir/agent/test-runs/20140915163602-sbcl-1.2.3-linux-x64/fasl/ql/dists/quicklisp/software/mixalot-20131111-git/vorbisfile-grovelling" "/home/hijarian/systems/cl-test-grid/work-dir/agent/test-runs/20140915163602-sbcl-1.2.3-linux-x64/fasl/ql/dists/quicklisp/software/mixalot-20131111-git/vorbisfile-grovelling.c" Output was: /home/hijarian/systems/cl-test-grid/work-dir/agent/test-runs/20140915163602-sbcl-1.2.3-linux-x64/fasl/ql/dists/quicklisp/software/mixalot-20131111-git/vorbisfile-grovelling.c:6:31: fatal error: vorbis/vorbisfile.h: Нет такого файла или каталога compilation terminated.
(LOAD shuffletron FAIL) ffi-grovel, CFFI-GROVEL:GROVEL-ERROR : External process exited with code 1. Command was: "cc" "-m64" "-lvorbisfile" "-I/home/hijarian/systems/cl-test-grid/work-dir/agent/quicklisp/dists/quicklisp/software/cffi_0.13.0/" "-o" "/home/hijarian/systems/cl-test-grid/work-dir/agent/test-runs/20140908100955-sbcl-1.2.3-linux-x64/fasl/ql/dists/quicklisp/software/mixalot-20131111-git/vorbisfile-grovelling" "/home/hijarian/systems/cl-test-grid/work-dir/agent/test-runs/20140908100955-sbcl-1.2.3-linux-x64/fasl/ql/dists/quicklisp/software/mixalot-20131111-git/vorbisfile-grovelling.c" Output was: /home/hijarian/systems/cl-test-grid/work-dir/agent/test-runs/20140908100955-sbcl-1.2.3-linux-x64/fasl/ql/dists/quicklisp/software/mixalot-20131111-git/vorbisfile-grovelling.c:6:31: fatal error: vorbis/vorbisfile.h: Нет такого файла или каталога compilation terminated.

Breakdown by testcases: for every failed testcase the lisp implmentations it fails on

The library does not have a testsuite adapter for CL Test Grid.

To reports overview

Generated at: 2014-09-27 20:09:35 GMT.