mixalot results collected by cl-test-grid

Results on the last two Quicklisp distributions

 quicklisp 2014-11-06quicklisp 2014-10-06
abcl-1.2.1-fasl42-linux-x86
(LOAD vorbisfile-ffi FAIL) ffi-grovel, CFFI-GROVEL:GROVEL-ERROR : External process exited with code 1. Command was: "cc" "-m32" "-lvorbisfile" "-I/home/testgrid/cl-test-grid/work-dir/agent/quicklisp/dists/quicklisp/software/cffi_0.14.0/" "-o" "/home/testgrid/cl-test-grid/work-dir/agent/test-runs/20141117131245-abcl-1.2.1-fasl42-linux-x86/fasl/ql/dists/quicklisp/software/mixalot-20131111-git/vorbisfile-grovelling" "/home/testgrid/cl-test-grid/work-dir/agent/test-runs/20141117131245-abcl-1.2.1-fasl42-linux-x86/fasl/ql/dists/quicklisp/software/mixalot-20131111-git/vorbisfile-grovelling.c" Output was: /home/testgrid/cl-test-grid/work-dir/agent/test-runs/20141117131245-abcl-1.2.1-fasl42-linux-x86/fasl/ql/dists/quicklisp/software/mixalot-20131111-git/vorbisfile-grovelling.c:6:31: fatal error: vorbis/vorbisfile.h: No such file or directory compilation terminated.
(LOAD mpg123-ffi FAIL) ffi, CFFI:LOAD-FOREIGN-LIBRARY-ERROR : Unable to load any of the alternatives: ("libmixalot-mpg123.so.0" "libmpg123.so.0" "/usr/lib/libmpg123.so" "/usr/local/lib/libmpg123.so")
(LOAD mixalot-vorbis FAIL) ffi-grovel, CFFI-GROVEL:GROVEL-ERROR : External process exited with code 1. Command was: "cc" "-m32" "-lvorbisfile" "-I/home/testgrid/cl-test-grid/work-dir/agent/quicklisp/dists/quicklisp/software/cffi_0.14.0/" "-o" "/home/testgrid/cl-test-grid/work-dir/agent/test-runs/20141117131245-abcl-1.2.1-fasl42-linux-x86/fasl/ql/dists/quicklisp/software/mixalot-20131111-git/vorbisfile-grovelling" "/home/testgrid/cl-test-grid/work-dir/agent/test-runs/20141117131245-abcl-1.2.1-fasl42-linux-x86/fasl/ql/dists/quicklisp/software/mixalot-20131111-git/vorbisfile-grovelling.c" Output was: /home/testgrid/cl-test-grid/work-dir/agent/test-runs/20141117131245-abcl-1.2.1-fasl42-linux-x86/fasl/ql/dists/quicklisp/software/mixalot-20131111-git/vorbisfile-grovelling.c:6:31: fatal error: vorbis/vorbisfile.h: No such file or directory compilation terminated.
(LOAD mixalot-mp3 FAIL) ffi, CFFI:LOAD-FOREIGN-LIBRARY-ERROR : Unable to load any of the alternatives: ("libmixalot-mpg123.so.0" "libmpg123.so.0" "/usr/lib/libmpg123.so" "/usr/local/lib/libmpg123.so")
(LOAD mixalot-flac FAIL) ffi-grovel, CFFI-GROVEL:GROVEL-ERROR : External process exited with code 1. Command was: "cc" "-m32" "-lFLAC" "-lm" "-I/home/testgrid/cl-test-grid/work-dir/agent/quicklisp/dists/quicklisp/software/cffi_0.14.0/" "-o" "/home/testgrid/cl-test-grid/work-dir/agent/test-runs/20141117131245-abcl-1.2.1-fasl42-linux-x86/fasl/ql/dists/quicklisp/software/mixalot-20131111-git/flac-grovelling" "/home/testgrid/cl-test-grid/work-dir/agent/test-runs/20141117131245-abcl-1.2.1-fasl42-linux-x86/fasl/ql/dists/quicklisp/software/mixalot-20131111-git/flac-grovelling.c" Output was: /home/testgrid/cl-test-grid/work-dir/agent/test-runs/20141117131245-abcl-1.2.1-fasl42-linux-x86/fasl/ql/dists/quicklisp/software/mixalot-20131111-git/flac-grovelling.c:6:33: fatal error: FLAC/stream_decoder.h: No such file or directory compilation terminated.
(LOAD flac FAIL) ffi-grovel, CFFI-GROVEL:GROVEL-ERROR : External process exited with code 1. Command was: "cc" "-m32" "-lFLAC" "-lm" "-I/home/testgrid/cl-test-grid/work-dir/agent/quicklisp/dists/quicklisp/software/cffi_0.14.0/" "-o" "/home/testgrid/cl-test-grid/work-dir/agent/test-runs/20141117131245-abcl-1.2.1-fasl42-linux-x86/fasl/ql/dists/quicklisp/software/mixalot-20131111-git/flac-grovelling" "/home/testgrid/cl-test-grid/work-dir/agent/test-runs/20141117131245-abcl-1.2.1-fasl42-linux-x86/fasl/ql/dists/quicklisp/software/mixalot-20131111-git/flac-grovelling.c" Output was: /home/testgrid/cl-test-grid/work-dir/agent/test-runs/20141117131245-abcl-1.2.1-fasl42-linux-x86/fasl/ql/dists/quicklisp/software/mixalot-20131111-git/flac-grovelling.c:6:33: fatal error: FLAC/stream_decoder.h: No such file or directory compilation terminated.
(LOAD vorbisfile-ffi FAIL) ffi-grovel, CFFI-GROVEL:GROVEL-ERROR : External process exited with code 1. Command was: "cc" "-m32" "-lvorbisfile" "-I/home/testgrid/cl-test-grid/work-dir/agent/quicklisp/dists/quicklisp/software/cffi_0.14.0/" "-o" "/home/testgrid/cl-test-grid/work-dir/agent/test-runs/20141010031557-abcl-1.2.1-fasl42-linux-x86/fasl/ql/dists/quicklisp/software/mixalot-20131111-git/vorbisfile-grovelling" "/home/testgrid/cl-test-grid/work-dir/agent/test-runs/20141010031557-abcl-1.2.1-fasl42-linux-x86/fasl/ql/dists/quicklisp/software/mixalot-20131111-git/vorbisfile-grovelling.c" Output was: /home/testgrid/cl-test-grid/work-dir/agent/test-runs/20141010031557-abcl-1.2.1-fasl42-linux-x86/fasl/ql/dists/quicklisp/software/mixalot-20131111-git/vorbisfile-grovelling.c:6:31: fatal error: vorbis/vorbisfile.h: No such file or directory compilation terminated.
(LOAD mpg123-ffi FAIL) ffi, CFFI:LOAD-FOREIGN-LIBRARY-ERROR : Unable to load any of the alternatives: ("libmixalot-mpg123.so.0" "libmpg123.so.0" "/usr/lib/libmpg123.so" "/usr/local/lib/libmpg123.so")
(LOAD mixalot-vorbis FAIL) ffi-grovel, CFFI-GROVEL:GROVEL-ERROR : External process exited with code 1. Command was: "cc" "-m32" "-lvorbisfile" "-I/home/testgrid/cl-test-grid/work-dir/agent/quicklisp/dists/quicklisp/software/cffi_0.14.0/" "-o" "/home/testgrid/cl-test-grid/work-dir/agent/test-runs/20141010031557-abcl-1.2.1-fasl42-linux-x86/fasl/ql/dists/quicklisp/software/mixalot-20131111-git/vorbisfile-grovelling" "/home/testgrid/cl-test-grid/work-dir/agent/test-runs/20141010031557-abcl-1.2.1-fasl42-linux-x86/fasl/ql/dists/quicklisp/software/mixalot-20131111-git/vorbisfile-grovelling.c" Output was: /home/testgrid/cl-test-grid/work-dir/agent/test-runs/20141010031557-abcl-1.2.1-fasl42-linux-x86/fasl/ql/dists/quicklisp/software/mixalot-20131111-git/vorbisfile-grovelling.c:6:31: fatal error: vorbis/vorbisfile.h: No such file or directory compilation terminated.
(LOAD mixalot-mp3 FAIL) ffi, CFFI:LOAD-FOREIGN-LIBRARY-ERROR : Unable to load any of the alternatives: ("libmixalot-mpg123.so.0" "libmpg123.so.0" "/usr/lib/libmpg123.so" "/usr/local/lib/libmpg123.so")
(LOAD mixalot-flac FAIL) ffi-grovel, CFFI-GROVEL:GROVEL-ERROR : External process exited with code 1. Command was: "cc" "-m32" "-lFLAC" "-lm" "-I/home/testgrid/cl-test-grid/work-dir/agent/quicklisp/dists/quicklisp/software/cffi_0.14.0/" "-o" "/home/testgrid/cl-test-grid/work-dir/agent/test-runs/20141010031557-abcl-1.2.1-fasl42-linux-x86/fasl/ql/dists/quicklisp/software/mixalot-20131111-git/flac-grovelling" "/home/testgrid/cl-test-grid/work-dir/agent/test-runs/20141010031557-abcl-1.2.1-fasl42-linux-x86/fasl/ql/dists/quicklisp/software/mixalot-20131111-git/flac-grovelling.c" Output was: /home/testgrid/cl-test-grid/work-dir/agent/test-runs/20141010031557-abcl-1.2.1-fasl42-linux-x86/fasl/ql/dists/quicklisp/software/mixalot-20131111-git/flac-grovelling.c:6:33: fatal error: FLAC/stream_decoder.h: No such file or directory compilation terminated.
(LOAD flac FAIL) ffi-grovel, CFFI-GROVEL:GROVEL-ERROR : External process exited with code 1. Command was: "cc" "-m32" "-lFLAC" "-lm" "-I/home/testgrid/cl-test-grid/work-dir/agent/quicklisp/dists/quicklisp/software/cffi_0.14.0/" "-o" "/home/testgrid/cl-test-grid/work-dir/agent/test-runs/20141010031557-abcl-1.2.1-fasl42-linux-x86/fasl/ql/dists/quicklisp/software/mixalot-20131111-git/flac-grovelling" "/home/testgrid/cl-test-grid/work-dir/agent/test-runs/20141010031557-abcl-1.2.1-fasl42-linux-x86/fasl/ql/dists/quicklisp/software/mixalot-20131111-git/flac-grovelling.c" Output was: /home/testgrid/cl-test-grid/work-dir/agent/test-runs/20141010031557-abcl-1.2.1-fasl42-linux-x86/fasl/ql/dists/quicklisp/software/mixalot-20131111-git/flac-grovelling.c:6:33: fatal error: FLAC/stream_decoder.h: No such file or directory compilation terminated.
abcl-1.2.1-fasl42-macosx-x64
(LOAD vorbisfile-ffi FAIL) ffi, ASDF/FIND-SYSTEM:LOAD-SYSTEM-DEFINITION-ERROR : Error while trying to load definition for system vorbisfile-ffi from pathname /Users/pnathan/cl-test-grid/work-dir/agent/quicklisp/dists/quicklisp/software/mixalot-20131111-git/vorbisfile-ffi.asd: Don't know how to COMMON-LISP:REQUIRE JNA.
(LOAD mpg123-ffi FAIL) ffi, COMMON-LISP:SIMPLE-ERROR : Don't know how to REQUIRE JNA.
(LOAD mixalot-vorbis FAIL) ffi, ASDF/FIND-SYSTEM:LOAD-SYSTEM-DEFINITION-ERROR : Error while trying to load definition for system vorbisfile-ffi from pathname /Users/pnathan/cl-test-grid/work-dir/agent/quicklisp/dists/quicklisp/software/mixalot-20131111-git/vorbisfile-ffi.asd: Don't know how to COMMON-LISP:REQUIRE JNA.
(LOAD mixalot-mp3 FAIL) ffi, COMMON-LISP:SIMPLE-ERROR : Don't know how to REQUIRE JNA.
(LOAD mixalot-flac FAIL) ffi, ASDF/FIND-SYSTEM:LOAD-SYSTEM-DEFINITION-ERROR : Error while trying to load definition for system flac from pathname /Users/pnathan/cl-test-grid/work-dir/agent/quicklisp/dists/quicklisp/software/mixalot-20131111-git/flac.asd: Don't know how to COMMON-LISP:REQUIRE JNA.
(LOAD mixalot FAIL) ffi, COMMON-LISP:SIMPLE-ERROR : Don't know how to REQUIRE JNA.
(LOAD flac FAIL) ffi, ASDF/FIND-SYSTEM:LOAD-SYSTEM-DEFINITION-ERROR : Error while trying to load definition for system flac from pathname /Users/pnathan/cl-test-grid/work-dir/agent/quicklisp/dists/quicklisp/software/mixalot-20131111-git/flac.asd: Don't know how to COMMON-LISP:REQUIRE JNA.
(LOAD vorbisfile-ffi FAIL) ffi, ASDF/FIND-SYSTEM:LOAD-SYSTEM-DEFINITION-ERROR : Error while trying to load definition for system vorbisfile-ffi from pathname /Users/pnathan/cl-test-grid/work-dir/agent/quicklisp/dists/quicklisp/software/mixalot-20131111-git/vorbisfile-ffi.asd: Don't know how to COMMON-LISP:REQUIRE JNA.
(LOAD mpg123-ffi FAIL) ffi, COMMON-LISP:SIMPLE-ERROR : Don't know how to REQUIRE JNA.
(LOAD mixalot-vorbis FAIL) ffi, ASDF/FIND-SYSTEM:LOAD-SYSTEM-DEFINITION-ERROR : Error while trying to load definition for system vorbisfile-ffi from pathname /Users/pnathan/cl-test-grid/work-dir/agent/quicklisp/dists/quicklisp/software/mixalot-20131111-git/vorbisfile-ffi.asd: Don't know how to COMMON-LISP:REQUIRE JNA.
(LOAD mixalot-mp3 FAIL) ffi, COMMON-LISP:SIMPLE-ERROR : Don't know how to REQUIRE JNA.
(LOAD mixalot-flac FAIL) ffi, ASDF/FIND-SYSTEM:LOAD-SYSTEM-DEFINITION-ERROR : Error while trying to load definition for system flac from pathname /Users/pnathan/cl-test-grid/work-dir/agent/quicklisp/dists/quicklisp/software/mixalot-20131111-git/flac.asd: Don't know how to COMMON-LISP:REQUIRE JNA.
(LOAD mixalot FAIL) ffi, COMMON-LISP:SIMPLE-ERROR : Don't know how to REQUIRE JNA.
(LOAD flac FAIL) ffi, ASDF/FIND-SYSTEM:LOAD-SYSTEM-DEFINITION-ERROR : Error while trying to load definition for system flac from pathname /Users/pnathan/cl-test-grid/work-dir/agent/quicklisp/dists/quicklisp/software/mixalot-20131111-git/flac.asd: Don't know how to COMMON-LISP:REQUIRE JNA.
abcl-1.3.0-fasl42-linux-x86
(LOAD vorbisfile-ffi FAIL) ffi-grovel, CFFI-GROVEL:GROVEL-ERROR : External process exited with code 1. Command was: "cc" "-m32" "-lvorbisfile" "-I/home/testgrid/cl-test-grid/work-dir/agent/quicklisp/dists/quicklisp/software/cffi_0.14.0/" "-o" "/home/testgrid/cl-test-grid/work-dir/agent/test-runs/20141117012126-abcl-1.3.0-fasl42-linux-x86/fasl/ql/dists/quicklisp/software/mixalot-20131111-git/vorbisfile-grovelling" "/home/testgrid/cl-test-grid/work-dir/agent/test-runs/20141117012126-abcl-1.3.0-fasl42-linux-x86/fasl/ql/dists/quicklisp/software/mixalot-20131111-git/vorbisfile-grovelling.c" Output was: /home/testgrid/cl-test-grid/work-dir/agent/test-runs/20141117012126-abcl-1.3.0-fasl42-linux-x86/fasl/ql/dists/quicklisp/software/mixalot-20131111-git/vorbisfile-grovelling.c:6:31: fatal error: vorbis/vorbisfile.h: No such file or directory compilation terminated.
(LOAD mpg123-ffi FAIL) ffi, CFFI:LOAD-FOREIGN-LIBRARY-ERROR : Unable to load any of the alternatives: ("libmixalot-mpg123.so.0" "libmpg123.so.0" "/usr/lib/libmpg123.so" "/usr/local/lib/libmpg123.so")
(LOAD mixalot-vorbis FAIL) ffi-grovel, CFFI-GROVEL:GROVEL-ERROR : External process exited with code 1. Command was: "cc" "-m32" "-lvorbisfile" "-I/home/testgrid/cl-test-grid/work-dir/agent/quicklisp/dists/quicklisp/software/cffi_0.14.0/" "-o" "/home/testgrid/cl-test-grid/work-dir/agent/test-runs/20141117012126-abcl-1.3.0-fasl42-linux-x86/fasl/ql/dists/quicklisp/software/mixalot-20131111-git/vorbisfile-grovelling" "/home/testgrid/cl-test-grid/work-dir/agent/test-runs/20141117012126-abcl-1.3.0-fasl42-linux-x86/fasl/ql/dists/quicklisp/software/mixalot-20131111-git/vorbisfile-grovelling.c" Output was: /home/testgrid/cl-test-grid/work-dir/agent/test-runs/20141117012126-abcl-1.3.0-fasl42-linux-x86/fasl/ql/dists/quicklisp/software/mixalot-20131111-git/vorbisfile-grovelling.c:6:31: fatal error: vorbis/vorbisfile.h: No such file or directory compilation terminated.
(LOAD mixalot-mp3 FAIL) ffi, CFFI:LOAD-FOREIGN-LIBRARY-ERROR : Unable to load any of the alternatives: ("libmixalot-mpg123.so.0" "libmpg123.so.0" "/usr/lib/libmpg123.so" "/usr/local/lib/libmpg123.so")
(LOAD mixalot-flac FAIL) ffi-grovel, CFFI-GROVEL:GROVEL-ERROR : External process exited with code 1. Command was: "cc" "-m32" "-lFLAC" "-lm" "-I/home/testgrid/cl-test-grid/work-dir/agent/quicklisp/dists/quicklisp/software/cffi_0.14.0/" "-o" "/home/testgrid/cl-test-grid/work-dir/agent/test-runs/20141117012126-abcl-1.3.0-fasl42-linux-x86/fasl/ql/dists/quicklisp/software/mixalot-20131111-git/flac-grovelling" "/home/testgrid/cl-test-grid/work-dir/agent/test-runs/20141117012126-abcl-1.3.0-fasl42-linux-x86/fasl/ql/dists/quicklisp/software/mixalot-20131111-git/flac-grovelling.c" Output was: /home/testgrid/cl-test-grid/work-dir/agent/test-runs/20141117012126-abcl-1.3.0-fasl42-linux-x86/fasl/ql/dists/quicklisp/software/mixalot-20131111-git/flac-grovelling.c:6:33: fatal error: FLAC/stream_decoder.h: No such file or directory compilation terminated.
(LOAD flac FAIL) ffi-grovel, CFFI-GROVEL:GROVEL-ERROR : External process exited with code 1. Command was: "cc" "-m32" "-lFLAC" "-lm" "-I/home/testgrid/cl-test-grid/work-dir/agent/quicklisp/dists/quicklisp/software/cffi_0.14.0/" "-o" "/home/testgrid/cl-test-grid/work-dir/agent/test-runs/20141117012126-abcl-1.3.0-fasl42-linux-x86/fasl/ql/dists/quicklisp/software/mixalot-20131111-git/flac-grovelling" "/home/testgrid/cl-test-grid/work-dir/agent/test-runs/20141117012126-abcl-1.3.0-fasl42-linux-x86/fasl/ql/dists/quicklisp/software/mixalot-20131111-git/flac-grovelling.c" Output was: /home/testgrid/cl-test-grid/work-dir/agent/test-runs/20141117012126-abcl-1.3.0-fasl42-linux-x86/fasl/ql/dists/quicklisp/software/mixalot-20131111-git/flac-grovelling.c:6:33: fatal error: FLAC/stream_decoder.h: No such file or directory compilation terminated.
(LOAD vorbisfile-ffi FAIL) ffi-grovel, CFFI-GROVEL:GROVEL-ERROR : External process exited with code 1. Command was: "cc" "-m32" "-lvorbisfile" "-I/home/testgrid/cl-test-grid/work-dir/agent/quicklisp/dists/quicklisp/software/cffi_0.14.0/" "-o" "/home/testgrid/cl-test-grid/work-dir/agent/test-runs/20141009152958-abcl-1.3.0-fasl42-linux-x86/fasl/ql/dists/quicklisp/software/mixalot-20131111-git/vorbisfile-grovelling" "/home/testgrid/cl-test-grid/work-dir/agent/test-runs/20141009152958-abcl-1.3.0-fasl42-linux-x86/fasl/ql/dists/quicklisp/software/mixalot-20131111-git/vorbisfile-grovelling.c" Output was: /home/testgrid/cl-test-grid/work-dir/agent/test-runs/20141009152958-abcl-1.3.0-fasl42-linux-x86/fasl/ql/dists/quicklisp/software/mixalot-20131111-git/vorbisfile-grovelling.c:6:31: fatal error: vorbis/vorbisfile.h: No such file or directory compilation terminated.
(LOAD mpg123-ffi FAIL) ffi, CFFI:LOAD-FOREIGN-LIBRARY-ERROR : Unable to load any of the alternatives: ("libmixalot-mpg123.so.0" "libmpg123.so.0" "/usr/lib/libmpg123.so" "/usr/local/lib/libmpg123.so")
(LOAD mixalot-vorbis FAIL) ffi-grovel, CFFI-GROVEL:GROVEL-ERROR : External process exited with code 1. Command was: "cc" "-m32" "-lvorbisfile" "-I/home/testgrid/cl-test-grid/work-dir/agent/quicklisp/dists/quicklisp/software/cffi_0.14.0/" "-o" "/home/testgrid/cl-test-grid/work-dir/agent/test-runs/20141009152958-abcl-1.3.0-fasl42-linux-x86/fasl/ql/dists/quicklisp/software/mixalot-20131111-git/vorbisfile-grovelling" "/home/testgrid/cl-test-grid/work-dir/agent/test-runs/20141009152958-abcl-1.3.0-fasl42-linux-x86/fasl/ql/dists/quicklisp/software/mixalot-20131111-git/vorbisfile-grovelling.c" Output was: /home/testgrid/cl-test-grid/work-dir/agent/test-runs/20141009152958-abcl-1.3.0-fasl42-linux-x86/fasl/ql/dists/quicklisp/software/mixalot-20131111-git/vorbisfile-grovelling.c:6:31: fatal error: vorbis/vorbisfile.h: No such file or directory compilation terminated.
(LOAD mixalot-mp3 FAIL) ffi, CFFI:LOAD-FOREIGN-LIBRARY-ERROR : Unable to load any of the alternatives: ("libmixalot-mpg123.so.0" "libmpg123.so.0" "/usr/lib/libmpg123.so" "/usr/local/lib/libmpg123.so")
(LOAD mixalot-flac FAIL) ffi-grovel, CFFI-GROVEL:GROVEL-ERROR : External process exited with code 1. Command was: "cc" "-m32" "-lFLAC" "-lm" "-I/home/testgrid/cl-test-grid/work-dir/agent/quicklisp/dists/quicklisp/software/cffi_0.14.0/" "-o" "/home/testgrid/cl-test-grid/work-dir/agent/test-runs/20141009152958-abcl-1.3.0-fasl42-linux-x86/fasl/ql/dists/quicklisp/software/mixalot-20131111-git/flac-grovelling" "/home/testgrid/cl-test-grid/work-dir/agent/test-runs/20141009152958-abcl-1.3.0-fasl42-linux-x86/fasl/ql/dists/quicklisp/software/mixalot-20131111-git/flac-grovelling.c" Output was: /home/testgrid/cl-test-grid/work-dir/agent/test-runs/20141009152958-abcl-1.3.0-fasl42-linux-x86/fasl/ql/dists/quicklisp/software/mixalot-20131111-git/flac-grovelling.c:6:33: fatal error: FLAC/stream_decoder.h: No such file or directory compilation terminated.
(LOAD flac FAIL) ffi-grovel, CFFI-GROVEL:GROVEL-ERROR : External process exited with code 1. Command was: "cc" "-m32" "-lFLAC" "-lm" "-I/home/testgrid/cl-test-grid/work-dir/agent/quicklisp/dists/quicklisp/software/cffi_0.14.0/" "-o" "/home/testgrid/cl-test-grid/work-dir/agent/test-runs/20141009152958-abcl-1.3.0-fasl42-linux-x86/fasl/ql/dists/quicklisp/software/mixalot-20131111-git/flac-grovelling" "/home/testgrid/cl-test-grid/work-dir/agent/test-runs/20141009152958-abcl-1.3.0-fasl42-linux-x86/fasl/ql/dists/quicklisp/software/mixalot-20131111-git/flac-grovelling.c" Output was: /home/testgrid/cl-test-grid/work-dir/agent/test-runs/20141009152958-abcl-1.3.0-fasl42-linux-x86/fasl/ql/dists/quicklisp/software/mixalot-20131111-git/flac-grovelling.c:6:33: fatal error: FLAC/stream_decoder.h: No such file or directory compilation terminated.
abcl-1.3.1-fasl42-linux-x86
(LOAD vorbisfile-ffi FAIL) ffi-grovel, CFFI-GROVEL:GROVEL-ERROR : External process exited with code 1. Command was: "cc" "-m32" "-lvorbisfile" "-I/home/testgrid/cl-test-grid/work-dir/agent/quicklisp/dists/quicklisp/software/cffi_0.14.0/" "-o" "/home/testgrid/cl-test-grid/work-dir/agent/test-runs/20141116112208-abcl-1.3.1-fasl42-linux-x86/fasl/ql/dists/quicklisp/software/mixalot-20131111-git/vorbisfile-grovelling" "/home/testgrid/cl-test-grid/work-dir/agent/test-runs/20141116112208-abcl-1.3.1-fasl42-linux-x86/fasl/ql/dists/quicklisp/software/mixalot-20131111-git/vorbisfile-grovelling.c" Output was: /home/testgrid/cl-test-grid/work-dir/agent/test-runs/20141116112208-abcl-1.3.1-fasl42-linux-x86/fasl/ql/dists/quicklisp/software/mixalot-20131111-git/vorbisfile-grovelling.c:6:31: fatal error: vorbis/vorbisfile.h: No such file or directory compilation terminated.
(LOAD mpg123-ffi FAIL) ffi, CFFI:LOAD-FOREIGN-LIBRARY-ERROR : Unable to load any of the alternatives: ("libmixalot-mpg123.so.0" "libmpg123.so.0" "/usr/lib/libmpg123.so" "/usr/local/lib/libmpg123.so")
(LOAD mixalot-vorbis FAIL) ffi-grovel, CFFI-GROVEL:GROVEL-ERROR : External process exited with code 1. Command was: "cc" "-m32" "-lvorbisfile" "-I/home/testgrid/cl-test-grid/work-dir/agent/quicklisp/dists/quicklisp/software/cffi_0.14.0/" "-o" "/home/testgrid/cl-test-grid/work-dir/agent/test-runs/20141116112208-abcl-1.3.1-fasl42-linux-x86/fasl/ql/dists/quicklisp/software/mixalot-20131111-git/vorbisfile-grovelling" "/home/testgrid/cl-test-grid/work-dir/agent/test-runs/20141116112208-abcl-1.3.1-fasl42-linux-x86/fasl/ql/dists/quicklisp/software/mixalot-20131111-git/vorbisfile-grovelling.c" Output was: /home/testgrid/cl-test-grid/work-dir/agent/test-runs/20141116112208-abcl-1.3.1-fasl42-linux-x86/fasl/ql/dists/quicklisp/software/mixalot-20131111-git/vorbisfile-grovelling.c:6:31: fatal error: vorbis/vorbisfile.h: No such file or directory compilation terminated.
(LOAD mixalot-mp3 FAIL) ffi, CFFI:LOAD-FOREIGN-LIBRARY-ERROR : Unable to load any of the alternatives: ("libmixalot-mpg123.so.0" "libmpg123.so.0" "/usr/lib/libmpg123.so" "/usr/local/lib/libmpg123.so")
(LOAD mixalot-flac FAIL) ffi-grovel, CFFI-GROVEL:GROVEL-ERROR : External process exited with code 1. Command was: "cc" "-m32" "-lFLAC" "-lm" "-I/home/testgrid/cl-test-grid/work-dir/agent/quicklisp/dists/quicklisp/software/cffi_0.14.0/" "-o" "/home/testgrid/cl-test-grid/work-dir/agent/test-runs/20141116112208-abcl-1.3.1-fasl42-linux-x86/fasl/ql/dists/quicklisp/software/mixalot-20131111-git/flac-grovelling" "/home/testgrid/cl-test-grid/work-dir/agent/test-runs/20141116112208-abcl-1.3.1-fasl42-linux-x86/fasl/ql/dists/quicklisp/software/mixalot-20131111-git/flac-grovelling.c" Output was: /home/testgrid/cl-test-grid/work-dir/agent/test-runs/20141116112208-abcl-1.3.1-fasl42-linux-x86/fasl/ql/dists/quicklisp/software/mixalot-20131111-git/flac-grovelling.c:6:33: fatal error: FLAC/stream_decoder.h: No such file or directory compilation terminated.
(LOAD flac FAIL) ffi-grovel, CFFI-GROVEL:GROVEL-ERROR : External process exited with code 1. Command was: "cc" "-m32" "-lFLAC" "-lm" "-I/home/testgrid/cl-test-grid/work-dir/agent/quicklisp/dists/quicklisp/software/cffi_0.14.0/" "-o" "/home/testgrid/cl-test-grid/work-dir/agent/test-runs/20141116112208-abcl-1.3.1-fasl42-linux-x86/fasl/ql/dists/quicklisp/software/mixalot-20131111-git/flac-grovelling" "/home/testgrid/cl-test-grid/work-dir/agent/test-runs/20141116112208-abcl-1.3.1-fasl42-linux-x86/fasl/ql/dists/quicklisp/software/mixalot-20131111-git/flac-grovelling.c" Output was: /home/testgrid/cl-test-grid/work-dir/agent/test-runs/20141116112208-abcl-1.3.1-fasl42-linux-x86/fasl/ql/dists/quicklisp/software/mixalot-20131111-git/flac-grovelling.c:6:33: fatal error: FLAC/stream_decoder.h: No such file or directory compilation terminated.
(LOAD vorbisfile-ffi FAIL) ffi-grovel, CFFI-GROVEL:GROVEL-ERROR : External process exited with code 1. Command was: "cc" "-m32" "-lvorbisfile" "-I/home/testgrid/cl-test-grid/work-dir/agent/quicklisp/dists/quicklisp/software/cffi_0.14.0/" "-o" "/home/testgrid/cl-test-grid/work-dir/agent/test-runs/20141103135801-abcl-1.3.1-fasl42-linux-x86/fasl/ql/dists/quicklisp/software/mixalot-20131111-git/vorbisfile-grovelling" "/home/testgrid/cl-test-grid/work-dir/agent/test-runs/20141103135801-abcl-1.3.1-fasl42-linux-x86/fasl/ql/dists/quicklisp/software/mixalot-20131111-git/vorbisfile-grovelling.c" Output was: /home/testgrid/cl-test-grid/work-dir/agent/test-runs/20141103135801-abcl-1.3.1-fasl42-linux-x86/fasl/ql/dists/quicklisp/software/mixalot-20131111-git/vorbisfile-grovelling.c:6:31: fatal error: vorbis/vorbisfile.h: No such file or directory compilation terminated.
(LOAD mpg123-ffi FAIL) ffi, CFFI:LOAD-FOREIGN-LIBRARY-ERROR : Unable to load any of the alternatives: ("libmixalot-mpg123.so.0" "libmpg123.so.0" "/usr/lib/libmpg123.so" "/usr/local/lib/libmpg123.so")
(LOAD mixalot-vorbis FAIL) ffi-grovel, CFFI-GROVEL:GROVEL-ERROR : External process exited with code 1. Command was: "cc" "-m32" "-lvorbisfile" "-I/home/testgrid/cl-test-grid/work-dir/agent/quicklisp/dists/quicklisp/software/cffi_0.14.0/" "-o" "/home/testgrid/cl-test-grid/work-dir/agent/test-runs/20141103135801-abcl-1.3.1-fasl42-linux-x86/fasl/ql/dists/quicklisp/software/mixalot-20131111-git/vorbisfile-grovelling" "/home/testgrid/cl-test-grid/work-dir/agent/test-runs/20141103135801-abcl-1.3.1-fasl42-linux-x86/fasl/ql/dists/quicklisp/software/mixalot-20131111-git/vorbisfile-grovelling.c" Output was: /home/testgrid/cl-test-grid/work-dir/agent/test-runs/20141103135801-abcl-1.3.1-fasl42-linux-x86/fasl/ql/dists/quicklisp/software/mixalot-20131111-git/vorbisfile-grovelling.c:6:31: fatal error: vorbis/vorbisfile.h: No such file or directory compilation terminated.
(LOAD mixalot-mp3 FAIL) ffi, CFFI:LOAD-FOREIGN-LIBRARY-ERROR : Unable to load any of the alternatives: ("libmixalot-mpg123.so.0" "libmpg123.so.0" "/usr/lib/libmpg123.so" "/usr/local/lib/libmpg123.so")
(LOAD mixalot-flac FAIL) ffi-grovel, CFFI-GROVEL:GROVEL-ERROR : External process exited with code 1. Command was: "cc" "-m32" "-lFLAC" "-lm" "-I/home/testgrid/cl-test-grid/work-dir/agent/quicklisp/dists/quicklisp/software/cffi_0.14.0/" "-o" "/home/testgrid/cl-test-grid/work-dir/agent/test-runs/20141103135801-abcl-1.3.1-fasl42-linux-x86/fasl/ql/dists/quicklisp/software/mixalot-20131111-git/flac-grovelling" "/home/testgrid/cl-test-grid/work-dir/agent/test-runs/20141103135801-abcl-1.3.1-fasl42-linux-x86/fasl/ql/dists/quicklisp/software/mixalot-20131111-git/flac-grovelling.c" Output was: /home/testgrid/cl-test-grid/work-dir/agent/test-runs/20141103135801-abcl-1.3.1-fasl42-linux-x86/fasl/ql/dists/quicklisp/software/mixalot-20131111-git/flac-grovelling.c:6:33: fatal error: FLAC/stream_decoder.h: No such file or directory compilation terminated.
(LOAD flac FAIL) ffi-grovel, CFFI-GROVEL:GROVEL-ERROR : External process exited with code 1. Command was: "cc" "-m32" "-lFLAC" "-lm" "-I/home/testgrid/cl-test-grid/work-dir/agent/quicklisp/dists/quicklisp/software/cffi_0.14.0/" "-o" "/home/testgrid/cl-test-grid/work-dir/agent/test-runs/20141103135801-abcl-1.3.1-fasl42-linux-x86/fasl/ql/dists/quicklisp/software/mixalot-20131111-git/flac-grovelling" "/home/testgrid/cl-test-grid/work-dir/agent/test-runs/20141103135801-abcl-1.3.1-fasl42-linux-x86/fasl/ql/dists/quicklisp/software/mixalot-20131111-git/flac-grovelling.c" Output was: /home/testgrid/cl-test-grid/work-dir/agent/test-runs/20141103135801-abcl-1.3.1-fasl42-linux-x86/fasl/ql/dists/quicklisp/software/mixalot-20131111-git/flac-grovelling.c:6:33: fatal error: FLAC/stream_decoder.h: No such file or directory compilation terminated.
ccl-1.10-r16196-f96-linux-x64
(LOAD vorbisfile-ffi FAIL) ffi-grovel, CFFI-GROVEL:GROVEL-ERROR : External process exited with code 1. Command was: "cc" "-m64" "-lvorbisfile" "-I/home/hijarian/systems/cl-test-grid/work-dir/agent/quicklisp/dists/quicklisp/software/cffi_0.14.0/" "-o" "/home/hijarian/systems/cl-test-grid/work-dir/agent/test-runs/20141119112401-ccl-1.10-r16196-f96-linux-x64/fasl/ql/dists/quicklisp/software/mixalot-20131111-git/vorbisfile-grovelling" "/home/hijarian/systems/cl-test-grid/work-dir/agent/test-runs/20141119112401-ccl-1.10-r16196-f96-linux-x64/fasl/ql/dists/quicklisp/software/mixalot-20131111-git/vorbisfile-grovelling.c" Output was: /home/hijarian/systems/cl-test-grid/work-dir/agent/test-runs/20141119112401-ccl-1.10-r16196-f96-linux-x64/fasl/ql/dists/quicklisp/software/mixalot-20131111-git/vorbisfile-grovelling.c:6:31: fatal error: vorbis/vorbisfile.h: Нет такого файла или каталога #include <vorbis/vorbisfile.h> ^ compilation terminated.
(LOAD mixalot-vorbis FAIL) ffi-grovel, CFFI-GROVEL:GROVEL-ERROR : External process exited with code 1. Command was: "cc" "-m64" "-lvorbisfile" "-I/home/hijarian/systems/cl-test-grid/work-dir/agent/quicklisp/dists/quicklisp/software/cffi_0.14.0/" "-o" "/home/hijarian/systems/cl-test-grid/work-dir/agent/test-runs/20141119112401-ccl-1.10-r16196-f96-linux-x64/fasl/ql/dists/quicklisp/software/mixalot-20131111-git/vorbisfile-grovelling" "/home/hijarian/systems/cl-test-grid/work-dir/agent/test-runs/20141119112401-ccl-1.10-r16196-f96-linux-x64/fasl/ql/dists/quicklisp/software/mixalot-20131111-git/vorbisfile-grovelling.c" Output was: /home/hijarian/systems/cl-test-grid/work-dir/agent/test-runs/20141119112401-ccl-1.10-r16196-f96-linux-x64/fasl/ql/dists/quicklisp/software/mixalot-20131111-git/vorbisfile-grovelling.c:6:31: fatal error: vorbis/vorbisfile.h: Нет такого файла или каталога #include <vorbis/vorbisfile.h> ^ compilation terminated.
(LOAD mixalot-flac FAIL) ffi-grovel, CFFI-GROVEL:GROVEL-ERROR : External process exited with code 1. Command was: "cc" "-m64" "-lFLAC" "-lm" "-I/home/hijarian/systems/cl-test-grid/work-dir/agent/quicklisp/dists/quicklisp/software/cffi_0.14.0/" "-o" "/home/hijarian/systems/cl-test-grid/work-dir/agent/test-runs/20141119112401-ccl-1.10-r16196-f96-linux-x64/fasl/ql/dists/quicklisp/software/mixalot-20131111-git/flac-grovelling" "/home/hijarian/systems/cl-test-grid/work-dir/agent/test-runs/20141119112401-ccl-1.10-r16196-f96-linux-x64/fasl/ql/dists/quicklisp/software/mixalot-20131111-git/flac-grovelling.c" Output was: /home/hijarian/systems/cl-test-grid/work-dir/agent/test-runs/20141119112401-ccl-1.10-r16196-f96-linux-x64/fasl/ql/dists/quicklisp/software/mixalot-20131111-git/flac-grovelling.c:6:33: fatal error: FLAC/stream_decoder.h: Нет такого файла или каталога #include <FLAC/stream_decoder.h> ^ compilation terminated.
(LOAD flac FAIL) ffi-grovel, CFFI-GROVEL:GROVEL-ERROR : External process exited with code 1. Command was: "cc" "-m64" "-lFLAC" "-lm" "-I/home/hijarian/systems/cl-test-grid/work-dir/agent/quicklisp/dists/quicklisp/software/cffi_0.14.0/" "-o" "/home/hijarian/systems/cl-test-grid/work-dir/agent/test-runs/20141119112401-ccl-1.10-r16196-f96-linux-x64/fasl/ql/dists/quicklisp/software/mixalot-20131111-git/flac-grovelling" "/home/hijarian/systems/cl-test-grid/work-dir/agent/test-runs/20141119112401-ccl-1.10-r16196-f96-linux-x64/fasl/ql/dists/quicklisp/software/mixalot-20131111-git/flac-grovelling.c" Output was: /home/hijarian/systems/cl-test-grid/work-dir/agent/test-runs/20141119112401-ccl-1.10-r16196-f96-linux-x64/fasl/ql/dists/quicklisp/software/mixalot-20131111-git/flac-grovelling.c:6:33: fatal error: FLAC/stream_decoder.h: Нет такого файла или каталога #include <FLAC/stream_decoder.h> ^ compilation terminated.
ccl-1.8-r15286m-f95-linux-x86
(LOAD vorbisfile-ffi FAIL) ffi-grovel, CFFI-GROVEL:GROVEL-ERROR : External process exited with code 1. Command was: "cc" "-m32" "-lvorbisfile" "-I/home/testgrid/cl-test-grid/work-dir/agent/quicklisp/dists/quicklisp/software/cffi_0.14.0/" "-o" "/home/testgrid/cl-test-grid/work-dir/agent/test-runs/20141115164752-ccl-1.8-r15286m-f95-linux-x86/fasl/ql/dists/quicklisp/software/mixalot-20131111-git/vorbisfile-grovelling" "/home/testgrid/cl-test-grid/work-dir/agent/test-runs/20141115164752-ccl-1.8-r15286m-f95-linux-x86/fasl/ql/dists/quicklisp/software/mixalot-20131111-git/vorbisfile-grovelling.c" Output was: /home/testgrid/cl-test-grid/work-dir/agent/test-runs/20141115164752-ccl-1.8-r15286m-f95-linux-x86/fasl/ql/dists/quicklisp/software/mixalot-20131111-git/vorbisfile-grovelling.c:6:31: fatal error: vorbis/vorbisfile.h: No such file or directory compilation terminated.
(LOAD mpg123-ffi FAIL) ffi, CFFI:LOAD-FOREIGN-LIBRARY-ERROR : Unable to load any of the alternatives: ("libmixalot-mpg123.so.0" "libmpg123.so.0" "/usr/lib/libmpg123.so" "/usr/local/lib/libmpg123.so")
(LOAD mixalot-vorbis FAIL) ffi-grovel, CFFI-GROVEL:GROVEL-ERROR : External process exited with code 1. Command was: "cc" "-m32" "-lvorbisfile" "-I/home/testgrid/cl-test-grid/work-dir/agent/quicklisp/dists/quicklisp/software/cffi_0.14.0/" "-o" "/home/testgrid/cl-test-grid/work-dir/agent/test-runs/20141115164752-ccl-1.8-r15286m-f95-linux-x86/fasl/ql/dists/quicklisp/software/mixalot-20131111-git/vorbisfile-grovelling" "/home/testgrid/cl-test-grid/work-dir/agent/test-runs/20141115164752-ccl-1.8-r15286m-f95-linux-x86/fasl/ql/dists/quicklisp/software/mixalot-20131111-git/vorbisfile-grovelling.c" Output was: /home/testgrid/cl-test-grid/work-dir/agent/test-runs/20141115164752-ccl-1.8-r15286m-f95-linux-x86/fasl/ql/dists/quicklisp/software/mixalot-20131111-git/vorbisfile-grovelling.c:6:31: fatal error: vorbis/vorbisfile.h: No such file or directory compilation terminated.
(LOAD mixalot-mp3 FAIL) ffi, CFFI:LOAD-FOREIGN-LIBRARY-ERROR : Unable to load any of the alternatives: ("libmixalot-mpg123.so.0" "libmpg123.so.0" "/usr/lib/libmpg123.so" "/usr/local/lib/libmpg123.so")
(LOAD mixalot-flac FAIL) ffi-grovel, CFFI-GROVEL:GROVEL-ERROR : External process exited with code 1. Command was: "cc" "-m32" "-lFLAC" "-lm" "-I/home/testgrid/cl-test-grid/work-dir/agent/quicklisp/dists/quicklisp/software/cffi_0.14.0/" "-o" "/home/testgrid/cl-test-grid/work-dir/agent/test-runs/20141115164752-ccl-1.8-r15286m-f95-linux-x86/fasl/ql/dists/quicklisp/software/mixalot-20131111-git/flac-grovelling" "/home/testgrid/cl-test-grid/work-dir/agent/test-runs/20141115164752-ccl-1.8-r15286m-f95-linux-x86/fasl/ql/dists/quicklisp/software/mixalot-20131111-git/flac-grovelling.c" Output was: /home/testgrid/cl-test-grid/work-dir/agent/test-runs/20141115164752-ccl-1.8-r15286m-f95-linux-x86/fasl/ql/dists/quicklisp/software/mixalot-20131111-git/flac-grovelling.c:6:33: fatal error: FLAC/stream_decoder.h: No such file or directory compilation terminated.
(LOAD flac FAIL) ffi-grovel, CFFI-GROVEL:GROVEL-ERROR : External process exited with code 1. Command was: "cc" "-m32" "-lFLAC" "-lm" "-I/home/testgrid/cl-test-grid/work-dir/agent/quicklisp/dists/quicklisp/software/cffi_0.14.0/" "-o" "/home/testgrid/cl-test-grid/work-dir/agent/test-runs/20141115164752-ccl-1.8-r15286m-f95-linux-x86/fasl/ql/dists/quicklisp/software/mixalot-20131111-git/flac-grovelling" "/home/testgrid/cl-test-grid/work-dir/agent/test-runs/20141115164752-ccl-1.8-r15286m-f95-linux-x86/fasl/ql/dists/quicklisp/software/mixalot-20131111-git/flac-grovelling.c" Output was: /home/testgrid/cl-test-grid/work-dir/agent/test-runs/20141115164752-ccl-1.8-r15286m-f95-linux-x86/fasl/ql/dists/quicklisp/software/mixalot-20131111-git/flac-grovelling.c:6:33: fatal error: FLAC/stream_decoder.h: No such file or directory compilation terminated.
(LOAD vorbisfile-ffi FAIL) ffi-grovel, CFFI-GROVEL:GROVEL-ERROR : External process exited with code 1. Command was: "cc" "-m32" "-lvorbisfile" "-I/home/testgrid/cl-test-grid/work-dir/agent/quicklisp/dists/quicklisp/software/cffi_0.14.0/" "-o" "/home/testgrid/cl-test-grid/work-dir/agent/test-runs/20141008055253-ccl-1.8-r15286m-f95-linux-x86/fasl/ql/dists/quicklisp/software/mixalot-20131111-git/vorbisfile-grovelling" "/home/testgrid/cl-test-grid/work-dir/agent/test-runs/20141008055253-ccl-1.8-r15286m-f95-linux-x86/fasl/ql/dists/quicklisp/software/mixalot-20131111-git/vorbisfile-grovelling.c" Output was: /home/testgrid/cl-test-grid/work-dir/agent/test-runs/20141008055253-ccl-1.8-r15286m-f95-linux-x86/fasl/ql/dists/quicklisp/software/mixalot-20131111-git/vorbisfile-grovelling.c:6:31: fatal error: vorbis/vorbisfile.h: No such file or directory compilation terminated.
(LOAD mpg123-ffi FAIL) ffi, CFFI:LOAD-FOREIGN-LIBRARY-ERROR : Unable to load any of the alternatives: ("libmixalot-mpg123.so.0" "libmpg123.so.0" "/usr/lib/libmpg123.so" "/usr/local/lib/libmpg123.so")
(LOAD mixalot-vorbis FAIL) ffi-grovel, CFFI-GROVEL:GROVEL-ERROR : External process exited with code 1. Command was: "cc" "-m32" "-lvorbisfile" "-I/home/testgrid/cl-test-grid/work-dir/agent/quicklisp/dists/quicklisp/software/cffi_0.14.0/" "-o" "/home/testgrid/cl-test-grid/work-dir/agent/test-runs/20141008055253-ccl-1.8-r15286m-f95-linux-x86/fasl/ql/dists/quicklisp/software/mixalot-20131111-git/vorbisfile-grovelling" "/home/testgrid/cl-test-grid/work-dir/agent/test-runs/20141008055253-ccl-1.8-r15286m-f95-linux-x86/fasl/ql/dists/quicklisp/software/mixalot-20131111-git/vorbisfile-grovelling.c" Output was: /home/testgrid/cl-test-grid/work-dir/agent/test-runs/20141008055253-ccl-1.8-r15286m-f95-linux-x86/fasl/ql/dists/quicklisp/software/mixalot-20131111-git/vorbisfile-grovelling.c:6:31: fatal error: vorbis/vorbisfile.h: No such file or directory compilation terminated.
(LOAD mixalot-mp3 FAIL) ffi, CFFI:LOAD-FOREIGN-LIBRARY-ERROR : Unable to load any of the alternatives: ("libmixalot-mpg123.so.0" "libmpg123.so.0" "/usr/lib/libmpg123.so" "/usr/local/lib/libmpg123.so")
(LOAD mixalot-flac FAIL) ffi-grovel, CFFI-GROVEL:GROVEL-ERROR : External process exited with code 1. Command was: "cc" "-m32" "-lFLAC" "-lm" "-I/home/testgrid/cl-test-grid/work-dir/agent/quicklisp/dists/quicklisp/software/cffi_0.14.0/" "-o" "/home/testgrid/cl-test-grid/work-dir/agent/test-runs/20141008055253-ccl-1.8-r15286m-f95-linux-x86/fasl/ql/dists/quicklisp/software/mixalot-20131111-git/flac-grovelling" "/home/testgrid/cl-test-grid/work-dir/agent/test-runs/20141008055253-ccl-1.8-r15286m-f95-linux-x86/fasl/ql/dists/quicklisp/software/mixalot-20131111-git/flac-grovelling.c" Output was: /home/testgrid/cl-test-grid/work-dir/agent/test-runs/20141008055253-ccl-1.8-r15286m-f95-linux-x86/fasl/ql/dists/quicklisp/software/mixalot-20131111-git/flac-grovelling.c:6:33: fatal error: FLAC/stream_decoder.h: No such file or directory compilation terminated.
(LOAD flac FAIL) ffi-grovel, CFFI-GROVEL:GROVEL-ERROR : External process exited with code 1. Command was: "cc" "-m32" "-lFLAC" "-lm" "-I/home/testgrid/cl-test-grid/work-dir/agent/quicklisp/dists/quicklisp/software/cffi_0.14.0/" "-o" "/home/testgrid/cl-test-grid/work-dir/agent/test-runs/20141008055253-ccl-1.8-r15286m-f95-linux-x86/fasl/ql/dists/quicklisp/software/mixalot-20131111-git/flac-grovelling" "/home/testgrid/cl-test-grid/work-dir/agent/test-runs/20141008055253-ccl-1.8-r15286m-f95-linux-x86/fasl/ql/dists/quicklisp/software/mixalot-20131111-git/flac-grovelling.c" Output was: /home/testgrid/cl-test-grid/work-dir/agent/test-runs/20141008055253-ccl-1.8-r15286m-f95-linux-x86/fasl/ql/dists/quicklisp/software/mixalot-20131111-git/flac-grovelling.c:6:33: fatal error: FLAC/stream_decoder.h: No such file or directory compilation terminated.
ccl-1.9-f96-linux-x64
(LOAD vorbisfile-ffi FAIL) ffi-grovel, CFFI-GROVEL:GROVEL-ERROR : External process exited with code 1. Command was: "cc" "-m64" "-lvorbisfile" "-I/home/hijarian/systems/cl-test-grid/work-dir/agent/quicklisp/dists/quicklisp/software/cffi_0.14.0/" "-o" "/home/hijarian/systems/cl-test-grid/work-dir/agent/test-runs/20141007093127-ccl-1.9-f96-linux-x64/fasl/ql/dists/quicklisp/software/mixalot-20131111-git/vorbisfile-grovelling" "/home/hijarian/systems/cl-test-grid/work-dir/agent/test-runs/20141007093127-ccl-1.9-f96-linux-x64/fasl/ql/dists/quicklisp/software/mixalot-20131111-git/vorbisfile-grovelling.c" Output was: /home/hijarian/systems/cl-test-grid/work-dir/agent/test-runs/20141007093127-ccl-1.9-f96-linux-x64/fasl/ql/dists/quicklisp/software/mixalot-20131111-git/vorbisfile-grovelling.c:6:31: fatal error: vorbis/vorbisfile.h: Нет такого файла или каталога compilation terminated.
(LOAD mixalot-vorbis FAIL) ffi-grovel, CFFI-GROVEL:GROVEL-ERROR : External process exited with code 1. Command was: "cc" "-m64" "-lvorbisfile" "-I/home/hijarian/systems/cl-test-grid/work-dir/agent/quicklisp/dists/quicklisp/software/cffi_0.14.0/" "-o" "/home/hijarian/systems/cl-test-grid/work-dir/agent/test-runs/20141007093127-ccl-1.9-f96-linux-x64/fasl/ql/dists/quicklisp/software/mixalot-20131111-git/vorbisfile-grovelling" "/home/hijarian/systems/cl-test-grid/work-dir/agent/test-runs/20141007093127-ccl-1.9-f96-linux-x64/fasl/ql/dists/quicklisp/software/mixalot-20131111-git/vorbisfile-grovelling.c" Output was: /home/hijarian/systems/cl-test-grid/work-dir/agent/test-runs/20141007093127-ccl-1.9-f96-linux-x64/fasl/ql/dists/quicklisp/software/mixalot-20131111-git/vorbisfile-grovelling.c:6:31: fatal error: vorbis/vorbisfile.h: Нет такого файла или каталога compilation terminated.
(LOAD mixalot-flac FAIL) ffi-grovel, CFFI-GROVEL:GROVEL-ERROR : External process exited with code 1. Command was: "cc" "-m64" "-lFLAC" "-lm" "-I/home/hijarian/systems/cl-test-grid/work-dir/agent/quicklisp/dists/quicklisp/software/cffi_0.14.0/" "-o" "/home/hijarian/systems/cl-test-grid/work-dir/agent/test-runs/20141007093127-ccl-1.9-f96-linux-x64/fasl/ql/dists/quicklisp/software/mixalot-20131111-git/flac-grovelling" "/home/hijarian/systems/cl-test-grid/work-dir/agent/test-runs/20141007093127-ccl-1.9-f96-linux-x64/fasl/ql/dists/quicklisp/software/mixalot-20131111-git/flac-grovelling.c" Output was: /home/hijarian/systems/cl-test-grid/work-dir/agent/test-runs/20141007093127-ccl-1.9-f96-linux-x64/fasl/ql/dists/quicklisp/software/mixalot-20131111-git/flac-grovelling.c:6:33: fatal error: FLAC/stream_decoder.h: Нет такого файла или каталога compilation terminated.
(LOAD flac FAIL) ffi-grovel, CFFI-GROVEL:GROVEL-ERROR : External process exited with code 1. Command was: "cc" "-m64" "-lFLAC" "-lm" "-I/home/hijarian/systems/cl-test-grid/work-dir/agent/quicklisp/dists/quicklisp/software/cffi_0.14.0/" "-o" "/home/hijarian/systems/cl-test-grid/work-dir/agent/test-runs/20141007093127-ccl-1.9-f96-linux-x64/fasl/ql/dists/quicklisp/software/mixalot-20131111-git/flac-grovelling" "/home/hijarian/systems/cl-test-grid/work-dir/agent/test-runs/20141007093127-ccl-1.9-f96-linux-x64/fasl/ql/dists/quicklisp/software/mixalot-20131111-git/flac-grovelling.c" Output was: /home/hijarian/systems/cl-test-grid/work-dir/agent/test-runs/20141007093127-ccl-1.9-f96-linux-x64/fasl/ql/dists/quicklisp/software/mixalot-20131111-git/flac-grovelling.c:6:33: fatal error: FLAC/stream_decoder.h: Нет такого файла или каталога compilation terminated.
ccl-1.9-r15756-f96-linux-x86
(LOAD vorbisfile-ffi FAIL) ffi-grovel, CFFI-GROVEL:GROVEL-ERROR : External process exited with code 1. Command was: "cc" "-m32" "-lvorbisfile" "-I/home/testgrid/cl-test-grid/work-dir/agent/quicklisp/dists/quicklisp/software/cffi_0.14.0/" "-o" "/home/testgrid/cl-test-grid/work-dir/agent/test-runs/20141115074638-ccl-1.9-r15756-f96-linux-x86/fasl/ql/dists/quicklisp/software/mixalot-20131111-git/vorbisfile-grovelling" "/home/testgrid/cl-test-grid/work-dir/agent/test-runs/20141115074638-ccl-1.9-r15756-f96-linux-x86/fasl/ql/dists/quicklisp/software/mixalot-20131111-git/vorbisfile-grovelling.c" Output was: /home/testgrid/cl-test-grid/work-dir/agent/test-runs/20141115074638-ccl-1.9-r15756-f96-linux-x86/fasl/ql/dists/quicklisp/software/mixalot-20131111-git/vorbisfile-grovelling.c:6:31: fatal error: vorbis/vorbisfile.h: No such file or directory compilation terminated.
(LOAD mpg123-ffi FAIL) ffi, CFFI:LOAD-FOREIGN-LIBRARY-ERROR : Unable to load any of the alternatives: ("libmixalot-mpg123.so.0" "libmpg123.so.0" "/usr/lib/libmpg123.so" "/usr/local/lib/libmpg123.so")
(LOAD mixalot-vorbis FAIL) ffi-grovel, CFFI-GROVEL:GROVEL-ERROR : External process exited with code 1. Command was: "cc" "-m32" "-lvorbisfile" "-I/home/testgrid/cl-test-grid/work-dir/agent/quicklisp/dists/quicklisp/software/cffi_0.14.0/" "-o" "/home/testgrid/cl-test-grid/work-dir/agent/test-runs/20141115074638-ccl-1.9-r15756-f96-linux-x86/fasl/ql/dists/quicklisp/software/mixalot-20131111-git/vorbisfile-grovelling" "/home/testgrid/cl-test-grid/work-dir/agent/test-runs/20141115074638-ccl-1.9-r15756-f96-linux-x86/fasl/ql/dists/quicklisp/software/mixalot-20131111-git/vorbisfile-grovelling.c" Output was: /home/testgrid/cl-test-grid/work-dir/agent/test-runs/20141115074638-ccl-1.9-r15756-f96-linux-x86/fasl/ql/dists/quicklisp/software/mixalot-20131111-git/vorbisfile-grovelling.c:6:31: fatal error: vorbis/vorbisfile.h: No such file or directory compilation terminated.
(LOAD mixalot-mp3 FAIL) ffi, CFFI:LOAD-FOREIGN-LIBRARY-ERROR : Unable to load any of the alternatives: ("libmixalot-mpg123.so.0" "libmpg123.so.0" "/usr/lib/libmpg123.so" "/usr/local/lib/libmpg123.so")
(LOAD mixalot-flac FAIL) ffi-grovel, CFFI-GROVEL:GROVEL-ERROR : External process exited with code 1. Command was: "cc" "-m32" "-lFLAC" "-lm" "-I/home/testgrid/cl-test-grid/work-dir/agent/quicklisp/dists/quicklisp/software/cffi_0.14.0/" "-o" "/home/testgrid/cl-test-grid/work-dir/agent/test-runs/20141115074638-ccl-1.9-r15756-f96-linux-x86/fasl/ql/dists/quicklisp/software/mixalot-20131111-git/flac-grovelling" "/home/testgrid/cl-test-grid/work-dir/agent/test-runs/20141115074638-ccl-1.9-r15756-f96-linux-x86/fasl/ql/dists/quicklisp/software/mixalot-20131111-git/flac-grovelling.c" Output was: /home/testgrid/cl-test-grid/work-dir/agent/test-runs/20141115074638-ccl-1.9-r15756-f96-linux-x86/fasl/ql/dists/quicklisp/software/mixalot-20131111-git/flac-grovelling.c:6:33: fatal error: FLAC/stream_decoder.h: No such file or directory compilation terminated.
(LOAD flac FAIL) ffi-grovel, CFFI-GROVEL:GROVEL-ERROR : External process exited with code 1. Command was: "cc" "-m32" "-lFLAC" "-lm" "-I/home/testgrid/cl-test-grid/work-dir/agent/quicklisp/dists/quicklisp/software/cffi_0.14.0/" "-o" "/home/testgrid/cl-test-grid/work-dir/agent/test-runs/20141115074638-ccl-1.9-r15756-f96-linux-x86/fasl/ql/dists/quicklisp/software/mixalot-20131111-git/flac-grovelling" "/home/testgrid/cl-test-grid/work-dir/agent/test-runs/20141115074638-ccl-1.9-r15756-f96-linux-x86/fasl/ql/dists/quicklisp/software/mixalot-20131111-git/flac-grovelling.c" Output was: /home/testgrid/cl-test-grid/work-dir/agent/test-runs/20141115074638-ccl-1.9-r15756-f96-linux-x86/fasl/ql/dists/quicklisp/software/mixalot-20131111-git/flac-grovelling.c:6:33: fatal error: FLAC/stream_decoder.h: No such file or directory compilation terminated.
(LOAD vorbisfile-ffi FAIL) ffi-grovel, CFFI-GROVEL:GROVEL-ERROR : External process exited with code 1. Command was: "cc" "-m32" "-lvorbisfile" "-I/home/testgrid/cl-test-grid/work-dir/agent/quicklisp/dists/quicklisp/software/cffi_0.14.0/" "-o" "/home/testgrid/cl-test-grid/work-dir/agent/test-runs/20141007045958-ccl-1.9-r15756-f96-linux-x86/fasl/ql/dists/quicklisp/software/mixalot-20131111-git/vorbisfile-grovelling" "/home/testgrid/cl-test-grid/work-dir/agent/test-runs/20141007045958-ccl-1.9-r15756-f96-linux-x86/fasl/ql/dists/quicklisp/software/mixalot-20131111-git/vorbisfile-grovelling.c" Output was: /home/testgrid/cl-test-grid/work-dir/agent/test-runs/20141007045958-ccl-1.9-r15756-f96-linux-x86/fasl/ql/dists/quicklisp/software/mixalot-20131111-git/vorbisfile-grovelling.c:6:31: fatal error: vorbis/vorbisfile.h: No such file or directory compilation terminated.
(LOAD mpg123-ffi FAIL) ffi, CFFI:LOAD-FOREIGN-LIBRARY-ERROR : Unable to load any of the alternatives: ("libmixalot-mpg123.so.0" "libmpg123.so.0" "/usr/lib/libmpg123.so" "/usr/local/lib/libmpg123.so")
(LOAD mixalot-vorbis FAIL) ffi-grovel, CFFI-GROVEL:GROVEL-ERROR : External process exited with code 1. Command was: "cc" "-m32" "-lvorbisfile" "-I/home/testgrid/cl-test-grid/work-dir/agent/quicklisp/dists/quicklisp/software/cffi_0.14.0/" "-o" "/home/testgrid/cl-test-grid/work-dir/agent/test-runs/20141007045958-ccl-1.9-r15756-f96-linux-x86/fasl/ql/dists/quicklisp/software/mixalot-20131111-git/vorbisfile-grovelling" "/home/testgrid/cl-test-grid/work-dir/agent/test-runs/20141007045958-ccl-1.9-r15756-f96-linux-x86/fasl/ql/dists/quicklisp/software/mixalot-20131111-git/vorbisfile-grovelling.c" Output was: /home/testgrid/cl-test-grid/work-dir/agent/test-runs/20141007045958-ccl-1.9-r15756-f96-linux-x86/fasl/ql/dists/quicklisp/software/mixalot-20131111-git/vorbisfile-grovelling.c:6:31: fatal error: vorbis/vorbisfile.h: No such file or directory compilation terminated.
(LOAD mixalot-mp3 FAIL) ffi, CFFI:LOAD-FOREIGN-LIBRARY-ERROR : Unable to load any of the alternatives: ("libmixalot-mpg123.so.0" "libmpg123.so.0" "/usr/lib/libmpg123.so" "/usr/local/lib/libmpg123.so")
(LOAD mixalot-flac FAIL) ffi-grovel, CFFI-GROVEL:GROVEL-ERROR : External process exited with code 1. Command was: "cc" "-m32" "-lFLAC" "-lm" "-I/home/testgrid/cl-test-grid/work-dir/agent/quicklisp/dists/quicklisp/software/cffi_0.14.0/" "-o" "/home/testgrid/cl-test-grid/work-dir/agent/test-runs/20141007045958-ccl-1.9-r15756-f96-linux-x86/fasl/ql/dists/quicklisp/software/mixalot-20131111-git/flac-grovelling" "/home/testgrid/cl-test-grid/work-dir/agent/test-runs/20141007045958-ccl-1.9-r15756-f96-linux-x86/fasl/ql/dists/quicklisp/software/mixalot-20131111-git/flac-grovelling.c" Output was: /home/testgrid/cl-test-grid/work-dir/agent/test-runs/20141007045958-ccl-1.9-r15756-f96-linux-x86/fasl/ql/dists/quicklisp/software/mixalot-20131111-git/flac-grovelling.c:6:33: fatal error: FLAC/stream_decoder.h: No such file or directory compilation terminated.
(LOAD flac FAIL) ffi-grovel, CFFI-GROVEL:GROVEL-ERROR : External process exited with code 1. Command was: "cc" "-m32" "-lFLAC" "-lm" "-I/home/testgrid/cl-test-grid/work-dir/agent/quicklisp/dists/quicklisp/software/cffi_0.14.0/" "-o" "/home/testgrid/cl-test-grid/work-dir/agent/test-runs/20141007045958-ccl-1.9-r15756-f96-linux-x86/fasl/ql/dists/quicklisp/software/mixalot-20131111-git/flac-grovelling" "/home/testgrid/cl-test-grid/work-dir/agent/test-runs/20141007045958-ccl-1.9-r15756-f96-linux-x86/fasl/ql/dists/quicklisp/software/mixalot-20131111-git/flac-grovelling.c" Output was: /home/testgrid/cl-test-grid/work-dir/agent/test-runs/20141007045958-ccl-1.9-r15756-f96-linux-x86/fasl/ql/dists/quicklisp/software/mixalot-20131111-git/flac-grovelling.c:6:33: fatal error: FLAC/stream_decoder.h: No such file or directory compilation terminated.
ccl-1.9-r15758-f96-macosx-x86
(LOAD vorbisfile-ffi FAIL) ffi-grovel, CFFI-GROVEL:GROVEL-ERROR : External process exited with code 1. Command was: "cc" "-m32" "-I" "/opt/local/include/" "-lvorbisfile" "-I/opt/local/include/" "-L/opt/local/lib/" "-I/usr/local/include/" "-L/usr/local/lib/" "-I/Users/pnathan/cl-test-grid/work-dir/agent/quicklisp/dists/quicklisp/software/cffi_0.14.0/" "-o" "/Users/pnathan/cl-test-grid/work-dir/agent/test-runs/20141128034202-ccl-1.9-r15758-f96-macosx-x86/fasl/ql/dists/quicklisp/software/mixalot-20131111-git/vorbisfile-grovelling" "/Users/pnathan/cl-test-grid/work-dir/agent/test-runs/20141128034202-ccl-1.9-r15758-f96-macosx-x86/fasl/ql/dists/quicklisp/software/mixalot-20131111-git/vorbisfile-grovelling.c" Output was: /Users/pnathan/cl-test-grid/work-dir/agent/test-runs/20141128034202-ccl-1.9-r15758-f96-macosx-x86/fasl/ql/dists/quicklisp/software/mixalot-20131111-git/vorbisfile-grovelling.c:6:31: error: vorbis/vorbisfile.h: No such file or directory /Users/pnathan/cl-test-grid/work-dir/agent/test-runs/20141128034202-ccl-1.9-r15758-f96-macosx-x86/fasl/ql/dists/quicklisp/software/mixalot-20131111-git/vorbisfile-grovelling.c: In function ‘main’: /Users/pnathan/cl-test-grid/work-dir/agent/test-runs/20141128034202-ccl-1.9-r15758-f96-macosx-x86/fasl/ql/dists/quicklisp/software/mixalot-20131111-git/vorbisfile-grovelling.c:20: error: ‘OggVorbis_File’ undeclared (first use in this function) /Users/pnathan/cl-test-grid/work-dir/agent/test-runs/20141128034202-ccl-1.9-r15758-f96-macosx-x86/fasl/ql/dists/quicklisp/software/mixalot-20131111-git/vorbisfile-grovelling.c:20: error: (Each undeclared identifier is reported only once /Users/pnathan/cl-test-grid/work-dir/agent/test-runs/20141128034202-ccl-1.9-r15758-f96-macosx-x86/fasl/ql/dists/quicklisp/software/mixalot-20131111-git/vorbisfile-grovelling.c:20: error: for each function it appears in.) /Users/pnathan/cl-test-grid/work-dir/agent/test-runs/20141128034202-ccl-1.9-r15758-f96-macosx-x86/fasl/ql/dists/quicklisp/software/mixalot-20131111-git/vorbisfile-grovelling.c:31: error: ‘vorbis_info’ undeclared (first use in this function) /Users/pnathan/cl-test-grid/work-dir/agent/test-runs/20141128034202-ccl-1.9-r15758-f96-macosx-x86/fasl/ql/dists/quicklisp/software/mixalot-20131111-git/vorbisfile-grovelling.c:36: error: expected expression before ‘)’ token /Users/pnathan/cl-test-grid/work-dir/agent/test-runs/20141128034202-ccl-1.9-r15758-f96-macosx-x86/fasl/ql/dists/quicklisp/software/mixalot-20131111-git/vorbisfile-grovelling.c:41: error: expected expression before ‘)’ token /Users/pnathan/cl-test-grid/work-dir/agent/test-runs/20141128034202-ccl-1.9-r15758-f96-macosx-x86/fasl/ql/dists/quicklisp/software/mixalot-20131111-git/vorbisfile-grovelling.c:46: error: expected expression before ‘)’ token /Users/pnathan/cl-test-grid/work-dir/agent/test-runs/20141128034202-ccl-1.9-r15758-f96-macosx-x86/fasl/ql/dists/quicklisp/software/mixalot-20131111-git/vorbisfile-grovelling.c:57: error: ‘vorbis_comment’ undeclared (first use in this function) /Users/pnathan/cl-test-grid/work-dir/agent/test-runs/20141128034202-ccl-1.9-r15758-f96-macosx-x86/fasl/ql/dists/quicklisp/software/mixalot-20131111-git/vorbisfile-grovelling.c:62: error: expected expression before ‘)’ token /Users/pnathan/cl-test-grid/work-dir/agent/test-runs/20141128034202-ccl-1.9-r15758-f96-macosx-x86/fasl/ql/dists/quicklisp/software/mixalot-20131111-git/vorbisfile-grovelling.c:67: error: expected expression before ‘)’ token /Users/pnathan/cl-test-grid/work-dir/agent/test-runs/20141128034202-ccl-1.9-r15758-f96-macosx-x86/fasl/ql/dists/quicklisp/software/mixalot-20131111-git/vorbisfile-grovelling.c:72: error: expected expression before ‘)’ token /Users/pnathan/cl-test-grid/work-dir/agent/test-runs/20141128034202-ccl-1.9-r15758-f96-macosx-x86/fasl/ql/dists/quicklisp/software/mixalot-20131111-git/vorbisfile-grovelling.c:77: error: expected expression before ‘)’ token
(LOAD mpg123-ffi FAIL) ffi, CFFI:LOAD-FOREIGN-LIBRARY-ERROR : Unable to load any of the alternatives: ("libmpg123.dylib" "libmpg123.0.dylib" "/opt/local/lib/libmpg123.0.dylib")
(LOAD mixalot-vorbis FAIL) ffi, CFFI:LOAD-FOREIGN-LIBRARY-ERROR : Unable to load any of the alternatives: ("libao.4.dylib" "/opt/local/lib/libao.4.dylib")
(LOAD mixalot-mp3 FAIL) ffi, CFFI:LOAD-FOREIGN-LIBRARY-ERROR : Unable to load any of the alternatives: ("libao.4.dylib" "/opt/local/lib/libao.4.dylib")
(LOAD mixalot-flac FAIL) ffi, CFFI:LOAD-FOREIGN-LIBRARY-ERROR : Unable to load any of the alternatives: ("libao.4.dylib" "/opt/local/lib/libao.4.dylib")
(LOAD mixalot FAIL) ffi, CFFI:LOAD-FOREIGN-LIBRARY-ERROR : Unable to load any of the alternatives: ("libao.4.dylib" "/opt/local/lib/libao.4.dylib")
(LOAD vorbisfile-ffi FAIL) ffi-grovel, CFFI-GROVEL:GROVEL-ERROR : External process exited with code 1. Command was: "cc" "-m32" "-I" "/opt/local/include/" "-lvorbisfile" "-I/opt/local/include/" "-L/opt/local/lib/" "-I/usr/local/include/" "-L/usr/local/lib/" "-I/Users/pnathan/cl-test-grid/work-dir/agent/quicklisp/dists/quicklisp/software/cffi_0.14.0/" "-o" "/Users/pnathan/cl-test-grid/work-dir/agent/test-runs/20141030074304-ccl-1.9-r15758-f96-macosx-x86/fasl/ql/dists/quicklisp/software/mixalot-20131111-git/vorbisfile-grovelling" "/Users/pnathan/cl-test-grid/work-dir/agent/test-runs/20141030074304-ccl-1.9-r15758-f96-macosx-x86/fasl/ql/dists/quicklisp/software/mixalot-20131111-git/vorbisfile-grovelling.c" Output was: /Users/pnathan/cl-test-grid/work-dir/agent/test-runs/20141030074304-ccl-1.9-r15758-f96-macosx-x86/fasl/ql/dists/quicklisp/software/mixalot-20131111-git/vorbisfile-grovelling.c:6:31: error: vorbis/vorbisfile.h: No such file or directory /Users/pnathan/cl-test-grid/work-dir/agent/test-runs/20141030074304-ccl-1.9-r15758-f96-macosx-x86/fasl/ql/dists/quicklisp/software/mixalot-20131111-git/vorbisfile-grovelling.c: In function ‘main’: /Users/pnathan/cl-test-grid/work-dir/agent/test-runs/20141030074304-ccl-1.9-r15758-f96-macosx-x86/fasl/ql/dists/quicklisp/software/mixalot-20131111-git/vorbisfile-grovelling.c:20: error: ‘OggVorbis_File’ undeclared (first use in this function) /Users/pnathan/cl-test-grid/work-dir/agent/test-runs/20141030074304-ccl-1.9-r15758-f96-macosx-x86/fasl/ql/dists/quicklisp/software/mixalot-20131111-git/vorbisfile-grovelling.c:20: error: (Each undeclared identifier is reported only once /Users/pnathan/cl-test-grid/work-dir/agent/test-runs/20141030074304-ccl-1.9-r15758-f96-macosx-x86/fasl/ql/dists/quicklisp/software/mixalot-20131111-git/vorbisfile-grovelling.c:20: error: for each function it appears in.) /Users/pnathan/cl-test-grid/work-dir/agent/test-runs/20141030074304-ccl-1.9-r15758-f96-macosx-x86/fasl/ql/dists/quicklisp/software/mixalot-20131111-git/vorbisfile-grovelling.c:31: error: ‘vorbis_info’ undeclared (first use in this function) /Users/pnathan/cl-test-grid/work-dir/agent/test-runs/20141030074304-ccl-1.9-r15758-f96-macosx-x86/fasl/ql/dists/quicklisp/software/mixalot-20131111-git/vorbisfile-grovelling.c:36: error: expected expression before ‘)’ token /Users/pnathan/cl-test-grid/work-dir/agent/test-runs/20141030074304-ccl-1.9-r15758-f96-macosx-x86/fasl/ql/dists/quicklisp/software/mixalot-20131111-git/vorbisfile-grovelling.c:41: error: expected expression before ‘)’ token /Users/pnathan/cl-test-grid/work-dir/agent/test-runs/20141030074304-ccl-1.9-r15758-f96-macosx-x86/fasl/ql/dists/quicklisp/software/mixalot-20131111-git/vorbisfile-grovelling.c:46: error: expected expression before ‘)’ token /Users/pnathan/cl-test-grid/work-dir/agent/test-runs/20141030074304-ccl-1.9-r15758-f96-macosx-x86/fasl/ql/dists/quicklisp/software/mixalot-20131111-git/vorbisfile-grovelling.c:57: error: ‘vorbis_comment’ undeclared (first use in this function) /Users/pnathan/cl-test-grid/work-dir/agent/test-runs/20141030074304-ccl-1.9-r15758-f96-macosx-x86/fasl/ql/dists/quicklisp/software/mixalot-20131111-git/vorbisfile-grovelling.c:62: error: expected expression before ‘)’ token /Users/pnathan/cl-test-grid/work-dir/agent/test-runs/20141030074304-ccl-1.9-r15758-f96-macosx-x86/fasl/ql/dists/quicklisp/software/mixalot-20131111-git/vorbisfile-grovelling.c:67: error: expected expression before ‘)’ token /Users/pnathan/cl-test-grid/work-dir/agent/test-runs/20141030074304-ccl-1.9-r15758-f96-macosx-x86/fasl/ql/dists/quicklisp/software/mixalot-20131111-git/vorbisfile-grovelling.c:72: error: expected expression before ‘)’ token /Users/pnathan/cl-test-grid/work-dir/agent/test-runs/20141030074304-ccl-1.9-r15758-f96-macosx-x86/fasl/ql/dists/quicklisp/software/mixalot-20131111-git/vorbisfile-grovelling.c:77: error: expected expression before ‘)’ token
(LOAD mpg123-ffi FAIL) ffi, CFFI:LOAD-FOREIGN-LIBRARY-ERROR : Unable to load any of the alternatives: ("libmpg123.dylib" "libmpg123.0.dylib" "/opt/local/lib/libmpg123.0.dylib")
(LOAD mixalot-vorbis FAIL) ffi, CFFI:LOAD-FOREIGN-LIBRARY-ERROR : Unable to load any of the alternatives: ("libao.4.dylib" "/opt/local/lib/libao.4.dylib")
(LOAD mixalot-mp3 FAIL) ffi, CFFI:LOAD-FOREIGN-LIBRARY-ERROR : Unable to load any of the alternatives: ("libao.4.dylib" "/opt/local/lib/libao.4.dylib")
(LOAD mixalot-flac FAIL) ffi, CFFI:LOAD-FOREIGN-LIBRARY-ERROR : Unable to load any of the alternatives: ("libao.4.dylib" "/opt/local/lib/libao.4.dylib")
(LOAD mixalot FAIL) ffi, CFFI:LOAD-FOREIGN-LIBRARY-ERROR : Unable to load any of the alternatives: ("libao.4.dylib" "/opt/local/lib/libao.4.dylib")
ccl-1.9-r15759-f96-macosx-x64
(LOAD vorbisfile-ffi FAIL) ffi-grovel, CFFI-GROVEL:GROVEL-ERROR : External process exited with code 1. Command was: "cc" "-m64" "-I" "/opt/local/include/" "-lvorbisfile" "-I/opt/local/include/" "-L/opt/local/lib/" "-I/usr/local/include/" "-L/usr/local/lib/" "-I/Users/pnathan/cl-test-grid/work-dir/agent/quicklisp/dists/quicklisp/software/cffi_0.14.0/" "-o" "/Users/pnathan/cl-test-grid/work-dir/agent/test-runs/20141105004833-ccl-1.9-r15759-f96-macosx-x64/fasl/ql/dists/quicklisp/software/mixalot-20131111-git/vorbisfile-grovelling" "/Users/pnathan/cl-test-grid/work-dir/agent/test-runs/20141105004833-ccl-1.9-r15759-f96-macosx-x64/fasl/ql/dists/quicklisp/software/mixalot-20131111-git/vorbisfile-grovelling.c" Output was: /Users/pnathan/cl-test-grid/work-dir/agent/test-runs/20141105004833-ccl-1.9-r15759-f96-macosx-x64/fasl/ql/dists/quicklisp/software/mixalot-20131111-git/vorbisfile-grovelling.c:6:31: error: vorbis/vorbisfile.h: No such file or directory /Users/pnathan/cl-test-grid/work-dir/agent/test-runs/20141105004833-ccl-1.9-r15759-f96-macosx-x64/fasl/ql/dists/quicklisp/software/mixalot-20131111-git/vorbisfile-grovelling.c: In function ‘main’: /Users/pnathan/cl-test-grid/work-dir/agent/test-runs/20141105004833-ccl-1.9-r15759-f96-macosx-x64/fasl/ql/dists/quicklisp/software/mixalot-20131111-git/vorbisfile-grovelling.c:20: error: ‘OggVorbis_File’ undeclared (first use in this function) /Users/pnathan/cl-test-grid/work-dir/agent/test-runs/20141105004833-ccl-1.9-r15759-f96-macosx-x64/fasl/ql/dists/quicklisp/software/mixalot-20131111-git/vorbisfile-grovelling.c:20: error: (Each undeclared identifier is reported only once /Users/pnathan/cl-test-grid/work-dir/agent/test-runs/20141105004833-ccl-1.9-r15759-f96-macosx-x64/fasl/ql/dists/quicklisp/software/mixalot-20131111-git/vorbisfile-grovelling.c:20: error: for each function it appears in.) /Users/pnathan/cl-test-grid/work-dir/agent/test-runs/20141105004833-ccl-1.9-r15759-f96-macosx-x64/fasl/ql/dists/quicklisp/software/mixalot-20131111-git/vorbisfile-grovelling.c:31: error: ‘vorbis_info’ undeclared (first use in this function) /Users/pnathan/cl-test-grid/work-dir/agent/test-runs/20141105004833-ccl-1.9-r15759-f96-macosx-x64/fasl/ql/dists/quicklisp/software/mixalot-20131111-git/vorbisfile-grovelling.c:36: error: expected expression before ‘)’ token /Users/pnathan/cl-test-grid/work-dir/agent/test-runs/20141105004833-ccl-1.9-r15759-f96-macosx-x64/fasl/ql/dists/quicklisp/software/mixalot-20131111-git/vorbisfile-grovelling.c:41: error: expected expression before ‘)’ token /Users/pnathan/cl-test-grid/work-dir/agent/test-runs/20141105004833-ccl-1.9-r15759-f96-macosx-x64/fasl/ql/dists/quicklisp/software/mixalot-20131111-git/vorbisfile-grovelling.c:46: error: expected expression before ‘)’ token /Users/pnathan/cl-test-grid/work-dir/agent/test-runs/20141105004833-ccl-1.9-r15759-f96-macosx-x64/fasl/ql/dists/quicklisp/software/mixalot-20131111-git/vorbisfile-grovelling.c:57: error: ‘vorbis_comment’ undeclared (first use in this function) /Users/pnathan/cl-test-grid/work-dir/agent/test-runs/20141105004833-ccl-1.9-r15759-f96-macosx-x64/fasl/ql/dists/quicklisp/software/mixalot-20131111-git/vorbisfile-grovelling.c:62: error: expected expression before ‘)’ token /Users/pnathan/cl-test-grid/work-dir/agent/test-runs/20141105004833-ccl-1.9-r15759-f96-macosx-x64/fasl/ql/dists/quicklisp/software/mixalot-20131111-git/vorbisfile-grovelling.c:67: error: expected expression before ‘)’ token /Users/pnathan/cl-test-grid/work-dir/agent/test-runs/20141105004833-ccl-1.9-r15759-f96-macosx-x64/fasl/ql/dists/quicklisp/software/mixalot-20131111-git/vorbisfile-grovelling.c:72: error: expected expression before ‘)’ token /Users/pnathan/cl-test-grid/work-dir/agent/test-runs/20141105004833-ccl-1.9-r15759-f96-macosx-x64/fasl/ql/dists/quicklisp/software/mixalot-20131111-git/vorbisfile-grovelling.c:77: error: expected expression before ‘)’ token
(LOAD mpg123-ffi FAIL) ffi, CFFI:LOAD-FOREIGN-LIBRARY-ERROR : Unable to load any of the alternatives: ("libmpg123.dylib" "libmpg123.0.dylib" "/opt/local/lib/libmpg123.0.dylib")
(LOAD mixalot-vorbis FAIL) ffi, CFFI:LOAD-FOREIGN-LIBRARY-ERROR : Unable to load any of the alternatives: ("libao.4.dylib" "/opt/local/lib/libao.4.dylib")
(LOAD mixalot-mp3 FAIL) ffi, CFFI:LOAD-FOREIGN-LIBRARY-ERROR : Unable to load any of the alternatives: ("libao.4.dylib" "/opt/local/lib/libao.4.dylib")
(LOAD mixalot-flac FAIL) ffi, CFFI:LOAD-FOREIGN-LIBRARY-ERROR : Unable to load any of the alternatives: ("libao.4.dylib" "/opt/local/lib/libao.4.dylib")
(LOAD mixalot FAIL) ffi, CFFI:LOAD-FOREIGN-LIBRARY-ERROR : Unable to load any of the alternatives: ("libao.4.dylib" "/opt/local/lib/libao.4.dylib")
(LOAD flac FAIL) ffi, CFFI:LOAD-FOREIGN-LIBRARY-ERROR : Unable to load any of the alternatives: ("libFLAC.dylib" "/opt/local/lib/libFLAC.dylib")
clisp-2.49-unix-i386
(LOAD vorbisfile-ffi FAIL) ffi, ASDF:LOAD-SYSTEM-DEFINITION-ERROR : Error while trying to load definition for system vorbisfile-ffi from pathname /Users/pnathan/cl-test-grid/work-dir/agent/quicklisp/dists/quicklisp/software/mixalot-20131111-git/vorbisfile-ffi.asd: CFFI requires CLISP compiled with dynamic FFI support.
(LOAD mpg123-ffi FAIL) ffi, COMMON-LISP:SIMPLE-ERROR : CFFI requires CLISP compiled with dynamic FFI support.
(LOAD mixalot-vorbis FAIL) ffi, ASDF:LOAD-SYSTEM-DEFINITION-ERROR : Error while trying to load definition for system vorbisfile-ffi from pathname /Users/pnathan/cl-test-grid/work-dir/agent/quicklisp/dists/quicklisp/software/mixalot-20131111-git/vorbisfile-ffi.asd: CFFI requires CLISP compiled with dynamic FFI support.
(LOAD mixalot-mp3 FAIL) ffi, COMMON-LISP:SIMPLE-ERROR : CFFI requires CLISP compiled with dynamic FFI support.
(LOAD mixalot-flac FAIL) ffi, ASDF:LOAD-SYSTEM-DEFINITION-ERROR : Error while trying to load definition for system flac from pathname /Users/pnathan/cl-test-grid/work-dir/agent/quicklisp/dists/quicklisp/software/mixalot-20131111-git/flac.asd: CFFI requires CLISP compiled with dynamic FFI support.
(LOAD mixalot FAIL) ffi, COMMON-LISP:SIMPLE-ERROR : CFFI requires CLISP compiled with dynamic FFI support.
(LOAD flac FAIL) ffi, ASDF:LOAD-SYSTEM-DEFINITION-ERROR : Error while trying to load definition for system flac from pathname /Users/pnathan/cl-test-grid/work-dir/agent/quicklisp/dists/quicklisp/software/mixalot-20131111-git/flac.asd: CFFI requires CLISP compiled with dynamic FFI support.
(LOAD vorbisfile-ffi FAIL) ffi, ASDF:LOAD-SYSTEM-DEFINITION-ERROR : Error while trying to load definition for system vorbisfile-ffi from pathname /Users/pnathan/cl-test-grid/work-dir/agent/quicklisp/dists/quicklisp/software/mixalot-20131111-git/vorbisfile-ffi.asd: CFFI requires CLISP compiled with dynamic FFI support.
(LOAD mpg123-ffi FAIL) ffi, COMMON-LISP:SIMPLE-ERROR : CFFI requires CLISP compiled with dynamic FFI support.
(LOAD mixalot-vorbis FAIL) ffi, ASDF:LOAD-SYSTEM-DEFINITION-ERROR : Error while trying to load definition for system vorbisfile-ffi from pathname /Users/pnathan/cl-test-grid/work-dir/agent/quicklisp/dists/quicklisp/software/mixalot-20131111-git/vorbisfile-ffi.asd: CFFI requires CLISP compiled with dynamic FFI support.
(LOAD mixalot-mp3 FAIL) ffi, COMMON-LISP:SIMPLE-ERROR : CFFI requires CLISP compiled with dynamic FFI support.
(LOAD mixalot-flac FAIL) ffi, ASDF:LOAD-SYSTEM-DEFINITION-ERROR : Error while trying to load definition for system flac from pathname /Users/pnathan/cl-test-grid/work-dir/agent/quicklisp/dists/quicklisp/software/mixalot-20131111-git/flac.asd: CFFI requires CLISP compiled with dynamic FFI support.
(LOAD mixalot FAIL) ffi, COMMON-LISP:SIMPLE-ERROR : CFFI requires CLISP compiled with dynamic FFI support.
(LOAD flac FAIL) ffi, ASDF:LOAD-SYSTEM-DEFINITION-ERROR : Error while trying to load definition for system flac from pathname /Users/pnathan/cl-test-grid/work-dir/agent/quicklisp/dists/quicklisp/software/mixalot-20131111-git/flac.asd: CFFI requires CLISP compiled with dynamic FFI support.
clisp-2.49-unix-x64
(LOAD vorbisfile-ffi FAIL) ffi-grovel, CFFI-GROVEL:GROVEL-ERROR : External process exited with code 1. Command was: "cc" "-m64" "-lvorbisfile" "-I/home/hijarian/systems/cl-test-grid/work-dir/agent/quicklisp/dists/quicklisp/software/cffi_0.14.0/" "-o" "/home/hijarian/systems/cl-test-grid/work-dir/agent/test-runs/20141119082304-clisp-2.49-unix-x64/fasl/ql/dists/quicklisp/software/mixalot-20131111-git/vorbisfile-grovelling" "/home/hijarian/systems/cl-test-grid/work-dir/agent/test-runs/20141119082304-clisp-2.49-unix-x64/fasl/ql/dists/quicklisp/software/mixalot-20131111-git/vorbisfile-grovelling.c" Output was: <see above>
(LOAD mixalot-vorbis FAIL) ffi-grovel, CFFI-GROVEL:GROVEL-ERROR : External process exited with code 1. Command was: "cc" "-m64" "-lvorbisfile" "-I/home/hijarian/systems/cl-test-grid/work-dir/agent/quicklisp/dists/quicklisp/software/cffi_0.14.0/" "-o" "/home/hijarian/systems/cl-test-grid/work-dir/agent/test-runs/20141119082304-clisp-2.49-unix-x64/fasl/ql/dists/quicklisp/software/mixalot-20131111-git/vorbisfile-grovelling" "/home/hijarian/systems/cl-test-grid/work-dir/agent/test-runs/20141119082304-clisp-2.49-unix-x64/fasl/ql/dists/quicklisp/software/mixalot-20131111-git/vorbisfile-grovelling.c" Output was: <see above>
(LOAD mixalot-flac FAIL) ffi-grovel, CFFI-GROVEL:GROVEL-ERROR : External process exited with code 1. Command was: "cc" "-m64" "-lFLAC" "-lm" "-I/home/hijarian/systems/cl-test-grid/work-dir/agent/quicklisp/dists/quicklisp/software/cffi_0.14.0/" "-o" "/home/hijarian/systems/cl-test-grid/work-dir/agent/test-runs/20141119082304-clisp-2.49-unix-x64/fasl/ql/dists/quicklisp/software/mixalot-20131111-git/flac-grovelling" "/home/hijarian/systems/cl-test-grid/work-dir/agent/test-runs/20141119082304-clisp-2.49-unix-x64/fasl/ql/dists/quicklisp/software/mixalot-20131111-git/flac-grovelling.c" Output was: <see above>
(LOAD flac FAIL) ffi-grovel, CFFI-GROVEL:GROVEL-ERROR : External process exited with code 1. Command was: "cc" "-m64" "-lFLAC" "-lm" "-I/home/hijarian/systems/cl-test-grid/work-dir/agent/quicklisp/dists/quicklisp/software/cffi_0.14.0/" "-o" "/home/hijarian/systems/cl-test-grid/work-dir/agent/test-runs/20141119082304-clisp-2.49-unix-x64/fasl/ql/dists/quicklisp/software/mixalot-20131111-git/flac-grovelling" "/home/hijarian/systems/cl-test-grid/work-dir/agent/test-runs/20141119082304-clisp-2.49-unix-x64/fasl/ql/dists/quicklisp/software/mixalot-20131111-git/flac-grovelling.c" Output was: <see above>
(LOAD vorbisfile-ffi FAIL) ffi-grovel, CFFI-GROVEL:GROVEL-ERROR : External process exited with code 1. Command was: "cc" "-m64" "-lvorbisfile" "-I/home/hijarian/systems/cl-test-grid/work-dir/agent/quicklisp/dists/quicklisp/software/cffi_0.14.0/" "-o" "/home/hijarian/systems/cl-test-grid/work-dir/agent/test-runs/20141007051340-clisp-2.49-unix-x64/fasl/ql/dists/quicklisp/software/mixalot-20131111-git/vorbisfile-grovelling" "/home/hijarian/systems/cl-test-grid/work-dir/agent/test-runs/20141007051340-clisp-2.49-unix-x64/fasl/ql/dists/quicklisp/software/mixalot-20131111-git/vorbisfile-grovelling.c" Output was: <see above>
(LOAD mixalot-vorbis FAIL) ffi-grovel, CFFI-GROVEL:GROVEL-ERROR : External process exited with code 1. Command was: "cc" "-m64" "-lvorbisfile" "-I/home/hijarian/systems/cl-test-grid/work-dir/agent/quicklisp/dists/quicklisp/software/cffi_0.14.0/" "-o" "/home/hijarian/systems/cl-test-grid/work-dir/agent/test-runs/20141007051340-clisp-2.49-unix-x64/fasl/ql/dists/quicklisp/software/mixalot-20131111-git/vorbisfile-grovelling" "/home/hijarian/systems/cl-test-grid/work-dir/agent/test-runs/20141007051340-clisp-2.49-unix-x64/fasl/ql/dists/quicklisp/software/mixalot-20131111-git/vorbisfile-grovelling.c" Output was: <see above>
(LOAD mixalot-flac FAIL) ffi-grovel, CFFI-GROVEL:GROVEL-ERROR : External process exited with code 1. Command was: "cc" "-m64" "-lFLAC" "-lm" "-I/home/hijarian/systems/cl-test-grid/work-dir/agent/quicklisp/dists/quicklisp/software/cffi_0.14.0/" "-o" "/home/hijarian/systems/cl-test-grid/work-dir/agent/test-runs/20141007051340-clisp-2.49-unix-x64/fasl/ql/dists/quicklisp/software/mixalot-20131111-git/flac-grovelling" "/home/hijarian/systems/cl-test-grid/work-dir/agent/test-runs/20141007051340-clisp-2.49-unix-x64/fasl/ql/dists/quicklisp/software/mixalot-20131111-git/flac-grovelling.c" Output was: <see above>
(LOAD flac FAIL) ffi-grovel, CFFI-GROVEL:GROVEL-ERROR : External process exited with code 1. Command was: "cc" "-m64" "-lFLAC" "-lm" "-I/home/hijarian/systems/cl-test-grid/work-dir/agent/quicklisp/dists/quicklisp/software/cffi_0.14.0/" "-o" "/home/hijarian/systems/cl-test-grid/work-dir/agent/test-runs/20141007051340-clisp-2.49-unix-x64/fasl/ql/dists/quicklisp/software/mixalot-20131111-git/flac-grovelling" "/home/hijarian/systems/cl-test-grid/work-dir/agent/test-runs/20141007051340-clisp-2.49-unix-x64/fasl/ql/dists/quicklisp/software/mixalot-20131111-git/flac-grovelling.c" Output was: <see above>
clisp-2.49-unix-x86
(LOAD vorbisfile-ffi FAIL) ffi-grovel, CFFI-GROVEL:GROVEL-ERROR : External process exited with code 1. Command was: "cc" "-m32" "-lvorbisfile" "-I/home/testgrid/cl-test-grid/work-dir/agent/quicklisp/dists/quicklisp/software/cffi_0.14.0/" "-o" "/home/testgrid/cl-test-grid/work-dir/agent/test-runs/20141116021855-clisp-2.49-unix-x86/fasl/ql/dists/quicklisp/software/mixalot-20131111-git/vorbisfile-grovelling" "/home/testgrid/cl-test-grid/work-dir/agent/test-runs/20141116021855-clisp-2.49-unix-x86/fasl/ql/dists/quicklisp/software/mixalot-20131111-git/vorbisfile-grovelling.c" Output was: <see above>
(LOAD mpg123-ffi FAIL) ffi, CFFI:LOAD-FOREIGN-LIBRARY-ERROR : Unable to load any of the alternatives: ("libmixalot-mpg123.so.0" "libmpg123.so.0" "/usr/lib/libmpg123.so" "/usr/local/lib/libmpg123.so")
(LOAD mixalot-vorbis FAIL) ffi-grovel, CFFI-GROVEL:GROVEL-ERROR : External process exited with code 1. Command was: "cc" "-m32" "-lvorbisfile" "-I/home/testgrid/cl-test-grid/work-dir/agent/quicklisp/dists/quicklisp/software/cffi_0.14.0/" "-o" "/home/testgrid/cl-test-grid/work-dir/agent/test-runs/20141116021855-clisp-2.49-unix-x86/fasl/ql/dists/quicklisp/software/mixalot-20131111-git/vorbisfile-grovelling" "/home/testgrid/cl-test-grid/work-dir/agent/test-runs/20141116021855-clisp-2.49-unix-x86/fasl/ql/dists/quicklisp/software/mixalot-20131111-git/vorbisfile-grovelling.c" Output was: <see above>
(LOAD mixalot-mp3 FAIL) ffi, CFFI:LOAD-FOREIGN-LIBRARY-ERROR : Unable to load any of the alternatives: ("libmixalot-mpg123.so.0" "libmpg123.so.0" "/usr/lib/libmpg123.so" "/usr/local/lib/libmpg123.so")
(LOAD mixalot-flac FAIL) ffi-grovel, CFFI-GROVEL:GROVEL-ERROR : External process exited with code 1. Command was: "cc" "-m32" "-lFLAC" "-lm" "-I/home/testgrid/cl-test-grid/work-dir/agent/quicklisp/dists/quicklisp/software/cffi_0.14.0/" "-o" "/home/testgrid/cl-test-grid/work-dir/agent/test-runs/20141116021855-clisp-2.49-unix-x86/fasl/ql/dists/quicklisp/software/mixalot-20131111-git/flac-grovelling" "/home/testgrid/cl-test-grid/work-dir/agent/test-runs/20141116021855-clisp-2.49-unix-x86/fasl/ql/dists/quicklisp/software/mixalot-20131111-git/flac-grovelling.c" Output was: <see above>
(LOAD flac FAIL) ffi-grovel, CFFI-GROVEL:GROVEL-ERROR : External process exited with code 1. Command was: "cc" "-m32" "-lFLAC" "-lm" "-I/home/testgrid/cl-test-grid/work-dir/agent/quicklisp/dists/quicklisp/software/cffi_0.14.0/" "-o" "/home/testgrid/cl-test-grid/work-dir/agent/test-runs/20141116021855-clisp-2.49-unix-x86/fasl/ql/dists/quicklisp/software/mixalot-20131111-git/flac-grovelling" "/home/testgrid/cl-test-grid/work-dir/agent/test-runs/20141116021855-clisp-2.49-unix-x86/fasl/ql/dists/quicklisp/software/mixalot-20131111-git/flac-grovelling.c" Output was: <see above>
(LOAD vorbisfile-ffi FAIL) ffi-grovel, CFFI-GROVEL:GROVEL-ERROR : External process exited with code 1. Command was: "cc" "-m32" "-lvorbisfile" "-I/home/testgrid/cl-test-grid/work-dir/agent/quicklisp/dists/quicklisp/software/cffi_0.14.0/" "-o" "/home/testgrid/cl-test-grid/work-dir/agent/test-runs/20141008165628-clisp-2.49-unix-x86/fasl/ql/dists/quicklisp/software/mixalot-20131111-git/vorbisfile-grovelling" "/home/testgrid/cl-test-grid/work-dir/agent/test-runs/20141008165628-clisp-2.49-unix-x86/fasl/ql/dists/quicklisp/software/mixalot-20131111-git/vorbisfile-grovelling.c" Output was: <see above>
(LOAD mpg123-ffi FAIL) ffi, CFFI:LOAD-FOREIGN-LIBRARY-ERROR : Unable to load any of the alternatives: ("libmixalot-mpg123.so.0" "libmpg123.so.0" "/usr/lib/libmpg123.so" "/usr/local/lib/libmpg123.so")
(LOAD mixalot-vorbis FAIL) ffi-grovel, CFFI-GROVEL:GROVEL-ERROR : External process exited with code 1. Command was: "cc" "-m32" "-lvorbisfile" "-I/home/testgrid/cl-test-grid/work-dir/agent/quicklisp/dists/quicklisp/software/cffi_0.14.0/" "-o" "/home/testgrid/cl-test-grid/work-dir/agent/test-runs/20141008165628-clisp-2.49-unix-x86/fasl/ql/dists/quicklisp/software/mixalot-20131111-git/vorbisfile-grovelling" "/home/testgrid/cl-test-grid/work-dir/agent/test-runs/20141008165628-clisp-2.49-unix-x86/fasl/ql/dists/quicklisp/software/mixalot-20131111-git/vorbisfile-grovelling.c" Output was: <see above>
(LOAD mixalot-mp3 FAIL) ffi, CFFI:LOAD-FOREIGN-LIBRARY-ERROR : Unable to load any of the alternatives: ("libmixalot-mpg123.so.0" "libmpg123.so.0" "/usr/lib/libmpg123.so" "/usr/local/lib/libmpg123.so")
(LOAD mixalot-flac FAIL) ffi-grovel, CFFI-GROVEL:GROVEL-ERROR : External process exited with code 1. Command was: "cc" "-m32" "-lFLAC" "-lm" "-I/home/testgrid/cl-test-grid/work-dir/agent/quicklisp/dists/quicklisp/software/cffi_0.14.0/" "-o" "/home/testgrid/cl-test-grid/work-dir/agent/test-runs/20141008165628-clisp-2.49-unix-x86/fasl/ql/dists/quicklisp/software/mixalot-20131111-git/flac-grovelling" "/home/testgrid/cl-test-grid/work-dir/agent/test-runs/20141008165628-clisp-2.49-unix-x86/fasl/ql/dists/quicklisp/software/mixalot-20131111-git/flac-grovelling.c" Output was: <see above>
(LOAD flac FAIL) ffi-grovel, CFFI-GROVEL:GROVEL-ERROR : External process exited with code 1. Command was: "cc" "-m32" "-lFLAC" "-lm" "-I/home/testgrid/cl-test-grid/work-dir/agent/quicklisp/dists/quicklisp/software/cffi_0.14.0/" "-o" "/home/testgrid/cl-test-grid/work-dir/agent/test-runs/20141008165628-clisp-2.49-unix-x86/fasl/ql/dists/quicklisp/software/mixalot-20131111-git/flac-grovelling" "/home/testgrid/cl-test-grid/work-dir/agent/test-runs/20141008165628-clisp-2.49-unix-x86/fasl/ql/dists/quicklisp/software/mixalot-20131111-git/flac-grovelling.c" Output was: <see above>
cmu-snapshot-2013-04__20d_unicode_-linux-x86
(LOAD vorbisfile-ffi FAIL) ffi-grovel, CFFI-GROVEL:GROVEL-ERROR : Error in function CFFI-GROVEL:GROVEL-ERROR: External process exited with code 1. Command was: "cc" "-m32" "-lvorbisfile" "-I/home/testgrid/cl-test-grid/work-dir/agent/quicklisp/dists/quicklisp/software/cffi_0.14.0/" "-o" "/home/testgrid/cl-test-grid/work-dir/agent/test-runs/20141115185927-cmu-snapshot-2013-04__20d_unicode_-linux-x86/fasl/ql/dists/quicklisp/software/mixalot-20131111-git/vorbisfile-grovelling" "/home/testgrid/cl-test-grid/work-dir/agent/test-runs/20141115185927-cmu-snapshot-2013-04__20d_unicode_-linux-x86/fasl/ql/dists/quicklisp/software/mixalot-20131111-git/vorbisfile-grovelling.c" Output was: /home/testgrid/cl-test-grid/work-dir/agent/test-runs/20141115185927-cmu-snapshot-2013-04__20d_unicode_-linux-x86/fasl/ql/dists/quicklisp/software/mixalot-20131111-git/vorbisfile-grovelling.c:6:31: fatal error: vorbis/vorbisfile.h: No such file or directory compilation terminated.
(LOAD mpg123-ffi FAIL) ffi, CFFI:LOAD-FOREIGN-LIBRARY-ERROR : Error in function CFFI::FL-ERROR: Unable to load any of the alternatives: ("libmixalot-mpg123.so.0" "libmpg123.so.0" "/usr/lib/libmpg123.so" "/usr/local/lib/libmpg123.so")
(LOAD mixalot-vorbis FAIL) ffi-grovel, CFFI-GROVEL:GROVEL-ERROR : Error in function CFFI-GROVEL:GROVEL-ERROR: External process exited with code 1. Command was: "cc" "-m32" "-lvorbisfile" "-I/home/testgrid/cl-test-grid/work-dir/agent/quicklisp/dists/quicklisp/software/cffi_0.14.0/" "-o" "/home/testgrid/cl-test-grid/work-dir/agent/test-runs/20141115185927-cmu-snapshot-2013-04__20d_unicode_-linux-x86/fasl/ql/dists/quicklisp/software/mixalot-20131111-git/vorbisfile-grovelling" "/home/testgrid/cl-test-grid/work-dir/agent/test-runs/20141115185927-cmu-snapshot-2013-04__20d_unicode_-linux-x86/fasl/ql/dists/quicklisp/software/mixalot-20131111-git/vorbisfile-grovelling.c" Output was: /home/testgrid/cl-test-grid/work-dir/agent/test-runs/20141115185927-cmu-snapshot-2013-04__20d_unicode_-linux-x86/fasl/ql/dists/quicklisp/software/mixalot-20131111-git/vorbisfile-grovelling.c:6:31: fatal error: vorbis/vorbisfile.h: No such file or directory compilation terminated.
(LOAD mixalot-mp3 FAIL) ffi, CFFI:LOAD-FOREIGN-LIBRARY-ERROR : Error in function CFFI::FL-ERROR: Unable to load any of the alternatives: ("libmixalot-mpg123.so.0" "libmpg123.so.0" "/usr/lib/libmpg123.so" "/usr/local/lib/libmpg123.so")
(LOAD mixalot-flac FAIL) ffi-grovel, CFFI-GROVEL:GROVEL-ERROR : Error in function CFFI-GROVEL:GROVEL-ERROR: External process exited with code 1. Command was: "cc" "-m32" "-lFLAC" "-lm" "-I/home/testgrid/cl-test-grid/work-dir/agent/quicklisp/dists/quicklisp/software/cffi_0.14.0/" "-o" "/home/testgrid/cl-test-grid/work-dir/agent/test-runs/20141115185927-cmu-snapshot-2013-04__20d_unicode_-linux-x86/fasl/ql/dists/quicklisp/software/mixalot-20131111-git/flac-grovelling" "/home/testgrid/cl-test-grid/work-dir/agent/test-runs/20141115185927-cmu-snapshot-2013-04__20d_unicode_-linux-x86/fasl/ql/dists/quicklisp/software/mixalot-20131111-git/flac-grovelling.c" Output was: /home/testgrid/cl-test-grid/work-dir/agent/test-runs/20141115185927-cmu-snapshot-2013-04__20d_unicode_-linux-x86/fasl/ql/dists/quicklisp/software/mixalot-20131111-git/flac-grovelling.c:6:33: fatal error: FLAC/stream_decoder.h: No such file or directory compilation terminated.
(LOAD flac FAIL) ffi-grovel, CFFI-GROVEL:GROVEL-ERROR : Error in function CFFI-GROVEL:GROVEL-ERROR: External process exited with code 1. Command was: "cc" "-m32" "-lFLAC" "-lm" "-I/home/testgrid/cl-test-grid/work-dir/agent/quicklisp/dists/quicklisp/software/cffi_0.14.0/" "-o" "/home/testgrid/cl-test-grid/work-dir/agent/test-runs/20141115185927-cmu-snapshot-2013-04__20d_unicode_-linux-x86/fasl/ql/dists/quicklisp/software/mixalot-20131111-git/flac-grovelling" "/home/testgrid/cl-test-grid/work-dir/agent/test-runs/20141115185927-cmu-snapshot-2013-04__20d_unicode_-linux-x86/fasl/ql/dists/quicklisp/software/mixalot-20131111-git/flac-grovelling.c" Output was: /home/testgrid/cl-test-grid/work-dir/agent/test-runs/20141115185927-cmu-snapshot-2013-04__20d_unicode_-linux-x86/fasl/ql/dists/quicklisp/software/mixalot-20131111-git/flac-grovelling.c:6:33: fatal error: FLAC/stream_decoder.h: No such file or directory compilation terminated.
(LOAD vorbisfile-ffi FAIL) ffi-grovel, CFFI-GROVEL:GROVEL-ERROR : Error in function CFFI-GROVEL:GROVEL-ERROR: External process exited with code 1. Command was: "cc" "-m32" "-lvorbisfile" "-I/home/testgrid/cl-test-grid/work-dir/agent/quicklisp/dists/quicklisp/software/cffi_0.14.0/" "-o" "/home/testgrid/cl-test-grid/work-dir/agent/test-runs/20141008085755-cmu-snapshot-2013-04__20d_unicode_-linux-x86/fasl/ql/dists/quicklisp/software/mixalot-20131111-git/vorbisfile-grovelling" "/home/testgrid/cl-test-grid/work-dir/agent/test-runs/20141008085755-cmu-snapshot-2013-04__20d_unicode_-linux-x86/fasl/ql/dists/quicklisp/software/mixalot-20131111-git/vorbisfile-grovelling.c" Output was: /home/testgrid/cl-test-grid/work-dir/agent/test-runs/20141008085755-cmu-snapshot-2013-04__20d_unicode_-linux-x86/fasl/ql/dists/quicklisp/software/mixalot-20131111-git/vorbisfile-grovelling.c:6:31: fatal error: vorbis/vorbisfile.h: No such file or directory compilation terminated.
(LOAD mpg123-ffi FAIL) ffi, CFFI:LOAD-FOREIGN-LIBRARY-ERROR : Error in function CFFI::FL-ERROR: Unable to load any of the alternatives: ("libmixalot-mpg123.so.0" "libmpg123.so.0" "/usr/lib/libmpg123.so" "/usr/local/lib/libmpg123.so")
(LOAD mixalot-vorbis FAIL) ffi-grovel, CFFI-GROVEL:GROVEL-ERROR : Error in function CFFI-GROVEL:GROVEL-ERROR: External process exited with code 1. Command was: "cc" "-m32" "-lvorbisfile" "-I/home/testgrid/cl-test-grid/work-dir/agent/quicklisp/dists/quicklisp/software/cffi_0.14.0/" "-o" "/home/testgrid/cl-test-grid/work-dir/agent/test-runs/20141008085755-cmu-snapshot-2013-04__20d_unicode_-linux-x86/fasl/ql/dists/quicklisp/software/mixalot-20131111-git/vorbisfile-grovelling" "/home/testgrid/cl-test-grid/work-dir/agent/test-runs/20141008085755-cmu-snapshot-2013-04__20d_unicode_-linux-x86/fasl/ql/dists/quicklisp/software/mixalot-20131111-git/vorbisfile-grovelling.c" Output was: /home/testgrid/cl-test-grid/work-dir/agent/test-runs/20141008085755-cmu-snapshot-2013-04__20d_unicode_-linux-x86/fasl/ql/dists/quicklisp/software/mixalot-20131111-git/vorbisfile-grovelling.c:6:31: fatal error: vorbis/vorbisfile.h: No such file or directory compilation terminated.
(LOAD mixalot-mp3 FAIL) ffi, CFFI:LOAD-FOREIGN-LIBRARY-ERROR : Error in function CFFI::FL-ERROR: Unable to load any of the alternatives: ("libmixalot-mpg123.so.0" "libmpg123.so.0" "/usr/lib/libmpg123.so" "/usr/local/lib/libmpg123.so")
(LOAD mixalot-flac FAIL) ffi-grovel, CFFI-GROVEL:GROVEL-ERROR : Error in function CFFI-GROVEL:GROVEL-ERROR: External process exited with code 1. Command was: "cc" "-m32" "-lFLAC" "-lm" "-I/home/testgrid/cl-test-grid/work-dir/agent/quicklisp/dists/quicklisp/software/cffi_0.14.0/" "-o" "/home/testgrid/cl-test-grid/work-dir/agent/test-runs/20141008085755-cmu-snapshot-2013-04__20d_unicode_-linux-x86/fasl/ql/dists/quicklisp/software/mixalot-20131111-git/flac-grovelling" "/home/testgrid/cl-test-grid/work-dir/agent/test-runs/20141008085755-cmu-snapshot-2013-04__20d_unicode_-linux-x86/fasl/ql/dists/quicklisp/software/mixalot-20131111-git/flac-grovelling.c" Output was: /home/testgrid/cl-test-grid/work-dir/agent/test-runs/20141008085755-cmu-snapshot-2013-04__20d_unicode_-linux-x86/fasl/ql/dists/quicklisp/software/mixalot-20131111-git/flac-grovelling.c:6:33: fatal error: FLAC/stream_decoder.h: No such file or directory compilation terminated.
(LOAD flac FAIL) ffi-grovel, CFFI-GROVEL:GROVEL-ERROR : Error in function CFFI-GROVEL:GROVEL-ERROR: External process exited with code 1. Command was: "cc" "-m32" "-lFLAC" "-lm" "-I/home/testgrid/cl-test-grid/work-dir/agent/quicklisp/dists/quicklisp/software/cffi_0.14.0/" "-o" "/home/testgrid/cl-test-grid/work-dir/agent/test-runs/20141008085755-cmu-snapshot-2013-04__20d_unicode_-linux-x86/fasl/ql/dists/quicklisp/software/mixalot-20131111-git/flac-grovelling" "/home/testgrid/cl-test-grid/work-dir/agent/test-runs/20141008085755-cmu-snapshot-2013-04__20d_unicode_-linux-x86/fasl/ql/dists/quicklisp/software/mixalot-20131111-git/flac-grovelling.c" Output was: /home/testgrid/cl-test-grid/work-dir/agent/test-runs/20141008085755-cmu-snapshot-2013-04__20d_unicode_-linux-x86/fasl/ql/dists/quicklisp/software/mixalot-20131111-git/flac-grovelling.c:6:33: fatal error: FLAC/stream_decoder.h: No such file or directory compilation terminated.
cmu-snapshot-2014-01__20e_unicode_-linux-x86
(LOAD vorbisfile-ffi FAIL) ffi-grovel, CFFI-GROVEL:GROVEL-ERROR : Error in function CFFI-GROVEL:GROVEL-ERROR: External process exited with code 1. Command was: "cc" "-m32" "-lvorbisfile" "-I/home/testgrid/cl-test-grid/work-dir/agent/quicklisp/dists/quicklisp/software/cffi_0.14.0/" "-o" "/home/testgrid/cl-test-grid/work-dir/agent/test-runs/20141115212908-cmu-snapshot-2014-01__20e_unicode_-linux-x86/fasl/ql/dists/quicklisp/software/mixalot-20131111-git/vorbisfile-grovelling" "/home/testgrid/cl-test-grid/work-dir/agent/test-runs/20141115212908-cmu-snapshot-2014-01__20e_unicode_-linux-x86/fasl/ql/dists/quicklisp/software/mixalot-20131111-git/vorbisfile-grovelling.c" Output was: /home/testgrid/cl-test-grid/work-dir/agent/test-runs/20141115212908-cmu-snapshot-2014-01__20e_unicode_-linux-x86/fasl/ql/dists/quicklisp/software/mixalot-20131111-git/vorbisfile-grovelling.c:6:31: fatal error: vorbis/vorbisfile.h: No such file or directory compilation terminated.
(LOAD mpg123-ffi FAIL) ffi, CFFI:LOAD-FOREIGN-LIBRARY-ERROR : Error in function CFFI::FL-ERROR: Unable to load any of the alternatives: ("libmixalot-mpg123.so.0" "libmpg123.so.0" "/usr/lib/libmpg123.so" "/usr/local/lib/libmpg123.so")
(LOAD mixalot-vorbis FAIL) ffi-grovel, CFFI-GROVEL:GROVEL-ERROR : Error in function CFFI-GROVEL:GROVEL-ERROR: External process exited with code 1. Command was: "cc" "-m32" "-lvorbisfile" "-I/home/testgrid/cl-test-grid/work-dir/agent/quicklisp/dists/quicklisp/software/cffi_0.14.0/" "-o" "/home/testgrid/cl-test-grid/work-dir/agent/test-runs/20141115212908-cmu-snapshot-2014-01__20e_unicode_-linux-x86/fasl/ql/dists/quicklisp/software/mixalot-20131111-git/vorbisfile-grovelling" "/home/testgrid/cl-test-grid/work-dir/agent/test-runs/20141115212908-cmu-snapshot-2014-01__20e_unicode_-linux-x86/fasl/ql/dists/quicklisp/software/mixalot-20131111-git/vorbisfile-grovelling.c" Output was: /home/testgrid/cl-test-grid/work-dir/agent/test-runs/20141115212908-cmu-snapshot-2014-01__20e_unicode_-linux-x86/fasl/ql/dists/quicklisp/software/mixalot-20131111-git/vorbisfile-grovelling.c:6:31: fatal error: vorbis/vorbisfile.h: No such file or directory compilation terminated.
(LOAD mixalot-mp3 FAIL) ffi, CFFI:LOAD-FOREIGN-LIBRARY-ERROR : Error in function CFFI::FL-ERROR: Unable to load any of the alternatives: ("libmixalot-mpg123.so.0" "libmpg123.so.0" "/usr/lib/libmpg123.so" "/usr/local/lib/libmpg123.so")
(LOAD mixalot-flac FAIL) ffi-grovel, CFFI-GROVEL:GROVEL-ERROR : Error in function CFFI-GROVEL:GROVEL-ERROR: External process exited with code 1. Command was: "cc" "-m32" "-lFLAC" "-lm" "-I/home/testgrid/cl-test-grid/work-dir/agent/quicklisp/dists/quicklisp/software/cffi_0.14.0/" "-o" "/home/testgrid/cl-test-grid/work-dir/agent/test-runs/20141115212908-cmu-snapshot-2014-01__20e_unicode_-linux-x86/fasl/ql/dists/quicklisp/software/mixalot-20131111-git/flac-grovelling" "/home/testgrid/cl-test-grid/work-dir/agent/test-runs/20141115212908-cmu-snapshot-2014-01__20e_unicode_-linux-x86/fasl/ql/dists/quicklisp/software/mixalot-20131111-git/flac-grovelling.c" Output was: /home/testgrid/cl-test-grid/work-dir/agent/test-runs/20141115212908-cmu-snapshot-2014-01__20e_unicode_-linux-x86/fasl/ql/dists/quicklisp/software/mixalot-20131111-git/flac-grovelling.c:6:33: fatal error: FLAC/stream_decoder.h: No such file or directory compilation terminated.
(LOAD flac FAIL) ffi-grovel, CFFI-GROVEL:GROVEL-ERROR : Error in function CFFI-GROVEL:GROVEL-ERROR: External process exited with code 1. Command was: "cc" "-m32" "-lFLAC" "-lm" "-I/home/testgrid/cl-test-grid/work-dir/agent/quicklisp/dists/quicklisp/software/cffi_0.14.0/" "-o" "/home/testgrid/cl-test-grid/work-dir/agent/test-runs/20141115212908-cmu-snapshot-2014-01__20e_unicode_-linux-x86/fasl/ql/dists/quicklisp/software/mixalot-20131111-git/flac-grovelling" "/home/testgrid/cl-test-grid/work-dir/agent/test-runs/20141115212908-cmu-snapshot-2014-01__20e_unicode_-linux-x86/fasl/ql/dists/quicklisp/software/mixalot-20131111-git/flac-grovelling.c" Output was: /home/testgrid/cl-test-grid/work-dir/agent/test-runs/20141115212908-cmu-snapshot-2014-01__20e_unicode_-linux-x86/fasl/ql/dists/quicklisp/software/mixalot-20131111-git/flac-grovelling.c:6:33: fatal error: FLAC/stream_decoder.h: No such file or directory compilation terminated.
(LOAD vorbisfile-ffi FAIL) ffi-grovel, CFFI-GROVEL:GROVEL-ERROR : Error in function CFFI-GROVEL:GROVEL-ERROR: External process exited with code 1. Command was: "cc" "-m32" "-lvorbisfile" "-I/home/testgrid/cl-test-grid/work-dir/agent/quicklisp/dists/quicklisp/software/cffi_0.14.0/" "-o" "/home/testgrid/cl-test-grid/work-dir/agent/test-runs/20141008114223-cmu-snapshot-2014-01__20e_unicode_-linux-x86/fasl/ql/dists/quicklisp/software/mixalot-20131111-git/vorbisfile-grovelling" "/home/testgrid/cl-test-grid/work-dir/agent/test-runs/20141008114223-cmu-snapshot-2014-01__20e_unicode_-linux-x86/fasl/ql/dists/quicklisp/software/mixalot-20131111-git/vorbisfile-grovelling.c" Output was: /home/testgrid/cl-test-grid/work-dir/agent/test-runs/20141008114223-cmu-snapshot-2014-01__20e_unicode_-linux-x86/fasl/ql/dists/quicklisp/software/mixalot-20131111-git/vorbisfile-grovelling.c:6:31: fatal error: vorbis/vorbisfile.h: No such file or directory compilation terminated.
(LOAD mpg123-ffi FAIL) ffi, CFFI:LOAD-FOREIGN-LIBRARY-ERROR : Error in function CFFI::FL-ERROR: Unable to load any of the alternatives: ("libmixalot-mpg123.so.0" "libmpg123.so.0" "/usr/lib/libmpg123.so" "/usr/local/lib/libmpg123.so")
(LOAD mixalot-vorbis FAIL) ffi-grovel, CFFI-GROVEL:GROVEL-ERROR : Error in function CFFI-GROVEL:GROVEL-ERROR: External process exited with code 1. Command was: "cc" "-m32" "-lvorbisfile" "-I/home/testgrid/cl-test-grid/work-dir/agent/quicklisp/dists/quicklisp/software/cffi_0.14.0/" "-o" "/home/testgrid/cl-test-grid/work-dir/agent/test-runs/20141008114223-cmu-snapshot-2014-01__20e_unicode_-linux-x86/fasl/ql/dists/quicklisp/software/mixalot-20131111-git/vorbisfile-grovelling" "/home/testgrid/cl-test-grid/work-dir/agent/test-runs/20141008114223-cmu-snapshot-2014-01__20e_unicode_-linux-x86/fasl/ql/dists/quicklisp/software/mixalot-20131111-git/vorbisfile-grovelling.c" Output was: /home/testgrid/cl-test-grid/work-dir/agent/test-runs/20141008114223-cmu-snapshot-2014-01__20e_unicode_-linux-x86/fasl/ql/dists/quicklisp/software/mixalot-20131111-git/vorbisfile-grovelling.c:6:31: fatal error: vorbis/vorbisfile.h: No such file or directory compilation terminated.
(LOAD mixalot-mp3 FAIL) ffi, CFFI:LOAD-FOREIGN-LIBRARY-ERROR : Error in function CFFI::FL-ERROR: Unable to load any of the alternatives: ("libmixalot-mpg123.so.0" "libmpg123.so.0" "/usr/lib/libmpg123.so" "/usr/local/lib/libmpg123.so")
(LOAD mixalot-flac FAIL) ffi-grovel, CFFI-GROVEL:GROVEL-ERROR : Error in function CFFI-GROVEL:GROVEL-ERROR: External process exited with code 1. Command was: "cc" "-m32" "-lFLAC" "-lm" "-I/home/testgrid/cl-test-grid/work-dir/agent/quicklisp/dists/quicklisp/software/cffi_0.14.0/" "-o" "/home/testgrid/cl-test-grid/work-dir/agent/test-runs/20141008114223-cmu-snapshot-2014-01__20e_unicode_-linux-x86/fasl/ql/dists/quicklisp/software/mixalot-20131111-git/flac-grovelling" "/home/testgrid/cl-test-grid/work-dir/agent/test-runs/20141008114223-cmu-snapshot-2014-01__20e_unicode_-linux-x86/fasl/ql/dists/quicklisp/software/mixalot-20131111-git/flac-grovelling.c" Output was: /home/testgrid/cl-test-grid/work-dir/agent/test-runs/20141008114223-cmu-snapshot-2014-01__20e_unicode_-linux-x86/fasl/ql/dists/quicklisp/software/mixalot-20131111-git/flac-grovelling.c:6:33: fatal error: FLAC/stream_decoder.h: No such file or directory compilation terminated.
(LOAD flac FAIL) ffi-grovel, CFFI-GROVEL:GROVEL-ERROR : Error in function CFFI-GROVEL:GROVEL-ERROR: External process exited with code 1. Command was: "cc" "-m32" "-lFLAC" "-lm" "-I/home/testgrid/cl-test-grid/work-dir/agent/quicklisp/dists/quicklisp/software/cffi_0.14.0/" "-o" "/home/testgrid/cl-test-grid/work-dir/agent/test-runs/20141008114223-cmu-snapshot-2014-01__20e_unicode_-linux-x86/fasl/ql/dists/quicklisp/software/mixalot-20131111-git/flac-grovelling" "/home/testgrid/cl-test-grid/work-dir/agent/test-runs/20141008114223-cmu-snapshot-2014-01__20e_unicode_-linux-x86/fasl/ql/dists/quicklisp/software/mixalot-20131111-git/flac-grovelling.c" Output was: /home/testgrid/cl-test-grid/work-dir/agent/test-runs/20141008114223-cmu-snapshot-2014-01__20e_unicode_-linux-x86/fasl/ql/dists/quicklisp/software/mixalot-20131111-git/flac-grovelling.c:6:33: fatal error: FLAC/stream_decoder.h: No such file or directory compilation terminated.
cmu-snapshot-2014-05-dirty__20e_unicode_-linux-x86
(LOAD vorbisfile-ffi FAIL) ffi-grovel, CFFI-GROVEL:GROVEL-ERROR : Error in function CFFI-GROVEL:GROVEL-ERROR: External process exited with code 1. Command was: "cc" "-m32" "-lvorbisfile" "-I/home/testgrid/cl-test-grid/work-dir/agent/quicklisp/dists/quicklisp/software/cffi_0.14.0/" "-o" "/home/testgrid/cl-test-grid/work-dir/agent/test-runs/20141115235548-cmu-snapshot-2014-05-dirty__20e_unicode_-linux-x86/fasl/ql/dists/quicklisp/software/mixalot-20131111-git/vorbisfile-grovelling" "/home/testgrid/cl-test-grid/work-dir/agent/test-runs/20141115235548-cmu-snapshot-2014-05-dirty__20e_unicode_-linux-x86/fasl/ql/dists/quicklisp/software/mixalot-20131111-git/vorbisfile-grovelling.c" Output was: /home/testgrid/cl-test-grid/work-dir/agent/test-runs/20141115235548-cmu-snapshot-2014-05-dirty__20e_unicode_-linux-x86/fasl/ql/dists/quicklisp/software/mixalot-20131111-git/vorbisfile-grovelling.c:6:31: fatal error: vorbis/vorbisfile.h: No such file or directory compilation terminated.
(LOAD mpg123-ffi FAIL) ffi, CFFI:LOAD-FOREIGN-LIBRARY-ERROR : Error in function CFFI::FL-ERROR: Unable to load any of the alternatives: ("libmixalot-mpg123.so.0" "libmpg123.so.0" "/usr/lib/libmpg123.so" "/usr/local/lib/libmpg123.so")
(LOAD mixalot-vorbis FAIL) ffi-grovel, CFFI-GROVEL:GROVEL-ERROR : Error in function CFFI-GROVEL:GROVEL-ERROR: External process exited with code 1. Command was: "cc" "-m32" "-lvorbisfile" "-I/home/testgrid/cl-test-grid/work-dir/agent/quicklisp/dists/quicklisp/software/cffi_0.14.0/" "-o" "/home/testgrid/cl-test-grid/work-dir/agent/test-runs/20141115235548-cmu-snapshot-2014-05-dirty__20e_unicode_-linux-x86/fasl/ql/dists/quicklisp/software/mixalot-20131111-git/vorbisfile-grovelling" "/home/testgrid/cl-test-grid/work-dir/agent/test-runs/20141115235548-cmu-snapshot-2014-05-dirty__20e_unicode_-linux-x86/fasl/ql/dists/quicklisp/software/mixalot-20131111-git/vorbisfile-grovelling.c" Output was: /home/testgrid/cl-test-grid/work-dir/agent/test-runs/20141115235548-cmu-snapshot-2014-05-dirty__20e_unicode_-linux-x86/fasl/ql/dists/quicklisp/software/mixalot-20131111-git/vorbisfile-grovelling.c:6:31: fatal error: vorbis/vorbisfile.h: No such file or directory compilation terminated.
(LOAD mixalot-mp3 FAIL) ffi, CFFI:LOAD-FOREIGN-LIBRARY-ERROR : Error in function CFFI::FL-ERROR: Unable to load any of the alternatives: ("libmixalot-mpg123.so.0" "libmpg123.so.0" "/usr/lib/libmpg123.so" "/usr/local/lib/libmpg123.so")
(LOAD mixalot-flac FAIL) ffi-grovel, CFFI-GROVEL:GROVEL-ERROR : Error in function CFFI-GROVEL:GROVEL-ERROR: External process exited with code 1. Command was: "cc" "-m32" "-lFLAC" "-lm" "-I/home/testgrid/cl-test-grid/work-dir/agent/quicklisp/dists/quicklisp/software/cffi_0.14.0/" "-o" "/home/testgrid/cl-test-grid/work-dir/agent/test-runs/20141115235548-cmu-snapshot-2014-05-dirty__20e_unicode_-linux-x86/fasl/ql/dists/quicklisp/software/mixalot-20131111-git/flac-grovelling" "/home/testgrid/cl-test-grid/work-dir/agent/test-runs/20141115235548-cmu-snapshot-2014-05-dirty__20e_unicode_-linux-x86/fasl/ql/dists/quicklisp/software/mixalot-20131111-git/flac-grovelling.c" Output was: /home/testgrid/cl-test-grid/work-dir/agent/test-runs/20141115235548-cmu-snapshot-2014-05-dirty__20e_unicode_-linux-x86/fasl/ql/dists/quicklisp/software/mixalot-20131111-git/flac-grovelling.c:6:33: fatal error: FLAC/stream_decoder.h: No such file or directory compilation terminated.
(LOAD flac FAIL) ffi-grovel, CFFI-GROVEL:GROVEL-ERROR : Error in function CFFI-GROVEL:GROVEL-ERROR: External process exited with code 1. Command was: "cc" "-m32" "-lFLAC" "-lm" "-I/home/testgrid/cl-test-grid/work-dir/agent/quicklisp/dists/quicklisp/software/cffi_0.14.0/" "-o" "/home/testgrid/cl-test-grid/work-dir/agent/test-runs/20141115235548-cmu-snapshot-2014-05-dirty__20e_unicode_-linux-x86/fasl/ql/dists/quicklisp/software/mixalot-20131111-git/flac-grovelling" "/home/testgrid/cl-test-grid/work-dir/agent/test-runs/20141115235548-cmu-snapshot-2014-05-dirty__20e_unicode_-linux-x86/fasl/ql/dists/quicklisp/software/mixalot-20131111-git/flac-grovelling.c" Output was: /home/testgrid/cl-test-grid/work-dir/agent/test-runs/20141115235548-cmu-snapshot-2014-05-dirty__20e_unicode_-linux-x86/fasl/ql/dists/quicklisp/software/mixalot-20131111-git/flac-grovelling.c:6:33: fatal error: FLAC/stream_decoder.h: No such file or directory compilation terminated.
(LOAD vorbisfile-ffi FAIL) ffi-grovel, CFFI-GROVEL:GROVEL-ERROR : Error in function CFFI-GROVEL:GROVEL-ERROR: External process exited with code 1. Command was: "cc" "-m32" "-lvorbisfile" "-I/home/testgrid/cl-test-grid/work-dir/agent/quicklisp/dists/quicklisp/software/cffi_0.14.0/" "-o" "/home/testgrid/cl-test-grid/work-dir/agent/test-runs/20141008142038-cmu-snapshot-2014-05-dirty__20e_unicode_-linux-x86/fasl/ql/dists/quicklisp/software/mixalot-20131111-git/vorbisfile-grovelling" "/home/testgrid/cl-test-grid/work-dir/agent/test-runs/20141008142038-cmu-snapshot-2014-05-dirty__20e_unicode_-linux-x86/fasl/ql/dists/quicklisp/software/mixalot-20131111-git/vorbisfile-grovelling.c" Output was: /home/testgrid/cl-test-grid/work-dir/agent/test-runs/20141008142038-cmu-snapshot-2014-05-dirty__20e_unicode_-linux-x86/fasl/ql/dists/quicklisp/software/mixalot-20131111-git/vorbisfile-grovelling.c:6:31: fatal error: vorbis/vorbisfile.h: No such file or directory compilation terminated.
(LOAD mpg123-ffi FAIL) ffi, CFFI:LOAD-FOREIGN-LIBRARY-ERROR : Error in function CFFI::FL-ERROR: Unable to load any of the alternatives: ("libmixalot-mpg123.so.0" "libmpg123.so.0" "/usr/lib/libmpg123.so" "/usr/local/lib/libmpg123.so")
(LOAD mixalot-vorbis FAIL) ffi-grovel, CFFI-GROVEL:GROVEL-ERROR : Error in function CFFI-GROVEL:GROVEL-ERROR: External process exited with code 1. Command was: "cc" "-m32" "-lvorbisfile" "-I/home/testgrid/cl-test-grid/work-dir/agent/quicklisp/dists/quicklisp/software/cffi_0.14.0/" "-o" "/home/testgrid/cl-test-grid/work-dir/agent/test-runs/20141008142038-cmu-snapshot-2014-05-dirty__20e_unicode_-linux-x86/fasl/ql/dists/quicklisp/software/mixalot-20131111-git/vorbisfile-grovelling" "/home/testgrid/cl-test-grid/work-dir/agent/test-runs/20141008142038-cmu-snapshot-2014-05-dirty__20e_unicode_-linux-x86/fasl/ql/dists/quicklisp/software/mixalot-20131111-git/vorbisfile-grovelling.c" Output was: /home/testgrid/cl-test-grid/work-dir/agent/test-runs/20141008142038-cmu-snapshot-2014-05-dirty__20e_unicode_-linux-x86/fasl/ql/dists/quicklisp/software/mixalot-20131111-git/vorbisfile-grovelling.c:6:31: fatal error: vorbis/vorbisfile.h: No such file or directory compilation terminated.
(LOAD mixalot-mp3 FAIL) ffi, CFFI:LOAD-FOREIGN-LIBRARY-ERROR : Error in function CFFI::FL-ERROR: Unable to load any of the alternatives: ("libmixalot-mpg123.so.0" "libmpg123.so.0" "/usr/lib/libmpg123.so" "/usr/local/lib/libmpg123.so")
(LOAD mixalot-flac FAIL) ffi-grovel, CFFI-GROVEL:GROVEL-ERROR : Error in function CFFI-GROVEL:GROVEL-ERROR: External process exited with code 1. Command was: "cc" "-m32" "-lFLAC" "-lm" "-I/home/testgrid/cl-test-grid/work-dir/agent/quicklisp/dists/quicklisp/software/cffi_0.14.0/" "-o" "/home/testgrid/cl-test-grid/work-dir/agent/test-runs/20141008142038-cmu-snapshot-2014-05-dirty__20e_unicode_-linux-x86/fasl/ql/dists/quicklisp/software/mixalot-20131111-git/flac-grovelling" "/home/testgrid/cl-test-grid/work-dir/agent/test-runs/20141008142038-cmu-snapshot-2014-05-dirty__20e_unicode_-linux-x86/fasl/ql/dists/quicklisp/software/mixalot-20131111-git/flac-grovelling.c" Output was: /home/testgrid/cl-test-grid/work-dir/agent/test-runs/20141008142038-cmu-snapshot-2014-05-dirty__20e_unicode_-linux-x86/fasl/ql/dists/quicklisp/software/mixalot-20131111-git/flac-grovelling.c:6:33: fatal error: FLAC/stream_decoder.h: No such file or directory compilation terminated.
(LOAD flac FAIL) ffi-grovel, CFFI-GROVEL:GROVEL-ERROR : Error in function CFFI-GROVEL:GROVEL-ERROR: External process exited with code 1. Command was: "cc" "-m32" "-lFLAC" "-lm" "-I/home/testgrid/cl-test-grid/work-dir/agent/quicklisp/dists/quicklisp/software/cffi_0.14.0/" "-o" "/home/testgrid/cl-test-grid/work-dir/agent/test-runs/20141008142038-cmu-snapshot-2014-05-dirty__20e_unicode_-linux-x86/fasl/ql/dists/quicklisp/software/mixalot-20131111-git/flac-grovelling" "/home/testgrid/cl-test-grid/work-dir/agent/test-runs/20141008142038-cmu-snapshot-2014-05-dirty__20e_unicode_-linux-x86/fasl/ql/dists/quicklisp/software/mixalot-20131111-git/flac-grovelling.c" Output was: /home/testgrid/cl-test-grid/work-dir/agent/test-runs/20141008142038-cmu-snapshot-2014-05-dirty__20e_unicode_-linux-x86/fasl/ql/dists/quicklisp/software/mixalot-20131111-git/flac-grovelling.c:6:33: fatal error: FLAC/stream_decoder.h: No such file or directory compilation terminated.
ecl-13.5.1-76a84246-linux-x64-bytecode
(LOAD vorbisfile-ffi FAIL) ASDF/FIND-SYSTEM:LOAD-SYSTEM-DEFINITION-ERROR : Error while trying to load definition for system vorbisfile-ffi from pathname /home/hijarian/systems/cl-test-grid/work-dir/agent/quicklisp/dists/quicklisp/software/mixalot-20131111-git/vorbisfile-ffi.asd: The variable C::*CC-FLAGS* is unbound.
(LOAD mixalot-vorbis FAIL) ASDF/FIND-SYSTEM:LOAD-SYSTEM-DEFINITION-ERROR : Error while trying to load definition for system vorbisfile-ffi from pathname /home/hijarian/systems/cl-test-grid/work-dir/agent/quicklisp/dists/quicklisp/software/mixalot-20131111-git/vorbisfile-ffi.asd: The variable C::*CC-FLAGS* is unbound.
(LOAD mixalot-flac FAIL) ASDF/FIND-SYSTEM:LOAD-SYSTEM-DEFINITION-ERROR : Error while trying to load definition for system flac from pathname /home/hijarian/systems/cl-test-grid/work-dir/agent/quicklisp/dists/quicklisp/software/mixalot-20131111-git/flac.asd: The variable C::*CC-FLAGS* is unbound.
(LOAD flac FAIL) ASDF/FIND-SYSTEM:LOAD-SYSTEM-DEFINITION-ERROR : Error while trying to load definition for system flac from pathname /home/hijarian/systems/cl-test-grid/work-dir/agent/quicklisp/dists/quicklisp/software/mixalot-20131111-git/flac.asd: The variable C::*CC-FLAGS* is unbound.
(LOAD vorbisfile-ffi FAIL) ASDF/FIND-SYSTEM:LOAD-SYSTEM-DEFINITION-ERROR : Error while trying to load definition for system vorbisfile-ffi from pathname /home/hijarian/systems/cl-test-grid/work-dir/agent/quicklisp/dists/quicklisp/software/mixalot-20131111-git/vorbisfile-ffi.asd: The variable C::*CC-FLAGS* is unbound.
(LOAD mixalot-vorbis FAIL) ASDF/FIND-SYSTEM:LOAD-SYSTEM-DEFINITION-ERROR : Error while trying to load definition for system vorbisfile-ffi from pathname /home/hijarian/systems/cl-test-grid/work-dir/agent/quicklisp/dists/quicklisp/software/mixalot-20131111-git/vorbisfile-ffi.asd: The variable C::*CC-FLAGS* is unbound.
(LOAD mixalot-flac FAIL) ASDF/FIND-SYSTEM:LOAD-SYSTEM-DEFINITION-ERROR : Error while trying to load definition for system flac from pathname /home/hijarian/systems/cl-test-grid/work-dir/agent/quicklisp/dists/quicklisp/software/mixalot-20131111-git/flac.asd: The variable C::*CC-FLAGS* is unbound.
(LOAD flac FAIL) ASDF/FIND-SYSTEM:LOAD-SYSTEM-DEFINITION-ERROR : Error while trying to load definition for system flac from pathname /home/hijarian/systems/cl-test-grid/work-dir/agent/quicklisp/dists/quicklisp/software/mixalot-20131111-git/flac.asd: The variable C::*CC-FLAGS* is unbound.
ecl-13.5.1-76a84246-linux-x64-lisp-to-c
(LOAD vorbisfile-ffi FAIL) ffi-grovel, CFFI-GROVEL:GROVEL-ERROR : External process exited with code 1. Command was: "cc" "-m64" " -D_GNU_SOURCE -D_FILE_OFFSET_BITS=64 -g -O2 -fPIC -D_THREAD_SAFE -Dlinux" "-lvorbisfile" "-I/home/hijarian/systems/cl-test-grid/work-dir/agent/quicklisp/dists/quicklisp/software/cffi_0.14.0/" "-o" "/home/hijarian/systems/cl-test-grid/work-dir/agent/test-runs/20141119155044-ecl-13.5.1-76a84246-linux-x64-lisp-to-c/fasl/ql/dists/quicklisp/software/mixalot-20131111-git/vorbisfile-grovelling" "/home/hijarian/systems/cl-test-grid/work-dir/agent/test-runs/20141119155044-ecl-13.5.1-76a84246-linux-x64-lisp-to-c/fasl/ql/dists/quicklisp/software/mixalot-20131111-git/vorbisfile-grovelling.c" Output was: <see above>
(LOAD mixalot-vorbis FAIL) ffi-grovel, CFFI-GROVEL:GROVEL-ERROR : External process exited with code 1. Command was: "cc" "-m64" " -D_GNU_SOURCE -D_FILE_OFFSET_BITS=64 -g -O2 -fPIC -D_THREAD_SAFE -Dlinux" "-lvorbisfile" "-I/home/hijarian/systems/cl-test-grid/work-dir/agent/quicklisp/dists/quicklisp/software/cffi_0.14.0/" "-o" "/home/hijarian/systems/cl-test-grid/work-dir/agent/test-runs/20141119155044-ecl-13.5.1-76a84246-linux-x64-lisp-to-c/fasl/ql/dists/quicklisp/software/mixalot-20131111-git/vorbisfile-grovelling" "/home/hijarian/systems/cl-test-grid/work-dir/agent/test-runs/20141119155044-ecl-13.5.1-76a84246-linux-x64-lisp-to-c/fasl/ql/dists/quicklisp/software/mixalot-20131111-git/vorbisfile-grovelling.c" Output was: <see above>
(LOAD mixalot-flac FAIL) ffi-grovel, CFFI-GROVEL:GROVEL-ERROR : External process exited with code 1. Command was: "cc" "-m64" " -D_GNU_SOURCE -D_FILE_OFFSET_BITS=64 -g -O2 -fPIC -D_THREAD_SAFE -Dlinux" "-lFLAC" "-lm" "-I/home/hijarian/systems/cl-test-grid/work-dir/agent/quicklisp/dists/quicklisp/software/cffi_0.14.0/" "-o" "/home/hijarian/systems/cl-test-grid/work-dir/agent/test-runs/20141119155044-ecl-13.5.1-76a84246-linux-x64-lisp-to-c/fasl/ql/dists/quicklisp/software/mixalot-20131111-git/flac-grovelling" "/home/hijarian/systems/cl-test-grid/work-dir/agent/test-runs/20141119155044-ecl-13.5.1-76a84246-linux-x64-lisp-to-c/fasl/ql/dists/quicklisp/software/mixalot-20131111-git/flac-grovelling.c" Output was: <see above>
(LOAD flac FAIL) ffi-grovel, CFFI-GROVEL:GROVEL-ERROR : External process exited with code 1. Command was: "cc" "-m64" " -D_GNU_SOURCE -D_FILE_OFFSET_BITS=64 -g -O2 -fPIC -D_THREAD_SAFE -Dlinux" "-lFLAC" "-lm" "-I/home/hijarian/systems/cl-test-grid/work-dir/agent/quicklisp/dists/quicklisp/software/cffi_0.14.0/" "-o" "/home/hijarian/systems/cl-test-grid/work-dir/agent/test-runs/20141119155044-ecl-13.5.1-76a84246-linux-x64-lisp-to-c/fasl/ql/dists/quicklisp/software/mixalot-20131111-git/flac-grovelling" "/home/hijarian/systems/cl-test-grid/work-dir/agent/test-runs/20141119155044-ecl-13.5.1-76a84246-linux-x64-lisp-to-c/fasl/ql/dists/quicklisp/software/mixalot-20131111-git/flac-grovelling.c" Output was: <see above>
(LOAD vorbisfile-ffi FAIL) ffi-grovel, CFFI-GROVEL:GROVEL-ERROR : External process exited with code 1. Command was: "cc" "-m64" " -D_GNU_SOURCE -D_FILE_OFFSET_BITS=64 -g -O2 -fPIC -D_THREAD_SAFE -Dlinux" "-lvorbisfile" "-I/home/hijarian/systems/cl-test-grid/work-dir/agent/quicklisp/dists/quicklisp/software/cffi_0.14.0/" "-o" "/home/hijarian/systems/cl-test-grid/work-dir/agent/test-runs/20141007135809-ecl-13.5.1-76a84246-linux-x64-lisp-to-c/fasl/ql/dists/quicklisp/software/mixalot-20131111-git/vorbisfile-grovelling" "/home/hijarian/systems/cl-test-grid/work-dir/agent/test-runs/20141007135809-ecl-13.5.1-76a84246-linux-x64-lisp-to-c/fasl/ql/dists/quicklisp/software/mixalot-20131111-git/vorbisfile-grovelling.c" Output was: <see above>
(LOAD mixalot-vorbis FAIL) ffi-grovel, CFFI-GROVEL:GROVEL-ERROR : External process exited with code 1. Command was: "cc" "-m64" " -D_GNU_SOURCE -D_FILE_OFFSET_BITS=64 -g -O2 -fPIC -D_THREAD_SAFE -Dlinux" "-lvorbisfile" "-I/home/hijarian/systems/cl-test-grid/work-dir/agent/quicklisp/dists/quicklisp/software/cffi_0.14.0/" "-o" "/home/hijarian/systems/cl-test-grid/work-dir/agent/test-runs/20141007135809-ecl-13.5.1-76a84246-linux-x64-lisp-to-c/fasl/ql/dists/quicklisp/software/mixalot-20131111-git/vorbisfile-grovelling" "/home/hijarian/systems/cl-test-grid/work-dir/agent/test-runs/20141007135809-ecl-13.5.1-76a84246-linux-x64-lisp-to-c/fasl/ql/dists/quicklisp/software/mixalot-20131111-git/vorbisfile-grovelling.c" Output was: <see above>
(LOAD mixalot-flac FAIL) ffi-grovel, CFFI-GROVEL:GROVEL-ERROR : External process exited with code 1. Command was: "cc" "-m64" " -D_GNU_SOURCE -D_FILE_OFFSET_BITS=64 -g -O2 -fPIC -D_THREAD_SAFE -Dlinux" "-lFLAC" "-lm" "-I/home/hijarian/systems/cl-test-grid/work-dir/agent/quicklisp/dists/quicklisp/software/cffi_0.14.0/" "-o" "/home/hijarian/systems/cl-test-grid/work-dir/agent/test-runs/20141007135809-ecl-13.5.1-76a84246-linux-x64-lisp-to-c/fasl/ql/dists/quicklisp/software/mixalot-20131111-git/flac-grovelling" "/home/hijarian/systems/cl-test-grid/work-dir/agent/test-runs/20141007135809-ecl-13.5.1-76a84246-linux-x64-lisp-to-c/fasl/ql/dists/quicklisp/software/mixalot-20131111-git/flac-grovelling.c" Output was: <see above>
(LOAD flac FAIL) ffi-grovel, CFFI-GROVEL:GROVEL-ERROR : External process exited with code 1. Command was: "cc" "-m64" " -D_GNU_SOURCE -D_FILE_OFFSET_BITS=64 -g -O2 -fPIC -D_THREAD_SAFE -Dlinux" "-lFLAC" "-lm" "-I/home/hijarian/systems/cl-test-grid/work-dir/agent/quicklisp/dists/quicklisp/software/cffi_0.14.0/" "-o" "/home/hijarian/systems/cl-test-grid/work-dir/agent/test-runs/20141007135809-ecl-13.5.1-76a84246-linux-x64-lisp-to-c/fasl/ql/dists/quicklisp/software/mixalot-20131111-git/flac-grovelling" "/home/hijarian/systems/cl-test-grid/work-dir/agent/test-runs/20141007135809-ecl-13.5.1-76a84246-linux-x64-lisp-to-c/fasl/ql/dists/quicklisp/software/mixalot-20131111-git/flac-grovelling.c" Output was: <see above>
ecl-13.5.1-unknown-linux-i686-bytecode
(LOAD vorbisfile-ffi FAIL) ASDF/FIND-SYSTEM:LOAD-SYSTEM-DEFINITION-ERROR : Error while trying to load definition for system vorbisfile-ffi from pathname /home/testgrid/cl-test-grid/work-dir/agent/quicklisp/dists/quicklisp/software/mixalot-20131111-git/vorbisfile-ffi.asd: The variable C::*CC-FLAGS* is unbound.
(LOAD mpg123-ffi FAIL) ffi, CFFI:LOAD-FOREIGN-LIBRARY-ERROR : Unable to load any of the alternatives: ("libmixalot-mpg123.so.0" "libmpg123.so.0" "/usr/lib/libmpg123.so" "/usr/local/lib/libmpg123.so")
(LOAD mixalot-vorbis FAIL) ASDF/FIND-SYSTEM:LOAD-SYSTEM-DEFINITION-ERROR : Error while trying to load definition for system vorbisfile-ffi from pathname /home/testgrid/cl-test-grid/work-dir/agent/quicklisp/dists/quicklisp/software/mixalot-20131111-git/vorbisfile-ffi.asd: The variable C::*CC-FLAGS* is unbound.
(LOAD mixalot-mp3 FAIL) ffi, CFFI:LOAD-FOREIGN-LIBRARY-ERROR : Unable to load any of the alternatives: ("libmixalot-mpg123.so.0" "libmpg123.so.0" "/usr/lib/libmpg123.so" "/usr/local/lib/libmpg123.so")
(LOAD mixalot-flac FAIL) ASDF/FIND-SYSTEM:LOAD-SYSTEM-DEFINITION-ERROR : Error while trying to load definition for system flac from pathname /home/testgrid/cl-test-grid/work-dir/agent/quicklisp/dists/quicklisp/software/mixalot-20131111-git/flac.asd: The variable C::*CC-FLAGS* is unbound.
(LOAD flac FAIL) ASDF/FIND-SYSTEM:LOAD-SYSTEM-DEFINITION-ERROR : Error while trying to load definition for system flac from pathname /home/testgrid/cl-test-grid/work-dir/agent/quicklisp/dists/quicklisp/software/mixalot-20131111-git/flac.asd: The variable C::*CC-FLAGS* is unbound.
(LOAD vorbisfile-ffi FAIL) ASDF/FIND-SYSTEM:LOAD-SYSTEM-DEFINITION-ERROR : Error while trying to load definition for system vorbisfile-ffi from pathname /home/testgrid/cl-test-grid/work-dir/agent/quicklisp/dists/quicklisp/software/mixalot-20131111-git/vorbisfile-ffi.asd: The variable C::*CC-FLAGS* is unbound.
(LOAD mpg123-ffi FAIL) ffi, CFFI:LOAD-FOREIGN-LIBRARY-ERROR : Unable to load any of the alternatives: ("libmixalot-mpg123.so.0" "libmpg123.so.0" "/usr/lib/libmpg123.so" "/usr/local/lib/libmpg123.so")
(LOAD mixalot-vorbis FAIL) ASDF/FIND-SYSTEM:LOAD-SYSTEM-DEFINITION-ERROR : Error while trying to load definition for system vorbisfile-ffi from pathname /home/testgrid/cl-test-grid/work-dir/agent/quicklisp/dists/quicklisp/software/mixalot-20131111-git/vorbisfile-ffi.asd: The variable C::*CC-FLAGS* is unbound.
(LOAD mixalot-mp3 FAIL) ffi, CFFI:LOAD-FOREIGN-LIBRARY-ERROR : Unable to load any of the alternatives: ("libmixalot-mpg123.so.0" "libmpg123.so.0" "/usr/lib/libmpg123.so" "/usr/local/lib/libmpg123.so")
(LOAD mixalot-flac FAIL) ASDF/FIND-SYSTEM:LOAD-SYSTEM-DEFINITION-ERROR : Error while trying to load definition for system flac from pathname /home/testgrid/cl-test-grid/work-dir/agent/quicklisp/dists/quicklisp/software/mixalot-20131111-git/flac.asd: The variable C::*CC-FLAGS* is unbound.
(LOAD flac FAIL) ASDF/FIND-SYSTEM:LOAD-SYSTEM-DEFINITION-ERROR : Error while trying to load definition for system flac from pathname /home/testgrid/cl-test-grid/work-dir/agent/quicklisp/dists/quicklisp/software/mixalot-20131111-git/flac.asd: The variable C::*CC-FLAGS* is unbound.
ecl-13.5.1-unknown-linux-i686-lisp-to-c
(LOAD vorbisfile-ffi FAIL) ffi-grovel, CFFI-GROVEL:GROVEL-ERROR : External process exited with code 1. Command was: "cc" "-m32" " -D_GNU_SOURCE -D_FILE_OFFSET_BITS=64 -g -O2 -fPIC -D_GNU_SOURCE -D_FILE_OFFSET_BITS=64 -g -O2 -fPIC -D_THREAD_SAFE -Dlinux" "-lvorbisfile" "-I/home/testgrid/cl-test-grid/work-dir/agent/quicklisp/dists/quicklisp/software/cffi_0.14.0/" "-o" "/home/testgrid/cl-test-grid/work-dir/agent/test-runs/20141116081731-ecl-13.5.1-unknown-linux-i686-lisp-to-c/fasl/ql/dists/quicklisp/software/mixalot-20131111-git/vorbisfile-grovelling" "/home/testgrid/cl-test-grid/work-dir/agent/test-runs/20141116081731-ecl-13.5.1-unknown-linux-i686-lisp-to-c/fasl/ql/dists/quicklisp/software/mixalot-20131111-git/vorbisfile-grovelling.c" Output was: <see above>
(LOAD mpg123-ffi FAIL) ffi, CFFI:LOAD-FOREIGN-LIBRARY-ERROR : Unable to load any of the alternatives: ("libmixalot-mpg123.so.0" "libmpg123.so.0" "/usr/lib/libmpg123.so" "/usr/local/lib/libmpg123.so")
(LOAD mixalot-vorbis FAIL) ffi-grovel, CFFI-GROVEL:GROVEL-ERROR : External process exited with code 1. Command was: "cc" "-m32" " -D_GNU_SOURCE -D_FILE_OFFSET_BITS=64 -g -O2 -fPIC -D_GNU_SOURCE -D_FILE_OFFSET_BITS=64 -g -O2 -fPIC -D_THREAD_SAFE -Dlinux" "-lvorbisfile" "-I/home/testgrid/cl-test-grid/work-dir/agent/quicklisp/dists/quicklisp/software/cffi_0.14.0/" "-o" "/home/testgrid/cl-test-grid/work-dir/agent/test-runs/20141116081731-ecl-13.5.1-unknown-linux-i686-lisp-to-c/fasl/ql/dists/quicklisp/software/mixalot-20131111-git/vorbisfile-grovelling" "/home/testgrid/cl-test-grid/work-dir/agent/test-runs/20141116081731-ecl-13.5.1-unknown-linux-i686-lisp-to-c/fasl/ql/dists/quicklisp/software/mixalot-20131111-git/vorbisfile-grovelling.c" Output was: <see above>
(LOAD mixalot-mp3 FAIL) ffi, CFFI:LOAD-FOREIGN-LIBRARY-ERROR : Unable to load any of the alternatives: ("libmixalot-mpg123.so.0" "libmpg123.so.0" "/usr/lib/libmpg123.so" "/usr/local/lib/libmpg123.so")
(LOAD mixalot-flac FAIL) ffi-grovel, CFFI-GROVEL:GROVEL-ERROR : External process exited with code 1. Command was: "cc" "-m32" " -D_GNU_SOURCE -D_FILE_OFFSET_BITS=64 -g -O2 -fPIC -D_GNU_SOURCE -D_FILE_OFFSET_BITS=64 -g -O2 -fPIC -D_THREAD_SAFE -Dlinux" "-lFLAC" "-lm" "-I/home/testgrid/cl-test-grid/work-dir/agent/quicklisp/dists/quicklisp/software/cffi_0.14.0/" "-o" "/home/testgrid/cl-test-grid/work-dir/agent/test-runs/20141116081731-ecl-13.5.1-unknown-linux-i686-lisp-to-c/fasl/ql/dists/quicklisp/software/mixalot-20131111-git/flac-grovelling" "/home/testgrid/cl-test-grid/work-dir/agent/test-runs/20141116081731-ecl-13.5.1-unknown-linux-i686-lisp-to-c/fasl/ql/dists/quicklisp/software/mixalot-20131111-git/flac-grovelling.c" Output was: <see above>
(LOAD flac FAIL) ffi-grovel, CFFI-GROVEL:GROVEL-ERROR : External process exited with code 1. Command was: "cc" "-m32" " -D_GNU_SOURCE -D_FILE_OFFSET_BITS=64 -g -O2 -fPIC -D_GNU_SOURCE -D_FILE_OFFSET_BITS=64 -g -O2 -fPIC -D_THREAD_SAFE -Dlinux" "-lFLAC" "-lm" "-I/home/testgrid/cl-test-grid/work-dir/agent/quicklisp/dists/quicklisp/software/cffi_0.14.0/" "-o" "/home/testgrid/cl-test-grid/work-dir/agent/test-runs/20141116081731-ecl-13.5.1-unknown-linux-i686-lisp-to-c/fasl/ql/dists/quicklisp/software/mixalot-20131111-git/flac-grovelling" "/home/testgrid/cl-test-grid/work-dir/agent/test-runs/20141116081731-ecl-13.5.1-unknown-linux-i686-lisp-to-c/fasl/ql/dists/quicklisp/software/mixalot-20131111-git/flac-grovelling.c" Output was: <see above>
(LOAD vorbisfile-ffi FAIL) ffi-grovel, CFFI-GROVEL:GROVEL-ERROR : External process exited with code 1. Command was: "cc" "-m32" " -D_GNU_SOURCE -D_FILE_OFFSET_BITS=64 -g -O2 -fPIC -D_GNU_SOURCE -D_FILE_OFFSET_BITS=64 -g -O2 -fPIC -D_THREAD_SAFE -Dlinux" "-lvorbisfile" "-I/home/testgrid/cl-test-grid/work-dir/agent/quicklisp/dists/quicklisp/software/cffi_0.14.0/" "-o" "/home/testgrid/cl-test-grid/work-dir/agent/test-runs/20141103110324-ecl-13.5.1-unknown-linux-i686-lisp-to-c/fasl/ql/dists/quicklisp/software/mixalot-20131111-git/vorbisfile-grovelling" "/home/testgrid/cl-test-grid/work-dir/agent/test-runs/20141103110324-ecl-13.5.1-unknown-linux-i686-lisp-to-c/fasl/ql/dists/quicklisp/software/mixalot-20131111-git/vorbisfile-grovelling.c" Output was: <see above>
(LOAD mpg123-ffi FAIL) ffi, CFFI:LOAD-FOREIGN-LIBRARY-ERROR : Unable to load any of the alternatives: ("libmixalot-mpg123.so.0" "libmpg123.so.0" "/usr/lib/libmpg123.so" "/usr/local/lib/libmpg123.so")
(LOAD mixalot-vorbis FAIL) ffi-grovel, CFFI-GROVEL:GROVEL-ERROR : External process exited with code 1. Command was: "cc" "-m32" " -D_GNU_SOURCE -D_FILE_OFFSET_BITS=64 -g -O2 -fPIC -D_GNU_SOURCE -D_FILE_OFFSET_BITS=64 -g -O2 -fPIC -D_THREAD_SAFE -Dlinux" "-lvorbisfile" "-I/home/testgrid/cl-test-grid/work-dir/agent/quicklisp/dists/quicklisp/software/cffi_0.14.0/" "-o" "/home/testgrid/cl-test-grid/work-dir/agent/test-runs/20141103110324-ecl-13.5.1-unknown-linux-i686-lisp-to-c/fasl/ql/dists/quicklisp/software/mixalot-20131111-git/vorbisfile-grovelling" "/home/testgrid/cl-test-grid/work-dir/agent/test-runs/20141103110324-ecl-13.5.1-unknown-linux-i686-lisp-to-c/fasl/ql/dists/quicklisp/software/mixalot-20131111-git/vorbisfile-grovelling.c" Output was: <see above>
(LOAD mixalot-mp3 FAIL) ffi, CFFI:LOAD-FOREIGN-LIBRARY-ERROR : Unable to load any of the alternatives: ("libmixalot-mpg123.so.0" "libmpg123.so.0" "/usr/lib/libmpg123.so" "/usr/local/lib/libmpg123.so")
(LOAD mixalot-flac FAIL) ffi-grovel, CFFI-GROVEL:GROVEL-ERROR : External process exited with code 1. Command was: "cc" "-m32" " -D_GNU_SOURCE -D_FILE_OFFSET_BITS=64 -g -O2 -fPIC -D_GNU_SOURCE -D_FILE_OFFSET_BITS=64 -g -O2 -fPIC -D_THREAD_SAFE -Dlinux" "-lFLAC" "-lm" "-I/home/testgrid/cl-test-grid/work-dir/agent/quicklisp/dists/quicklisp/software/cffi_0.14.0/" "-o" "/home/testgrid/cl-test-grid/work-dir/agent/test-runs/20141103110324-ecl-13.5.1-unknown-linux-i686-lisp-to-c/fasl/ql/dists/quicklisp/software/mixalot-20131111-git/flac-grovelling" "/home/testgrid/cl-test-grid/work-dir/agent/test-runs/20141103110324-ecl-13.5.1-unknown-linux-i686-lisp-to-c/fasl/ql/dists/quicklisp/software/mixalot-20131111-git/flac-grovelling.c" Output was: <see above>
(LOAD flac FAIL) ffi-grovel, CFFI-GROVEL:GROVEL-ERROR : External process exited with code 1. Command was: "cc" "-m32" " -D_GNU_SOURCE -D_FILE_OFFSET_BITS=64 -g -O2 -fPIC -D_GNU_SOURCE -D_FILE_OFFSET_BITS=64 -g -O2 -fPIC -D_THREAD_SAFE -Dlinux" "-lFLAC" "-lm" "-I/home/testgrid/cl-test-grid/work-dir/agent/quicklisp/dists/quicklisp/software/cffi_0.14.0/" "-o" "/home/testgrid/cl-test-grid/work-dir/agent/test-runs/20141103110324-ecl-13.5.1-unknown-linux-i686-lisp-to-c/fasl/ql/dists/quicklisp/software/mixalot-20131111-git/flac-grovelling" "/home/testgrid/cl-test-grid/work-dir/agent/test-runs/20141103110324-ecl-13.5.1-unknown-linux-i686-lisp-to-c/fasl/ql/dists/quicklisp/software/mixalot-20131111-git/flac-grovelling.c" Output was: <see above>
sbcl-1.0.58-linux-x86
(LOAD vorbisfile-ffi FAIL) ffi-grovel, CFFI-GROVEL:GROVEL-ERROR : External process exited with code 1. Command was: "cc" "-m32" "-lvorbisfile" "-I/home/testgrid/cl-test-grid/work-dir/agent/quicklisp/dists/quicklisp/software/cffi_0.14.0/" "-o" "/home/testgrid/cl-test-grid/work-dir/agent/test-runs/20141115150426-sbcl-1.0.58-linux-x86/fasl/ql/dists/quicklisp/software/mixalot-20131111-git/vorbisfile-grovelling" "/home/testgrid/cl-test-grid/work-dir/agent/test-runs/20141115150426-sbcl-1.0.58-linux-x86/fasl/ql/dists/quicklisp/software/mixalot-20131111-git/vorbisfile-grovelling.c" Output was: /home/testgrid/cl-test-grid/work-dir/agent/test-runs/20141115150426-sbcl-1.0.58-linux-x86/fasl/ql/dists/quicklisp/software/mixalot-20131111-git/vorbisfile-grovelling.c:6:31: fatal error: vorbis/vorbisfile.h: No such file or directory compilation terminated.
(LOAD mpg123-ffi FAIL) ffi, CFFI:LOAD-FOREIGN-LIBRARY-ERROR : Unable to load any of the alternatives: ("libmixalot-mpg123.so.0" "libmpg123.so.0" "/usr/lib/libmpg123.so" "/usr/local/lib/libmpg123.so")
(LOAD mixalot-vorbis FAIL) ffi-grovel, CFFI-GROVEL:GROVEL-ERROR : External process exited with code 1. Command was: "cc" "-m32" "-lvorbisfile" "-I/home/testgrid/cl-test-grid/work-dir/agent/quicklisp/dists/quicklisp/software/cffi_0.14.0/" "-o" "/home/testgrid/cl-test-grid/work-dir/agent/test-runs/20141115150426-sbcl-1.0.58-linux-x86/fasl/ql/dists/quicklisp/software/mixalot-20131111-git/vorbisfile-grovelling" "/home/testgrid/cl-test-grid/work-dir/agent/test-runs/20141115150426-sbcl-1.0.58-linux-x86/fasl/ql/dists/quicklisp/software/mixalot-20131111-git/vorbisfile-grovelling.c" Output was: /home/testgrid/cl-test-grid/work-dir/agent/test-runs/20141115150426-sbcl-1.0.58-linux-x86/fasl/ql/dists/quicklisp/software/mixalot-20131111-git/vorbisfile-grovelling.c:6:31: fatal error: vorbis/vorbisfile.h: No such file or directory compilation terminated.
(LOAD mixalot-mp3 FAIL) ffi, CFFI:LOAD-FOREIGN-LIBRARY-ERROR : Unable to load any of the alternatives: ("libmixalot-mpg123.so.0" "libmpg123.so.0" "/usr/lib/libmpg123.so" "/usr/local/lib/libmpg123.so")
(LOAD mixalot-flac FAIL) ffi-grovel, CFFI-GROVEL:GROVEL-ERROR : External process exited with code 1. Command was: "cc" "-m32" "-lFLAC" "-lm" "-I/home/testgrid/cl-test-grid/work-dir/agent/quicklisp/dists/quicklisp/software/cffi_0.14.0/" "-o" "/home/testgrid/cl-test-grid/work-dir/agent/test-runs/20141115150426-sbcl-1.0.58-linux-x86/fasl/ql/dists/quicklisp/software/mixalot-20131111-git/flac-grovelling" "/home/testgrid/cl-test-grid/work-dir/agent/test-runs/20141115150426-sbcl-1.0.58-linux-x86/fasl/ql/dists/quicklisp/software/mixalot-20131111-git/flac-grovelling.c" Output was: /home/testgrid/cl-test-grid/work-dir/agent/test-runs/20141115150426-sbcl-1.0.58-linux-x86/fasl/ql/dists/quicklisp/software/mixalot-20131111-git/flac-grovelling.c:6:33: fatal error: FLAC/stream_decoder.h: No such file or directory compilation terminated.
(LOAD flac FAIL) ffi-grovel, CFFI-GROVEL:GROVEL-ERROR : External process exited with code 1. Command was: "cc" "-m32" "-lFLAC" "-lm" "-I/home/testgrid/cl-test-grid/work-dir/agent/quicklisp/dists/quicklisp/software/cffi_0.14.0/" "-o" "/home/testgrid/cl-test-grid/work-dir/agent/test-runs/20141115150426-sbcl-1.0.58-linux-x86/fasl/ql/dists/quicklisp/software/mixalot-20131111-git/flac-grovelling" "/home/testgrid/cl-test-grid/work-dir/agent/test-runs/20141115150426-sbcl-1.0.58-linux-x86/fasl/ql/dists/quicklisp/software/mixalot-20131111-git/flac-grovelling.c" Output was: /home/testgrid/cl-test-grid/work-dir/agent/test-runs/20141115150426-sbcl-1.0.58-linux-x86/fasl/ql/dists/quicklisp/software/mixalot-20131111-git/flac-grovelling.c:6:33: fatal error: FLAC/stream_decoder.h: No such file or directory compilation terminated.
(LOAD vorbisfile-ffi FAIL) ffi-grovel, CFFI-GROVEL:GROVEL-ERROR : External process exited with code 1. Command was: "cc" "-m32" "-lvorbisfile" "-I/home/testgrid/cl-test-grid/work-dir/agent/quicklisp/dists/quicklisp/software/cffi_0.14.0/" "-o" "/home/testgrid/cl-test-grid/work-dir/agent/test-runs/20141008035530-sbcl-1.0.58-linux-x86/fasl/ql/dists/quicklisp/software/mixalot-20131111-git/vorbisfile-grovelling" "/home/testgrid/cl-test-grid/work-dir/agent/test-runs/20141008035530-sbcl-1.0.58-linux-x86/fasl/ql/dists/quicklisp/software/mixalot-20131111-git/vorbisfile-grovelling.c" Output was: /home/testgrid/cl-test-grid/work-dir/agent/test-runs/20141008035530-sbcl-1.0.58-linux-x86/fasl/ql/dists/quicklisp/software/mixalot-20131111-git/vorbisfile-grovelling.c:6:31: fatal error: vorbis/vorbisfile.h: No such file or directory compilation terminated.
(LOAD mpg123-ffi FAIL) ffi, CFFI:LOAD-FOREIGN-LIBRARY-ERROR : Unable to load any of the alternatives: ("libmixalot-mpg123.so.0" "libmpg123.so.0" "/usr/lib/libmpg123.so" "/usr/local/lib/libmpg123.so")
(LOAD mixalot-vorbis FAIL) ffi-grovel, CFFI-GROVEL:GROVEL-ERROR : External process exited with code 1. Command was: "cc" "-m32" "-lvorbisfile" "-I/home/testgrid/cl-test-grid/work-dir/agent/quicklisp/dists/quicklisp/software/cffi_0.14.0/" "-o" "/home/testgrid/cl-test-grid/work-dir/agent/test-runs/20141008035530-sbcl-1.0.58-linux-x86/fasl/ql/dists/quicklisp/software/mixalot-20131111-git/vorbisfile-grovelling" "/home/testgrid/cl-test-grid/work-dir/agent/test-runs/20141008035530-sbcl-1.0.58-linux-x86/fasl/ql/dists/quicklisp/software/mixalot-20131111-git/vorbisfile-grovelling.c" Output was: /home/testgrid/cl-test-grid/work-dir/agent/test-runs/20141008035530-sbcl-1.0.58-linux-x86/fasl/ql/dists/quicklisp/software/mixalot-20131111-git/vorbisfile-grovelling.c:6:31: fatal error: vorbis/vorbisfile.h: No such file or directory compilation terminated.
(LOAD mixalot-mp3 FAIL) ffi, CFFI:LOAD-FOREIGN-LIBRARY-ERROR : Unable to load any of the alternatives: ("libmixalot-mpg123.so.0" "libmpg123.so.0" "/usr/lib/libmpg123.so" "/usr/local/lib/libmpg123.so")
(LOAD mixalot-flac FAIL) ffi-grovel, CFFI-GROVEL:GROVEL-ERROR : External process exited with code 1. Command was: "cc" "-m32" "-lFLAC" "-lm" "-I/home/testgrid/cl-test-grid/work-dir/agent/quicklisp/dists/quicklisp/software/cffi_0.14.0/" "-o" "/home/testgrid/cl-test-grid/work-dir/agent/test-runs/20141008035530-sbcl-1.0.58-linux-x86/fasl/ql/dists/quicklisp/software/mixalot-20131111-git/flac-grovelling" "/home/testgrid/cl-test-grid/work-dir/agent/test-runs/20141008035530-sbcl-1.0.58-linux-x86/fasl/ql/dists/quicklisp/software/mixalot-20131111-git/flac-grovelling.c" Output was: /home/testgrid/cl-test-grid/work-dir/agent/test-runs/20141008035530-sbcl-1.0.58-linux-x86/fasl/ql/dists/quicklisp/software/mixalot-20131111-git/flac-grovelling.c:6:33: fatal error: FLAC/stream_decoder.h: No such file or directory compilation terminated.
(LOAD flac FAIL) ffi-grovel, CFFI-GROVEL:GROVEL-ERROR : External process exited with code 1. Command was: "cc" "-m32" "-lFLAC" "-lm" "-I/home/testgrid/cl-test-grid/work-dir/agent/quicklisp/dists/quicklisp/software/cffi_0.14.0/" "-o" "/home/testgrid/cl-test-grid/work-dir/agent/test-runs/20141008035530-sbcl-1.0.58-linux-x86/fasl/ql/dists/quicklisp/software/mixalot-20131111-git/flac-grovelling" "/home/testgrid/cl-test-grid/work-dir/agent/test-runs/20141008035530-sbcl-1.0.58-linux-x86/fasl/ql/dists/quicklisp/software/mixalot-20131111-git/flac-grovelling.c" Output was: /home/testgrid/cl-test-grid/work-dir/agent/test-runs/20141008035530-sbcl-1.0.58-linux-x86/fasl/ql/dists/quicklisp/software/mixalot-20131111-git/flac-grovelling.c:6:33: fatal error: FLAC/stream_decoder.h: No such file or directory compilation terminated.
sbcl-1.1.11-linux-x86
(LOAD vorbisfile-ffi FAIL) ffi-grovel, CFFI-GROVEL:GROVEL-ERROR : External process exited with code 1. Command was: "cc" "-m32" "-lvorbisfile" "-I/home/testgrid/cl-test-grid/work-dir/agent/quicklisp/dists/quicklisp/software/cffi_0.14.0/" "-o" "/home/testgrid/cl-test-grid/work-dir/agent/test-runs/20141115131427-sbcl-1.1.11-linux-x86/fasl/ql/dists/quicklisp/software/mixalot-20131111-git/vorbisfile-grovelling" "/home/testgrid/cl-test-grid/work-dir/agent/test-runs/20141115131427-sbcl-1.1.11-linux-x86/fasl/ql/dists/quicklisp/software/mixalot-20131111-git/vorbisfile-grovelling.c" Output was: /home/testgrid/cl-test-grid/work-dir/agent/test-runs/20141115131427-sbcl-1.1.11-linux-x86/fasl/ql/dists/quicklisp/software/mixalot-20131111-git/vorbisfile-grovelling.c:6:31: fatal error: vorbis/vorbisfile.h: No such file or directory compilation terminated.
(LOAD mpg123-ffi FAIL) ffi, CFFI:LOAD-FOREIGN-LIBRARY-ERROR : Unable to load any of the alternatives: ("libmixalot-mpg123.so.0" "libmpg123.so.0" "/usr/lib/libmpg123.so" "/usr/local/lib/libmpg123.so")
(LOAD mixalot-vorbis FAIL) ffi-grovel, CFFI-GROVEL:GROVEL-ERROR : External process exited with code 1. Command was: "cc" "-m32" "-lvorbisfile" "-I/home/testgrid/cl-test-grid/work-dir/agent/quicklisp/dists/quicklisp/software/cffi_0.14.0/" "-o" "/home/testgrid/cl-test-grid/work-dir/agent/test-runs/20141115131427-sbcl-1.1.11-linux-x86/fasl/ql/dists/quicklisp/software/mixalot-20131111-git/vorbisfile-grovelling" "/home/testgrid/cl-test-grid/work-dir/agent/test-runs/20141115131427-sbcl-1.1.11-linux-x86/fasl/ql/dists/quicklisp/software/mixalot-20131111-git/vorbisfile-grovelling.c" Output was: /home/testgrid/cl-test-grid/work-dir/agent/test-runs/20141115131427-sbcl-1.1.11-linux-x86/fasl/ql/dists/quicklisp/software/mixalot-20131111-git/vorbisfile-grovelling.c:6:31: fatal error: vorbis/vorbisfile.h: No such file or directory compilation terminated.
(LOAD mixalot-mp3 FAIL) ffi, CFFI:LOAD-FOREIGN-LIBRARY-ERROR : Unable to load any of the alternatives: ("libmixalot-mpg123.so.0" "libmpg123.so.0" "/usr/lib/libmpg123.so" "/usr/local/lib/libmpg123.so")
(LOAD mixalot-flac FAIL) ffi-grovel, CFFI-GROVEL:GROVEL-ERROR : External process exited with code 1. Command was: "cc" "-m32" "-lFLAC" "-lm" "-I/home/testgrid/cl-test-grid/work-dir/agent/quicklisp/dists/quicklisp/software/cffi_0.14.0/" "-o" "/home/testgrid/cl-test-grid/work-dir/agent/test-runs/20141115131427-sbcl-1.1.11-linux-x86/fasl/ql/dists/quicklisp/software/mixalot-20131111-git/flac-grovelling" "/home/testgrid/cl-test-grid/work-dir/agent/test-runs/20141115131427-sbcl-1.1.11-linux-x86/fasl/ql/dists/quicklisp/software/mixalot-20131111-git/flac-grovelling.c" Output was: /home/testgrid/cl-test-grid/work-dir/agent/test-runs/20141115131427-sbcl-1.1.11-linux-x86/fasl/ql/dists/quicklisp/software/mixalot-20131111-git/flac-grovelling.c:6:33: fatal error: FLAC/stream_decoder.h: No such file or directory compilation terminated.
(LOAD flac FAIL) ffi-grovel, CFFI-GROVEL:GROVEL-ERROR : External process exited with code 1. Command was: "cc" "-m32" "-lFLAC" "-lm" "-I/home/testgrid/cl-test-grid/work-dir/agent/quicklisp/dists/quicklisp/software/cffi_0.14.0/" "-o" "/home/testgrid/cl-test-grid/work-dir/agent/test-runs/20141115131427-sbcl-1.1.11-linux-x86/fasl/ql/dists/quicklisp/software/mixalot-20131111-git/flac-grovelling" "/home/testgrid/cl-test-grid/work-dir/agent/test-runs/20141115131427-sbcl-1.1.11-linux-x86/fasl/ql/dists/quicklisp/software/mixalot-20131111-git/flac-grovelling.c" Output was: /home/testgrid/cl-test-grid/work-dir/agent/test-runs/20141115131427-sbcl-1.1.11-linux-x86/fasl/ql/dists/quicklisp/software/mixalot-20131111-git/flac-grovelling.c:6:33: fatal error: FLAC/stream_decoder.h: No such file or directory compilation terminated.
(LOAD vorbisfile-ffi FAIL) ffi-grovel, CFFI-GROVEL:GROVEL-ERROR : External process exited with code 1. Command was: "cc" "-m32" "-lvorbisfile" "-I/home/testgrid/cl-test-grid/work-dir/agent/quicklisp/dists/quicklisp/software/cffi_0.14.0/" "-o" "/home/testgrid/cl-test-grid/work-dir/agent/test-runs/20141007112213-sbcl-1.1.11-linux-x86/fasl/ql/dists/quicklisp/software/mixalot-20131111-git/vorbisfile-grovelling" "/home/testgrid/cl-test-grid/work-dir/agent/test-runs/20141007112213-sbcl-1.1.11-linux-x86/fasl/ql/dists/quicklisp/software/mixalot-20131111-git/vorbisfile-grovelling.c" Output was: /home/testgrid/cl-test-grid/work-dir/agent/test-runs/20141007112213-sbcl-1.1.11-linux-x86/fasl/ql/dists/quicklisp/software/mixalot-20131111-git/vorbisfile-grovelling.c:6:31: fatal error: vorbis/vorbisfile.h: No such file or directory compilation terminated.
(LOAD mpg123-ffi FAIL) ffi, CFFI:LOAD-FOREIGN-LIBRARY-ERROR : Unable to load any of the alternatives: ("libmixalot-mpg123.so.0" "libmpg123.so.0" "/usr/lib/libmpg123.so" "/usr/local/lib/libmpg123.so")
(LOAD mixalot-vorbis FAIL) ffi-grovel, CFFI-GROVEL:GROVEL-ERROR : External process exited with code 1. Command was: "cc" "-m32" "-lvorbisfile" "-I/home/testgrid/cl-test-grid/work-dir/agent/quicklisp/dists/quicklisp/software/cffi_0.14.0/" "-o" "/home/testgrid/cl-test-grid/work-dir/agent/test-runs/20141007112213-sbcl-1.1.11-linux-x86/fasl/ql/dists/quicklisp/software/mixalot-20131111-git/vorbisfile-grovelling" "/home/testgrid/cl-test-grid/work-dir/agent/test-runs/20141007112213-sbcl-1.1.11-linux-x86/fasl/ql/dists/quicklisp/software/mixalot-20131111-git/vorbisfile-grovelling.c" Output was: /home/testgrid/cl-test-grid/work-dir/agent/test-runs/20141007112213-sbcl-1.1.11-linux-x86/fasl/ql/dists/quicklisp/software/mixalot-20131111-git/vorbisfile-grovelling.c:6:31: fatal error: vorbis/vorbisfile.h: No such file or directory compilation terminated.
(LOAD mixalot-mp3 FAIL) ffi, CFFI:LOAD-FOREIGN-LIBRARY-ERROR : Unable to load any of the alternatives: ("libmixalot-mpg123.so.0" "libmpg123.so.0" "/usr/lib/libmpg123.so" "/usr/local/lib/libmpg123.so")
(LOAD mixalot-flac FAIL) ffi-grovel, CFFI-GROVEL:GROVEL-ERROR : External process exited with code 1. Command was: "cc" "-m32" "-lFLAC" "-lm" "-I/home/testgrid/cl-test-grid/work-dir/agent/quicklisp/dists/quicklisp/software/cffi_0.14.0/" "-o" "/home/testgrid/cl-test-grid/work-dir/agent/test-runs/20141007112213-sbcl-1.1.11-linux-x86/fasl/ql/dists/quicklisp/software/mixalot-20131111-git/flac-grovelling" "/home/testgrid/cl-test-grid/work-dir/agent/test-runs/20141007112213-sbcl-1.1.11-linux-x86/fasl/ql/dists/quicklisp/software/mixalot-20131111-git/flac-grovelling.c" Output was: /home/testgrid/cl-test-grid/work-dir/agent/test-runs/20141007112213-sbcl-1.1.11-linux-x86/fasl/ql/dists/quicklisp/software/mixalot-20131111-git/flac-grovelling.c:6:33: fatal error: FLAC/stream_decoder.h: No such file or directory compilation terminated.
(LOAD flac FAIL) ffi-grovel, CFFI-GROVEL:GROVEL-ERROR : External process exited with code 1. Command was: "cc" "-m32" "-lFLAC" "-lm" "-I/home/testgrid/cl-test-grid/work-dir/agent/quicklisp/dists/quicklisp/software/cffi_0.14.0/" "-o" "/home/testgrid/cl-test-grid/work-dir/agent/test-runs/20141007112213-sbcl-1.1.11-linux-x86/fasl/ql/dists/quicklisp/software/mixalot-20131111-git/flac-grovelling" "/home/testgrid/cl-test-grid/work-dir/agent/test-runs/20141007112213-sbcl-1.1.11-linux-x86/fasl/ql/dists/quicklisp/software/mixalot-20131111-git/flac-grovelling.c" Output was: /home/testgrid/cl-test-grid/work-dir/agent/test-runs/20141007112213-sbcl-1.1.11-linux-x86/fasl/ql/dists/quicklisp/software/mixalot-20131111-git/flac-grovelling.c:6:33: fatal error: FLAC/stream_decoder.h: No such file or directory compilation terminated.
sbcl-1.1.16-linux-x86
(LOAD vorbisfile-ffi FAIL) ffi-grovel, CFFI-GROVEL:GROVEL-ERROR : External process exited with code 1. Command was: "cc" "-m32" "-lvorbisfile" "-I/home/testgrid/cl-test-grid/work-dir/agent/quicklisp/dists/quicklisp/software/cffi_0.14.0/" "-o" "/home/testgrid/cl-test-grid/work-dir/agent/test-runs/20141115055137-sbcl-1.1.16-linux-x86/fasl/ql/dists/quicklisp/software/mixalot-20131111-git/vorbisfile-grovelling" "/home/testgrid/cl-test-grid/work-dir/agent/test-runs/20141115055137-sbcl-1.1.16-linux-x86/fasl/ql/dists/quicklisp/software/mixalot-20131111-git/vorbisfile-grovelling.c" Output was: /home/testgrid/cl-test-grid/work-dir/agent/test-runs/20141115055137-sbcl-1.1.16-linux-x86/fasl/ql/dists/quicklisp/software/mixalot-20131111-git/vorbisfile-grovelling.c:6:31: fatal error: vorbis/vorbisfile.h: No such file or directory compilation terminated.
(LOAD mpg123-ffi FAIL) ffi, CFFI:LOAD-FOREIGN-LIBRARY-ERROR : Unable to load any of the alternatives: ("libmixalot-mpg123.so.0" "libmpg123.so.0" "/usr/lib/libmpg123.so" "/usr/local/lib/libmpg123.so")
(LOAD mixalot-vorbis FAIL) ffi-grovel, CFFI-GROVEL:GROVEL-ERROR : External process exited with code 1. Command was: "cc" "-m32" "-lvorbisfile" "-I/home/testgrid/cl-test-grid/work-dir/agent/quicklisp/dists/quicklisp/software/cffi_0.14.0/" "-o" "/home/testgrid/cl-test-grid/work-dir/agent/test-runs/20141115055137-sbcl-1.1.16-linux-x86/fasl/ql/dists/quicklisp/software/mixalot-20131111-git/vorbisfile-grovelling" "/home/testgrid/cl-test-grid/work-dir/agent/test-runs/20141115055137-sbcl-1.1.16-linux-x86/fasl/ql/dists/quicklisp/software/mixalot-20131111-git/vorbisfile-grovelling.c" Output was: /home/testgrid/cl-test-grid/work-dir/agent/test-runs/20141115055137-sbcl-1.1.16-linux-x86/fasl/ql/dists/quicklisp/software/mixalot-20131111-git/vorbisfile-grovelling.c:6:31: fatal error: vorbis/vorbisfile.h: No such file or directory compilation terminated.
(LOAD mixalot-mp3 FAIL) ffi, CFFI:LOAD-FOREIGN-LIBRARY-ERROR : Unable to load any of the alternatives: ("libmixalot-mpg123.so.0" "libmpg123.so.0" "/usr/lib/libmpg123.so" "/usr/local/lib/libmpg123.so")
(LOAD mixalot-flac FAIL) ffi-grovel, CFFI-GROVEL:GROVEL-ERROR : External process exited with code 1. Command was: "cc" "-m32" "-lFLAC" "-lm" "-I/home/testgrid/cl-test-grid/work-dir/agent/quicklisp/dists/quicklisp/software/cffi_0.14.0/" "-o" "/home/testgrid/cl-test-grid/work-dir/agent/test-runs/20141115055137-sbcl-1.1.16-linux-x86/fasl/ql/dists/quicklisp/software/mixalot-20131111-git/flac-grovelling" "/home/testgrid/cl-test-grid/work-dir/agent/test-runs/20141115055137-sbcl-1.1.16-linux-x86/fasl/ql/dists/quicklisp/software/mixalot-20131111-git/flac-grovelling.c" Output was: /home/testgrid/cl-test-grid/work-dir/agent/test-runs/20141115055137-sbcl-1.1.16-linux-x86/fasl/ql/dists/quicklisp/software/mixalot-20131111-git/flac-grovelling.c:6:33: fatal error: FLAC/stream_decoder.h: No such file or directory compilation terminated.
(LOAD flac FAIL) ffi-grovel, CFFI-GROVEL:GROVEL-ERROR : External process exited with code 1. Command was: "cc" "-m32" "-lFLAC" "-lm" "-I/home/testgrid/cl-test-grid/work-dir/agent/quicklisp/dists/quicklisp/software/cffi_0.14.0/" "-o" "/home/testgrid/cl-test-grid/work-dir/agent/test-runs/20141115055137-sbcl-1.1.16-linux-x86/fasl/ql/dists/quicklisp/software/mixalot-20131111-git/flac-grovelling" "/home/testgrid/cl-test-grid/work-dir/agent/test-runs/20141115055137-sbcl-1.1.16-linux-x86/fasl/ql/dists/quicklisp/software/mixalot-20131111-git/flac-grovelling.c" Output was: /home/testgrid/cl-test-grid/work-dir/agent/test-runs/20141115055137-sbcl-1.1.16-linux-x86/fasl/ql/dists/quicklisp/software/mixalot-20131111-git/flac-grovelling.c:6:33: fatal error: FLAC/stream_decoder.h: No such file or directory compilation terminated.
(LOAD vorbisfile-ffi FAIL) ffi-grovel, CFFI-GROVEL:GROVEL-ERROR : External process exited with code 1. Command was: "cc" "-m32" "-lvorbisfile" "-I/home/testgrid/cl-test-grid/work-dir/agent/quicklisp/dists/quicklisp/software/cffi_0.14.0/" "-o" "/home/testgrid/cl-test-grid/work-dir/agent/test-runs/20141007030239-sbcl-1.1.16-linux-x86/fasl/ql/dists/quicklisp/software/mixalot-20131111-git/vorbisfile-grovelling" "/home/testgrid/cl-test-grid/work-dir/agent/test-runs/20141007030239-sbcl-1.1.16-linux-x86/fasl/ql/dists/quicklisp/software/mixalot-20131111-git/vorbisfile-grovelling.c" Output was: /home/testgrid/cl-test-grid/work-dir/agent/test-runs/20141007030239-sbcl-1.1.16-linux-x86/fasl/ql/dists/quicklisp/software/mixalot-20131111-git/vorbisfile-grovelling.c:6:31: fatal error: vorbis/vorbisfile.h: No such file or directory compilation terminated.
(LOAD mpg123-ffi FAIL) ffi, CFFI:LOAD-FOREIGN-LIBRARY-ERROR : Unable to load any of the alternatives: ("libmixalot-mpg123.so.0" "libmpg123.so.0" "/usr/lib/libmpg123.so" "/usr/local/lib/libmpg123.so")
(LOAD mixalot-vorbis FAIL) ffi-grovel, CFFI-GROVEL:GROVEL-ERROR : External process exited with code 1. Command was: "cc" "-m32" "-lvorbisfile" "-I/home/testgrid/cl-test-grid/work-dir/agent/quicklisp/dists/quicklisp/software/cffi_0.14.0/" "-o" "/home/testgrid/cl-test-grid/work-dir/agent/test-runs/20141007030239-sbcl-1.1.16-linux-x86/fasl/ql/dists/quicklisp/software/mixalot-20131111-git/vorbisfile-grovelling" "/home/testgrid/cl-test-grid/work-dir/agent/test-runs/20141007030239-sbcl-1.1.16-linux-x86/fasl/ql/dists/quicklisp/software/mixalot-20131111-git/vorbisfile-grovelling.c" Output was: /home/testgrid/cl-test-grid/work-dir/agent/test-runs/20141007030239-sbcl-1.1.16-linux-x86/fasl/ql/dists/quicklisp/software/mixalot-20131111-git/vorbisfile-grovelling.c:6:31: fatal error: vorbis/vorbisfile.h: No such file or directory compilation terminated.
(LOAD mixalot-mp3 FAIL) ffi, CFFI:LOAD-FOREIGN-LIBRARY-ERROR : Unable to load any of the alternatives: ("libmixalot-mpg123.so.0" "libmpg123.so.0" "/usr/lib/libmpg123.so" "/usr/local/lib/libmpg123.so")
(LOAD mixalot-flac FAIL) ffi-grovel, CFFI-GROVEL:GROVEL-ERROR : External process exited with code 1. Command was: "cc" "-m32" "-lFLAC" "-lm" "-I/home/testgrid/cl-test-grid/work-dir/agent/quicklisp/dists/quicklisp/software/cffi_0.14.0/" "-o" "/home/testgrid/cl-test-grid/work-dir/agent/test-runs/20141007030239-sbcl-1.1.16-linux-x86/fasl/ql/dists/quicklisp/software/mixalot-20131111-git/flac-grovelling" "/home/testgrid/cl-test-grid/work-dir/agent/test-runs/20141007030239-sbcl-1.1.16-linux-x86/fasl/ql/dists/quicklisp/software/mixalot-20131111-git/flac-grovelling.c" Output was: /home/testgrid/cl-test-grid/work-dir/agent/test-runs/20141007030239-sbcl-1.1.16-linux-x86/fasl/ql/dists/quicklisp/software/mixalot-20131111-git/flac-grovelling.c:6:33: fatal error: FLAC/stream_decoder.h: No such file or directory compilation terminated.
(LOAD flac FAIL) ffi-grovel, CFFI-GROVEL:GROVEL-ERROR : External process exited with code 1. Command was: "cc" "-m32" "-lFLAC" "-lm" "-I/home/testgrid/cl-test-grid/work-dir/agent/quicklisp/dists/quicklisp/software/cffi_0.14.0/" "-o" "/home/testgrid/cl-test-grid/work-dir/agent/test-runs/20141007030239-sbcl-1.1.16-linux-x86/fasl/ql/dists/quicklisp/software/mixalot-20131111-git/flac-grovelling" "/home/testgrid/cl-test-grid/work-dir/agent/test-runs/20141007030239-sbcl-1.1.16-linux-x86/fasl/ql/dists/quicklisp/software/mixalot-20131111-git/flac-grovelling.c" Output was: /home/testgrid/cl-test-grid/work-dir/agent/test-runs/20141007030239-sbcl-1.1.16-linux-x86/fasl/ql/dists/quicklisp/software/mixalot-20131111-git/flac-grovelling.c:6:33: fatal error: FLAC/stream_decoder.h: No such file or directory compilation terminated.
sbcl-1.2.3-linux-x64
(LOAD vorbisfile-ffi FAIL) ffi-grovel, CFFI-GROVEL:GROVEL-ERROR : External process exited with code 1. Command was: "cc" "-m64" "-lvorbisfile" "-I/home/hijarian/systems/cl-test-grid/work-dir/agent/quicklisp/dists/quicklisp/software/cffi_0.14.0/" "-o" "/home/hijarian/systems/cl-test-grid/work-dir/agent/test-runs/20141119133959-sbcl-1.2.3-linux-x64/fasl/ql/dists/quicklisp/software/mixalot-20131111-git/vorbisfile-grovelling" "/home/hijarian/systems/cl-test-grid/work-dir/agent/test-runs/20141119133959-sbcl-1.2.3-linux-x64/fasl/ql/dists/quicklisp/software/mixalot-20131111-git/vorbisfile-grovelling.c" Output was: /home/hijarian/systems/cl-test-grid/work-dir/agent/test-runs/20141119133959-sbcl-1.2.3-linux-x64/fasl/ql/dists/quicklisp/software/mixalot-20131111-git/vorbisfile-grovelling.c:6:31: fatal error: vorbis/vorbisfile.h: Нет такого файла или каталога #include <vorbis/vorbisfile.h> ^ compilation terminated.
(LOAD mixalot-vorbis FAIL) ffi-grovel, CFFI-GROVEL:GROVEL-ERROR : External process exited with code 1. Command was: "cc" "-m64" "-lvorbisfile" "-I/home/hijarian/systems/cl-test-grid/work-dir/agent/quicklisp/dists/quicklisp/software/cffi_0.14.0/" "-o" "/home/hijarian/systems/cl-test-grid/work-dir/agent/test-runs/20141119133959-sbcl-1.2.3-linux-x64/fasl/ql/dists/quicklisp/software/mixalot-20131111-git/vorbisfile-grovelling" "/home/hijarian/systems/cl-test-grid/work-dir/agent/test-runs/20141119133959-sbcl-1.2.3-linux-x64/fasl/ql/dists/quicklisp/software/mixalot-20131111-git/vorbisfile-grovelling.c" Output was: /home/hijarian/systems/cl-test-grid/work-dir/agent/test-runs/20141119133959-sbcl-1.2.3-linux-x64/fasl/ql/dists/quicklisp/software/mixalot-20131111-git/vorbisfile-grovelling.c:6:31: fatal error: vorbis/vorbisfile.h: Нет такого файла или каталога #include <vorbis/vorbisfile.h> ^ compilation terminated.
(LOAD mixalot-flac FAIL) ffi-grovel, CFFI-GROVEL:GROVEL-ERROR : External process exited with code 1. Command was: "cc" "-m64" "-lFLAC" "-lm" "-I/home/hijarian/systems/cl-test-grid/work-dir/agent/quicklisp/dists/quicklisp/software/cffi_0.14.0/" "-o" "/home/hijarian/systems/cl-test-grid/work-dir/agent/test-runs/20141119133959-sbcl-1.2.3-linux-x64/fasl/ql/dists/quicklisp/software/mixalot-20131111-git/flac-grovelling" "/home/hijarian/systems/cl-test-grid/work-dir/agent/test-runs/20141119133959-sbcl-1.2.3-linux-x64/fasl/ql/dists/quicklisp/software/mixalot-20131111-git/flac-grovelling.c" Output was: /home/hijarian/systems/cl-test-grid/work-dir/agent/test-runs/20141119133959-sbcl-1.2.3-linux-x64/fasl/ql/dists/quicklisp/software/mixalot-20131111-git/flac-grovelling.c:6:33: fatal error: FLAC/stream_decoder.h: Нет такого файла или каталога #include <FLAC/stream_decoder.h> ^ compilation terminated.
(LOAD flac FAIL) ffi-grovel, CFFI-GROVEL:GROVEL-ERROR : External process exited with code 1. Command was: "cc" "-m64" "-lFLAC" "-lm" "-I/home/hijarian/systems/cl-test-grid/work-dir/agent/quicklisp/dists/quicklisp/software/cffi_0.14.0/" "-o" "/home/hijarian/systems/cl-test-grid/work-dir/agent/test-runs/20141119133959-sbcl-1.2.3-linux-x64/fasl/ql/dists/quicklisp/software/mixalot-20131111-git/flac-grovelling" "/home/hijarian/systems/cl-test-grid/work-dir/agent/test-runs/20141119133959-sbcl-1.2.3-linux-x64/fasl/ql/dists/quicklisp/software/mixalot-20131111-git/flac-grovelling.c" Output was: /home/hijarian/systems/cl-test-grid/work-dir/agent/test-runs/20141119133959-sbcl-1.2.3-linux-x64/fasl/ql/dists/quicklisp/software/mixalot-20131111-git/flac-grovelling.c:6:33: fatal error: FLAC/stream_decoder.h: Нет такого файла или каталога #include <FLAC/stream_decoder.h> ^ compilation terminated.
(LOAD vorbisfile-ffi FAIL) ffi-grovel, CFFI-GROVEL:GROVEL-ERROR : External process exited with code 1. Command was: "cc" "-m64" "-lvorbisfile" "-I/home/hijarian/systems/cl-test-grid/work-dir/agent/quicklisp/dists/quicklisp/software/cffi_0.14.0/" "-o" "/home/hijarian/systems/cl-test-grid/work-dir/agent/test-runs/20141007115353-sbcl-1.2.3-linux-x64/fasl/ql/dists/quicklisp/software/mixalot-20131111-git/vorbisfile-grovelling" "/home/hijarian/systems/cl-test-grid/work-dir/agent/test-runs/20141007115353-sbcl-1.2.3-linux-x64/fasl/ql/dists/quicklisp/software/mixalot-20131111-git/vorbisfile-grovelling.c" Output was: /home/hijarian/systems/cl-test-grid/work-dir/agent/test-runs/20141007115353-sbcl-1.2.3-linux-x64/fasl/ql/dists/quicklisp/software/mixalot-20131111-git/vorbisfile-grovelling.c:6:31: fatal error: vorbis/vorbisfile.h: Нет такого файла или каталога compilation terminated.
(LOAD mixalot-vorbis FAIL) ffi-grovel, CFFI-GROVEL:GROVEL-ERROR : External process exited with code 1. Command was: "cc" "-m64" "-lvorbisfile" "-I/home/hijarian/systems/cl-test-grid/work-dir/agent/quicklisp/dists/quicklisp/software/cffi_0.14.0/" "-o" "/home/hijarian/systems/cl-test-grid/work-dir/agent/test-runs/20141007115353-sbcl-1.2.3-linux-x64/fasl/ql/dists/quicklisp/software/mixalot-20131111-git/vorbisfile-grovelling" "/home/hijarian/systems/cl-test-grid/work-dir/agent/test-runs/20141007115353-sbcl-1.2.3-linux-x64/fasl/ql/dists/quicklisp/software/mixalot-20131111-git/vorbisfile-grovelling.c" Output was: /home/hijarian/systems/cl-test-grid/work-dir/agent/test-runs/20141007115353-sbcl-1.2.3-linux-x64/fasl/ql/dists/quicklisp/software/mixalot-20131111-git/vorbisfile-grovelling.c:6:31: fatal error: vorbis/vorbisfile.h: Нет такого файла или каталога compilation terminated.
(LOAD mixalot-flac FAIL) ffi-grovel, CFFI-GROVEL:GROVEL-ERROR : External process exited with code 1. Command was: "cc" "-m64" "-lFLAC" "-lm" "-I/home/hijarian/systems/cl-test-grid/work-dir/agent/quicklisp/dists/quicklisp/software/cffi_0.14.0/" "-o" "/home/hijarian/systems/cl-test-grid/work-dir/agent/test-runs/20141007115353-sbcl-1.2.3-linux-x64/fasl/ql/dists/quicklisp/software/mixalot-20131111-git/flac-grovelling" "/home/hijarian/systems/cl-test-grid/work-dir/agent/test-runs/20141007115353-sbcl-1.2.3-linux-x64/fasl/ql/dists/quicklisp/software/mixalot-20131111-git/flac-grovelling.c" Output was: /home/hijarian/systems/cl-test-grid/work-dir/agent/test-runs/20141007115353-sbcl-1.2.3-linux-x64/fasl/ql/dists/quicklisp/software/mixalot-20131111-git/flac-grovelling.c:6:33: fatal error: FLAC/stream_decoder.h: Нет такого файла или каталога compilation terminated.
(LOAD flac FAIL) ffi-grovel, CFFI-GROVEL:GROVEL-ERROR : External process exited with code 1. Command was: "cc" "-m64" "-lFLAC" "-lm" "-I/home/hijarian/systems/cl-test-grid/work-dir/agent/quicklisp/dists/quicklisp/software/cffi_0.14.0/" "-o" "/home/hijarian/systems/cl-test-grid/work-dir/agent/test-runs/20141007115353-sbcl-1.2.3-linux-x64/fasl/ql/dists/quicklisp/software/mixalot-20131111-git/flac-grovelling" "/home/hijarian/systems/cl-test-grid/work-dir/agent/test-runs/20141007115353-sbcl-1.2.3-linux-x64/fasl/ql/dists/quicklisp/software/mixalot-20131111-git/flac-grovelling.c" Output was: /home/hijarian/systems/cl-test-grid/work-dir/agent/test-runs/20141007115353-sbcl-1.2.3-linux-x64/fasl/ql/dists/quicklisp/software/mixalot-20131111-git/flac-grovelling.c:6:33: fatal error: FLAC/stream_decoder.h: Нет такого файла или каталога compilation terminated.

Breakdown by testcases: for every failed testcase the lisp implmentations it fails on

The library does not have a testsuite adapter for CL Test Grid.

To reports overview

Generated at: 2014-12-12 04:18:02 GMT.