magicffi results collected by cl-test-grid

Results on the last two Quicklisp distributions

 quicklisp 2014-12-17quicklisp 2014-11-06
abcl-1.2.1-fasl42-linux-x86
(LOAD magicffi FAIL) ffi-grovel, CFFI-GROVEL:GROVEL-ERROR : External process exited with code 1. Command was: "cc" "-m32" "-I/home/testgrid/cl-test-grid/work-dir/agent/quicklisp/dists/quicklisp/software/cffi_0.14.0/" "-o" "/home/testgrid/cl-test-grid/work-dir/agent/test-runs/20141117131245-abcl-1.2.1-fasl42-linux-x86/fasl/ql/dists/quicklisp/software/magicffi-20120703-git/grovel" "/home/testgrid/cl-test-grid/work-dir/agent/test-runs/20141117131245-abcl-1.2.1-fasl42-linux-x86/fasl/ql/dists/quicklisp/software/magicffi-20120703-git/grovel.c" Output was: /home/testgrid/cl-test-grid/work-dir/agent/test-runs/20141117131245-abcl-1.2.1-fasl42-linux-x86/fasl/ql/dists/quicklisp/software/magicffi-20120703-git/grovel.c:6:32: fatal error: /usr/include/magic.h: No such file or directory compilation terminated.
abcl-1.2.1-fasl42-macosx-x64
(LOAD magicffi FAIL) ffi, ASDF/FIND-SYSTEM:LOAD-SYSTEM-DEFINITION-ERROR : Error while trying to load definition for system magicffi from pathname /Users/pnathan/cl-test-grid/work-dir/agent/quicklisp/dists/quicklisp/software/magicffi-20120703-git/magicffi.asd: Don't know how to REQUIRE JNA.
abcl-1.3.0-fasl42-linux-x86
(LOAD magicffi FAIL) ffi-grovel, CFFI-GROVEL:GROVEL-ERROR : External process exited with code 1. Command was: "cc" "-m32" "-I/home/testgrid/cl-test-grid/work-dir/agent/quicklisp/dists/quicklisp/software/cffi_0.14.0/" "-o" "/home/testgrid/cl-test-grid/work-dir/agent/test-runs/20141117012126-abcl-1.3.0-fasl42-linux-x86/fasl/ql/dists/quicklisp/software/magicffi-20120703-git/grovel" "/home/testgrid/cl-test-grid/work-dir/agent/test-runs/20141117012126-abcl-1.3.0-fasl42-linux-x86/fasl/ql/dists/quicklisp/software/magicffi-20120703-git/grovel.c" Output was: /home/testgrid/cl-test-grid/work-dir/agent/test-runs/20141117012126-abcl-1.3.0-fasl42-linux-x86/fasl/ql/dists/quicklisp/software/magicffi-20120703-git/grovel.c:6:32: fatal error: /usr/include/magic.h: No such file or directory compilation terminated.
abcl-1.3.1-fasl42-linux-x86
(LOAD magicffi FAIL) ffi-grovel, CFFI-GROVEL:GROVEL-ERROR : External process exited with code 1. Command was: "cc" "-m32" "-I/home/testgrid/cl-test-grid/work-dir/agent/quicklisp/dists/quicklisp/software/cffi_0.14.0/" "-o" "/home/testgrid/cl-test-grid/work-dir/agent/test-runs/20141222064341-abcl-1.3.1-fasl42-linux-x86/fasl/ql/dists/quicklisp/software/magicffi-20120703-git/grovel" "/home/testgrid/cl-test-grid/work-dir/agent/test-runs/20141222064341-abcl-1.3.1-fasl42-linux-x86/fasl/ql/dists/quicklisp/software/magicffi-20120703-git/grovel.c" Output was: /home/testgrid/cl-test-grid/work-dir/agent/test-runs/20141222064341-abcl-1.3.1-fasl42-linux-x86/fasl/ql/dists/quicklisp/software/magicffi-20120703-git/grovel.c:6:32: fatal error: /usr/include/magic.h: No such file or directory compilation terminated.
(LOAD magicffi FAIL) ffi-grovel, CFFI-GROVEL:GROVEL-ERROR : External process exited with code 1. Command was: "cc" "-m32" "-I/home/testgrid/cl-test-grid/work-dir/agent/quicklisp/dists/quicklisp/software/cffi_0.14.0/" "-o" "/home/testgrid/cl-test-grid/work-dir/agent/test-runs/20141116112208-abcl-1.3.1-fasl42-linux-x86/fasl/ql/dists/quicklisp/software/magicffi-20120703-git/grovel" "/home/testgrid/cl-test-grid/work-dir/agent/test-runs/20141116112208-abcl-1.3.1-fasl42-linux-x86/fasl/ql/dists/quicklisp/software/magicffi-20120703-git/grovel.c" Output was: /home/testgrid/cl-test-grid/work-dir/agent/test-runs/20141116112208-abcl-1.3.1-fasl42-linux-x86/fasl/ql/dists/quicklisp/software/magicffi-20120703-git/grovel.c:6:32: fatal error: /usr/include/magic.h: No such file or directory compilation terminated.
ccl-1.10-r16196-f96-linux-x64
(LOAD magicffi FAIL) ffi-grovel, CFFI-GROVEL:GROVEL-ERROR : External process exited with code 1. Command was: "cc" "-m64" "-I/home/hijarian/systems/cl-test-grid/work-dir/agent/quicklisp/dists/quicklisp/software/cffi_0.14.0/" "-o" "/home/hijarian/systems/cl-test-grid/work-dir/agent/test-runs/20141218093601-ccl-1.10-r16196-f96-linux-x64/fasl/ql/dists/quicklisp/software/magicffi-20120703-git/grovel" "/home/hijarian/systems/cl-test-grid/work-dir/agent/test-runs/20141218093601-ccl-1.10-r16196-f96-linux-x64/fasl/ql/dists/quicklisp/software/magicffi-20120703-git/grovel.c" Output was: /home/hijarian/systems/cl-test-grid/work-dir/agent/test-runs/20141218093601-ccl-1.10-r16196-f96-linux-x64/fasl/ql/dists/quicklisp/software/magicffi-20120703-git/grovel.c:6:32: fatal error: /usr/include/magic.h: Нет такого файла или каталога #include </usr/include/magic.h> ^ compilation terminated.
(LOAD magicffi FAIL) ffi-grovel, CFFI-GROVEL:GROVEL-ERROR : External process exited with code 1. Command was: "cc" "-m64" "-I/home/hijarian/systems/cl-test-grid/work-dir/agent/quicklisp/dists/quicklisp/software/cffi_0.14.0/" "-o" "/home/hijarian/systems/cl-test-grid/work-dir/agent/test-runs/20141119112401-ccl-1.10-r16196-f96-linux-x64/fasl/ql/dists/quicklisp/software/magicffi-20120703-git/grovel" "/home/hijarian/systems/cl-test-grid/work-dir/agent/test-runs/20141119112401-ccl-1.10-r16196-f96-linux-x64/fasl/ql/dists/quicklisp/software/magicffi-20120703-git/grovel.c" Output was: /home/hijarian/systems/cl-test-grid/work-dir/agent/test-runs/20141119112401-ccl-1.10-r16196-f96-linux-x64/fasl/ql/dists/quicklisp/software/magicffi-20120703-git/grovel.c:6:32: fatal error: /usr/include/magic.h: Нет такого файла или каталога #include </usr/include/magic.h> ^ compilation terminated.
ccl-1.10-r16196-f96-linux-x86
(LOAD magicffi FAIL) ffi-grovel, CFFI-GROVEL:GROVEL-ERROR : External process exited with code 1. Command was: "cc" "-m32" "-I/home/testgrid/cl-test-grid/work-dir/agent/quicklisp/dists/quicklisp/software/cffi_0.14.0/" "-o" "/home/testgrid/cl-test-grid/work-dir/agent/test-runs/20141220165914-ccl-1.10-r16196-f96-linux-x86/fasl/ql/dists/quicklisp/software/magicffi-20120703-git/grovel" "/home/testgrid/cl-test-grid/work-dir/agent/test-runs/20141220165914-ccl-1.10-r16196-f96-linux-x86/fasl/ql/dists/quicklisp/software/magicffi-20120703-git/grovel.c" Output was: /home/testgrid/cl-test-grid/work-dir/agent/test-runs/20141220165914-ccl-1.10-r16196-f96-linux-x86/fasl/ql/dists/quicklisp/software/magicffi-20120703-git/grovel.c:6:32: fatal error: /usr/include/magic.h: No such file or directory compilation terminated.
ccl-1.8-r15286m-f95-linux-x86
(LOAD magicffi FAIL) ffi-grovel, CFFI-GROVEL:GROVEL-ERROR : External process exited with code 1. Command was: "cc" "-m32" "-I/home/testgrid/cl-test-grid/work-dir/agent/quicklisp/dists/quicklisp/software/cffi_0.14.0/" "-o" "/home/testgrid/cl-test-grid/work-dir/agent/test-runs/20141221073151-ccl-1.8-r15286m-f95-linux-x86/fasl/ql/dists/quicklisp/software/magicffi-20120703-git/grovel" "/home/testgrid/cl-test-grid/work-dir/agent/test-runs/20141221073151-ccl-1.8-r15286m-f95-linux-x86/fasl/ql/dists/quicklisp/software/magicffi-20120703-git/grovel.c" Output was: /home/testgrid/cl-test-grid/work-dir/agent/test-runs/20141221073151-ccl-1.8-r15286m-f95-linux-x86/fasl/ql/dists/quicklisp/software/magicffi-20120703-git/grovel.c:6:32: fatal error: /usr/include/magic.h: No such file or directory compilation terminated.
(LOAD magicffi FAIL) ffi-grovel, CFFI-GROVEL:GROVEL-ERROR : External process exited with code 1. Command was: "cc" "-m32" "-I/home/testgrid/cl-test-grid/work-dir/agent/quicklisp/dists/quicklisp/software/cffi_0.14.0/" "-o" "/home/testgrid/cl-test-grid/work-dir/agent/test-runs/20141115164752-ccl-1.8-r15286m-f95-linux-x86/fasl/ql/dists/quicklisp/software/magicffi-20120703-git/grovel" "/home/testgrid/cl-test-grid/work-dir/agent/test-runs/20141115164752-ccl-1.8-r15286m-f95-linux-x86/fasl/ql/dists/quicklisp/software/magicffi-20120703-git/grovel.c" Output was: /home/testgrid/cl-test-grid/work-dir/agent/test-runs/20141115164752-ccl-1.8-r15286m-f95-linux-x86/fasl/ql/dists/quicklisp/software/magicffi-20120703-git/grovel.c:6:32: fatal error: /usr/include/magic.h: No such file or directory compilation terminated.
ccl-1.9-r15756-f96-linux-x86
(LOAD magicffi FAIL) ffi-grovel, CFFI-GROVEL:GROVEL-ERROR : External process exited with code 1. Command was: "cc" "-m32" "-I/home/testgrid/cl-test-grid/work-dir/agent/quicklisp/dists/quicklisp/software/cffi_0.14.0/" "-o" "/home/testgrid/cl-test-grid/work-dir/agent/test-runs/20141220132933-ccl-1.9-r15756-f96-linux-x86/fasl/ql/dists/quicklisp/software/magicffi-20120703-git/grovel" "/home/testgrid/cl-test-grid/work-dir/agent/test-runs/20141220132933-ccl-1.9-r15756-f96-linux-x86/fasl/ql/dists/quicklisp/software/magicffi-20120703-git/grovel.c" Output was: /home/testgrid/cl-test-grid/work-dir/agent/test-runs/20141220132933-ccl-1.9-r15756-f96-linux-x86/fasl/ql/dists/quicklisp/software/magicffi-20120703-git/grovel.c:6:32: fatal error: /usr/include/magic.h: No such file or directory compilation terminated.
(LOAD magicffi FAIL) ffi-grovel, CFFI-GROVEL:GROVEL-ERROR : External process exited with code 1. Command was: "cc" "-m32" "-I/home/testgrid/cl-test-grid/work-dir/agent/quicklisp/dists/quicklisp/software/cffi_0.14.0/" "-o" "/home/testgrid/cl-test-grid/work-dir/agent/test-runs/20141115074638-ccl-1.9-r15756-f96-linux-x86/fasl/ql/dists/quicklisp/software/magicffi-20120703-git/grovel" "/home/testgrid/cl-test-grid/work-dir/agent/test-runs/20141115074638-ccl-1.9-r15756-f96-linux-x86/fasl/ql/dists/quicklisp/software/magicffi-20120703-git/grovel.c" Output was: /home/testgrid/cl-test-grid/work-dir/agent/test-runs/20141115074638-ccl-1.9-r15756-f96-linux-x86/fasl/ql/dists/quicklisp/software/magicffi-20120703-git/grovel.c:6:32: fatal error: /usr/include/magic.h: No such file or directory compilation terminated.
ccl-1.9-r15758-f96-macosx-x86
(LOAD magicffi FAIL) ffi-grovel, CFFI-GROVEL:GROVEL-ERROR : External process exited with code 1. Command was: "cc" "-m32" "-I" "/opt/local/include/" "-I/Users/pnathan/cl-test-grid/work-dir/agent/quicklisp/dists/quicklisp/software/cffi_0.14.0/" "-o" "/Users/pnathan/cl-test-grid/work-dir/agent/test-runs/20141128034202-ccl-1.9-r15758-f96-macosx-x86/fasl/ql/dists/quicklisp/software/magicffi-20120703-git/grovel" "/Users/pnathan/cl-test-grid/work-dir/agent/test-runs/20141128034202-ccl-1.9-r15758-f96-macosx-x86/fasl/ql/dists/quicklisp/software/magicffi-20120703-git/grovel.c" Output was: /Users/pnathan/cl-test-grid/work-dir/agent/test-runs/20141128034202-ccl-1.9-r15758-f96-macosx-x86/fasl/ql/dists/quicklisp/software/magicffi-20120703-git/grovel.c:6:32: error: /usr/include/magic.h: No such file or directory /Users/pnathan/cl-test-grid/work-dir/agent/test-runs/20141128034202-ccl-1.9-r15758-f96-macosx-x86/fasl/ql/dists/quicklisp/software/magicffi-20120703-git/grovel.c: In function ‘main’: /Users/pnathan/cl-test-grid/work-dir/agent/test-runs/20141128034202-ccl-1.9-r15758-f96-macosx-x86/fasl/ql/dists/quicklisp/software/magicffi-20120703-git/grovel.c:412: error: ‘MAGIC_NONE’ undeclared (first use in this function) /Users/pnathan/cl-test-grid/work-dir/agent/test-runs/20141128034202-ccl-1.9-r15758-f96-macosx-x86/fasl/ql/dists/quicklisp/software/magicffi-20120703-git/grovel.c:412: error: (Each undeclared identifier is reported only once /Users/pnathan/cl-test-grid/work-dir/agent/test-runs/20141128034202-ccl-1.9-r15758-f96-macosx-x86/fasl/ql/dists/quicklisp/software/magicffi-20120703-git/grovel.c:412: error: for each function it appears in.) /Users/pnathan/cl-test-grid/work-dir/agent/test-runs/20141128034202-ccl-1.9-r15758-f96-macosx-x86/fasl/ql/dists/quicklisp/software/magicffi-20120703-git/grovel.c:417: error: ‘MAGIC_DEBUG’ undeclared (first use in this function) /Users/pnathan/cl-test-grid/work-dir/agent/test-runs/20141128034202-ccl-1.9-r15758-f96-macosx-x86/fasl/ql/dists/quicklisp/software/magicffi-20120703-git/grovel.c:422: error: ‘MAGIC_SYMLINK’ undeclared (first use in this function) /Users/pnathan/cl-test-grid/work-dir/agent/test-runs/20141128034202-ccl-1.9-r15758-f96-macosx-x86/fasl/ql/dists/quicklisp/software/magicffi-20120703-git/grovel.c:427: error: ‘MAGIC_COMPRESS’ undeclared (first use in this function) /Users/pnathan/cl-test-grid/work-dir/agent/test-runs/20141128034202-ccl-1.9-r15758-f96-macosx-x86/fasl/ql/dists/quicklisp/software/magicffi-20120703-git/grovel.c:432: error: ‘MAGIC_DEVICES’ undeclared (first use in this function) /Users/pnathan/cl-test-grid/work-dir/agent/test-runs/20141128034202-ccl-1.9-r15758-f96-macosx-x86/fasl/ql/dists/quicklisp/software/magicffi-20120703-git/grovel.c:437: error: ‘MAGIC_MIME_TYPE’ undeclared (first use in this function) /Users/pnathan/cl-test-grid/work-dir/agent/test-runs/20141128034202-ccl-1.9-r15758-f96-macosx-x86/fasl/ql/dists/quicklisp/software/magicffi-20120703-git/grovel.c:442: error: ‘MAGIC_CONTINUE’ undeclared (first use in this function) /Users/pnathan/cl-test-grid/work-dir/agent/test-runs/20141128034202-ccl-1.9-r15758-f96-macosx-x86/fasl/ql/dists/quicklisp/software/magicffi-20120703-git/grovel.c:447: error: ‘MAGIC_CHECK’ undeclared (first use in this function) /Users/pnathan/cl-test-grid/work-dir/agent/test-runs/20141128034202-ccl-1.9-r15758-f96-macosx-x86/fasl/ql/dists/quicklisp/software/magicffi-20120703-git/grovel.c:452: error: ‘MAGIC_PRESERVE_ATIME’ undeclared (first use in this function) /Users/pnathan/cl-test-grid/work-dir/agent/test-runs/20141128034202-ccl-1.9-r15758-f96-macosx-x86/fasl/ql/dists/quicklisp/software/magicffi-20120703-git/grovel.c:457: error: ‘MAGIC_RAW’ undeclared (first use in this function) /Users/pnathan/cl-test-grid/work-dir/agent/test-runs/20141128034202-ccl-1.9-r15758-f96-macosx-x86/fasl/ql/dists/quicklisp/software/magicffi-20120703-git/grovel.c:462: error: ‘MAGIC_ERROR’ undeclared (first use in this function) /Users/pnathan/cl-test-grid/work-dir/agent/test-runs/20141128034202-ccl-1.9-r15758-f96-macosx-x86/fasl/ql/dists/quicklisp/software/magicffi-20120703-git/grovel.c:467: error: ‘MAGIC_MIME_ENCODING’ undeclared (first use in this function) /Users/pnathan/cl-test-grid/work-dir/agent/test-runs/20141128034202-ccl-1.9-r15758-f96-macosx-x86/fasl/ql/dists/quicklisp/software/magicffi-20120703-git/grovel.c:472: error: ‘MAGIC_MIME’ undeclared (first use in this function) /Users/pnathan/cl-test-grid/work-dir/agent/test-runs/20141128034202-ccl-1.9-r15758-f96-macosx-x86/fasl/ql/dists/quicklisp/software/magicffi-20120703-git/grovel.c:477: error: ‘MAGIC_APPLE’ undeclared (first use in this function) /Users/pnathan/cl-test-grid/work-dir/agent/test-runs/20141128034202-ccl-1.9-r15758-f96-macosx-x86/fasl/ql/dists/quicklisp/software/magicffi-20120703-git/grovel.c:482: error: ‘MAGIC_NO_CHECK_COMPRESS’ undeclared (first use in this function) /Users/pnathan/cl-test-grid/work-dir/agent/test-runs/20141128034202-ccl-1.9-r15758-f96-macosx-x86/fasl/ql/dists/quicklisp/software/magicffi-20120703-git/grovel.c:487: error: ‘MAGIC_NO_CHECK_TAR’ undeclared (first use in this function) /Users/pnathan/cl-test-grid/work-dir/agent/test-runs/20141128034202-ccl-1.9-r15758-f96-macosx-x86/fasl/ql/dists/quicklisp/software/magicffi-20120703-git/grovel.c:492: error: ‘MAGIC_NO_CHECK_SOFT’ undeclared (first use in this function) /Users/pnathan/cl-test-grid/work-dir/agent/test-runs/20141128034202-ccl-1.9-r15758-f96-macosx-x86/fasl/ql/dists/quicklisp/software/magicffi-20120703-git/grovel.c:497: error: ‘MAGIC_NO_CHECK_APPTYPE’ undeclared (first use in this function) /Users/pnathan/cl-test-grid/work-dir/agent/test-runs/20141128034202-ccl-1.9-r15758-f96-macosx-x86/fasl/ql/dists/quicklisp/software/magicffi-20120703-git/grovel.c:502: error: ‘MAGIC_NO_CHECK_ELF’ undeclared (first use in this function) /Users/pnathan/cl-test-grid/work-dir/agent/test-runs/20141128034202-ccl-1.9-r15758-f96-macosx-x86/fasl/ql/dists/quicklisp/software/magicffi-20120703-git/grovel.c:507: error: ‘MAGIC_NO_CHECK_TEXT’ undeclared (first use in this function) /Users/pnathan/cl-test-grid/work-dir/agent/test-runs/20141128034202-ccl-1.9-r15758-f96-macosx-x86/fasl/ql/dists/quicklisp/software/magicffi-20120703-git/grovel.c:512: error: ‘MAGIC_NO_CHECK_CDF’ undeclared (first use in this function) /Users/pnathan/cl-test-grid/work-dir/agent/test-runs/20141128034202-ccl-1.9-r15758-f96-macosx-x86/fasl/ql/dists/quicklisp/software/magicffi-20120703-git/grovel.c:517: error: ‘MAGIC_NO_CHECK_TOKENS’ undeclared (first use in this function) /Users/pnathan/cl-test-grid/work-dir/agent/test-runs/20141128034202-ccl-1.9-r15758-f96-macosx-x86/fasl/ql/dists/quicklisp/software/magicffi-20120703-git/grovel.c:522: error: ‘MAGIC_NO_CHECK_ENCODING’ undeclared (first use in this function) /Users/pnathan/cl-test-grid/work-dir/agent/test-runs/20141128034202-ccl-1.9-r15758-f96-macosx-x86/fasl/ql/dists/quicklisp/software/magicffi-20120703-git/grovel.c:527: error: ‘MAGIC_NO_CHECK_ASCII’ undeclared (first use in this function) /Users/pnathan/cl-test-grid/work-dir/agent/test-runs/20141128034202-ccl-1.9-r15758-f96-macosx-x86/fasl/ql/dists/quicklisp/software/magicffi-20120703-git/grovel.c:532: error: ‘MAGIC_NO_CHECK_FORTRAN’ undeclared (first use in this function) /Users/pnathan/cl-test-grid/work-dir/agent/test-runs/20141128034202-ccl-1.9-r15758-f96-macosx-x86/fasl/ql/dists/quicklisp/software/magicffi-20120703-git/grovel.c:537: error: ‘MAGIC_NO_CHECK_TROFF’ undeclared (first use in this function)
clisp-2.49-unix-i386
(LOAD magicffi FAIL) ffi, ASDF:LOAD-SYSTEM-DEFINITION-ERROR : Error while trying to load definition for system magicffi from pathname /Users/pnathan/cl-test-grid/work-dir/agent/quicklisp/dists/quicklisp/software/magicffi-20120703-git/magicffi.asd: CFFI requires CLISP compiled with dynamic FFI support.
clisp-2.49-unix-x64
(LOAD magicffi FAIL) ffi-grovel, CFFI-GROVEL:GROVEL-ERROR : External process exited with code 1. Command was: "cc" "-m64" "-I/home/hijarian/systems/cl-test-grid/work-dir/agent/quicklisp/dists/quicklisp/software/cffi_0.14.0/" "-o" "/home/hijarian/systems/cl-test-grid/work-dir/agent/test-runs/20141218073936-clisp-2.49-unix-x64/fasl/ql/dists/quicklisp/software/magicffi-20120703-git/grovel" "/home/hijarian/systems/cl-test-grid/work-dir/agent/test-runs/20141218073936-clisp-2.49-unix-x64/fasl/ql/dists/quicklisp/software/magicffi-20120703-git/grovel.c" Output was: <see above>
(LOAD magicffi FAIL) ffi-grovel, CFFI-GROVEL:GROVEL-ERROR : External process exited with code 1. Command was: "cc" "-m64" "-I/home/hijarian/systems/cl-test-grid/work-dir/agent/quicklisp/dists/quicklisp/software/cffi_0.14.0/" "-o" "/home/hijarian/systems/cl-test-grid/work-dir/agent/test-runs/20141119082304-clisp-2.49-unix-x64/fasl/ql/dists/quicklisp/software/magicffi-20120703-git/grovel" "/home/hijarian/systems/cl-test-grid/work-dir/agent/test-runs/20141119082304-clisp-2.49-unix-x64/fasl/ql/dists/quicklisp/software/magicffi-20120703-git/grovel.c" Output was: <see above>
clisp-2.49-unix-x86
(LOAD magicffi FAIL) ffi-grovel, CFFI-GROVEL:GROVEL-ERROR : External process exited with code 1. Command was: "cc" "-m32" "-I/home/testgrid/cl-test-grid/work-dir/agent/quicklisp/dists/quicklisp/software/cffi_0.14.0/" "-o" "/home/testgrid/cl-test-grid/work-dir/agent/test-runs/20141221222621-clisp-2.49-unix-x86/fasl/ql/dists/quicklisp/software/magicffi-20120703-git/grovel" "/home/testgrid/cl-test-grid/work-dir/agent/test-runs/20141221222621-clisp-2.49-unix-x86/fasl/ql/dists/quicklisp/software/magicffi-20120703-git/grovel.c" Output was: <see above>
(LOAD magicffi FAIL) ffi-grovel, CFFI-GROVEL:GROVEL-ERROR : External process exited with code 1. Command was: "cc" "-m32" "-I/home/testgrid/cl-test-grid/work-dir/agent/quicklisp/dists/quicklisp/software/cffi_0.14.0/" "-o" "/home/testgrid/cl-test-grid/work-dir/agent/test-runs/20141116021855-clisp-2.49-unix-x86/fasl/ql/dists/quicklisp/software/magicffi-20120703-git/grovel" "/home/testgrid/cl-test-grid/work-dir/agent/test-runs/20141116021855-clisp-2.49-unix-x86/fasl/ql/dists/quicklisp/software/magicffi-20120703-git/grovel.c" Output was: <see above>
cmu-snapshot-2013-04__20d_unicode_-linux-x86
(LOAD magicffi FAIL) ffi-grovel, CFFI-GROVEL:GROVEL-ERROR : Error in function CFFI-GROVEL:GROVEL-ERROR: External process exited with code 1. Command was: "cc" "-m32" "-I/home/testgrid/cl-test-grid/work-dir/agent/quicklisp/dists/quicklisp/software/cffi_0.14.0/" "-o" "/home/testgrid/cl-test-grid/work-dir/agent/test-runs/20141221120518-cmu-snapshot-2013-04__20d_unicode_-linux-x86/fasl/ql/dists/quicklisp/software/magicffi-20120703-git/grovel" "/home/testgrid/cl-test-grid/work-dir/agent/test-runs/20141221120518-cmu-snapshot-2013-04__20d_unicode_-linux-x86/fasl/ql/dists/quicklisp/software/magicffi-20120703-git/grovel.c" Output was: /home/testgrid/cl-test-grid/work-dir/agent/test-runs/20141221120518-cmu-snapshot-2013-04__20d_unicode_-linux-x86/fasl/ql/dists/quicklisp/software/magicffi-20120703-git/grovel.c:6:32: fatal error: /usr/include/magic.h: No such file or directory compilation terminated.
(LOAD magicffi FAIL) ffi-grovel, CFFI-GROVEL:GROVEL-ERROR : Error in function CFFI-GROVEL:GROVEL-ERROR: External process exited with code 1. Command was: "cc" "-m32" "-I/home/testgrid/cl-test-grid/work-dir/agent/quicklisp/dists/quicklisp/software/cffi_0.14.0/" "-o" "/home/testgrid/cl-test-grid/work-dir/agent/test-runs/20141115185927-cmu-snapshot-2013-04__20d_unicode_-linux-x86/fasl/ql/dists/quicklisp/software/magicffi-20120703-git/grovel" "/home/testgrid/cl-test-grid/work-dir/agent/test-runs/20141115185927-cmu-snapshot-2013-04__20d_unicode_-linux-x86/fasl/ql/dists/quicklisp/software/magicffi-20120703-git/grovel.c" Output was: /home/testgrid/cl-test-grid/work-dir/agent/test-runs/20141115185927-cmu-snapshot-2013-04__20d_unicode_-linux-x86/fasl/ql/dists/quicklisp/software/magicffi-20120703-git/grovel.c:6:32: fatal error: /usr/include/magic.h: No such file or directory compilation terminated.
cmu-snapshot-2014-01__20e_unicode_-linux-x86
(LOAD magicffi FAIL) ffi-grovel, CFFI-GROVEL:GROVEL-ERROR : Error in function CFFI-GROVEL:GROVEL-ERROR: External process exited with code 1. Command was: "cc" "-m32" "-I/home/testgrid/cl-test-grid/work-dir/agent/quicklisp/dists/quicklisp/software/cffi_0.14.0/" "-o" "/home/testgrid/cl-test-grid/work-dir/agent/test-runs/20141221145826-cmu-snapshot-2014-01__20e_unicode_-linux-x86/fasl/ql/dists/quicklisp/software/magicffi-20120703-git/grovel" "/home/testgrid/cl-test-grid/work-dir/agent/test-runs/20141221145826-cmu-snapshot-2014-01__20e_unicode_-linux-x86/fasl/ql/dists/quicklisp/software/magicffi-20120703-git/grovel.c" Output was: /home/testgrid/cl-test-grid/work-dir/agent/test-runs/20141221145826-cmu-snapshot-2014-01__20e_unicode_-linux-x86/fasl/ql/dists/quicklisp/software/magicffi-20120703-git/grovel.c:6:32: fatal error: /usr/include/magic.h: No such file or directory compilation terminated.
(LOAD magicffi FAIL) ffi-grovel, CFFI-GROVEL:GROVEL-ERROR : Error in function CFFI-GROVEL:GROVEL-ERROR: External process exited with code 1. Command was: "cc" "-m32" "-I/home/testgrid/cl-test-grid/work-dir/agent/quicklisp/dists/quicklisp/software/cffi_0.14.0/" "-o" "/home/testgrid/cl-test-grid/work-dir/agent/test-runs/20141115212908-cmu-snapshot-2014-01__20e_unicode_-linux-x86/fasl/ql/dists/quicklisp/software/magicffi-20120703-git/grovel" "/home/testgrid/cl-test-grid/work-dir/agent/test-runs/20141115212908-cmu-snapshot-2014-01__20e_unicode_-linux-x86/fasl/ql/dists/quicklisp/software/magicffi-20120703-git/grovel.c" Output was: /home/testgrid/cl-test-grid/work-dir/agent/test-runs/20141115212908-cmu-snapshot-2014-01__20e_unicode_-linux-x86/fasl/ql/dists/quicklisp/software/magicffi-20120703-git/grovel.c:6:32: fatal error: /usr/include/magic.h: No such file or directory compilation terminated.
cmu-snapshot-2014-05-dirty__20e_unicode_-linux-x86
(LOAD magicffi FAIL) ffi-grovel, CFFI-GROVEL:GROVEL-ERROR : Error in function CFFI-GROVEL:GROVEL-ERROR: External process exited with code 1. Command was: "cc" "-m32" "-I/home/testgrid/cl-test-grid/work-dir/agent/quicklisp/dists/quicklisp/software/cffi_0.14.0/" "-o" "/home/testgrid/cl-test-grid/work-dir/agent/test-runs/20141221173050-cmu-snapshot-2014-05-dirty__20e_unicode_-linux-x86/fasl/ql/dists/quicklisp/software/magicffi-20120703-git/grovel" "/home/testgrid/cl-test-grid/work-dir/agent/test-runs/20141221173050-cmu-snapshot-2014-05-dirty__20e_unicode_-linux-x86/fasl/ql/dists/quicklisp/software/magicffi-20120703-git/grovel.c" Output was: /home/testgrid/cl-test-grid/work-dir/agent/test-runs/20141221173050-cmu-snapshot-2014-05-dirty__20e_unicode_-linux-x86/fasl/ql/dists/quicklisp/software/magicffi-20120703-git/grovel.c:6:32: fatal error: /usr/include/magic.h: No such file or directory compilation terminated.
(LOAD magicffi FAIL) ffi-grovel, CFFI-GROVEL:GROVEL-ERROR : Error in function CFFI-GROVEL:GROVEL-ERROR: External process exited with code 1. Command was: "cc" "-m32" "-I/home/testgrid/cl-test-grid/work-dir/agent/quicklisp/dists/quicklisp/software/cffi_0.14.0/" "-o" "/home/testgrid/cl-test-grid/work-dir/agent/test-runs/20141115235548-cmu-snapshot-2014-05-dirty__20e_unicode_-linux-x86/fasl/ql/dists/quicklisp/software/magicffi-20120703-git/grovel" "/home/testgrid/cl-test-grid/work-dir/agent/test-runs/20141115235548-cmu-snapshot-2014-05-dirty__20e_unicode_-linux-x86/fasl/ql/dists/quicklisp/software/magicffi-20120703-git/grovel.c" Output was: /home/testgrid/cl-test-grid/work-dir/agent/test-runs/20141115235548-cmu-snapshot-2014-05-dirty__20e_unicode_-linux-x86/fasl/ql/dists/quicklisp/software/magicffi-20120703-git/grovel.c:6:32: fatal error: /usr/include/magic.h: No such file or directory compilation terminated.
cmu-snapshot-2014-12___20f_unicode_-linux-x86
(LOAD magicffi FAIL) ffi-grovel, CFFI-GROVEL:GROVEL-ERROR : Error in function CFFI-GROVEL:GROVEL-ERROR: External process exited with code 1. Command was: "cc" "-m32" "-I/home/testgrid/cl-test-grid/work-dir/agent/quicklisp/dists/quicklisp/software/cffi_0.14.0/" "-o" "/home/testgrid/cl-test-grid/work-dir/agent/test-runs/20141221200151-cmu-snapshot-2014-12___20f_unicode_-linux-x86/fasl/ql/dists/quicklisp/software/magicffi-20120703-git/grovel" "/home/testgrid/cl-test-grid/work-dir/agent/test-runs/20141221200151-cmu-snapshot-2014-12___20f_unicode_-linux-x86/fasl/ql/dists/quicklisp/software/magicffi-20120703-git/grovel.c" Output was: /home/testgrid/cl-test-grid/work-dir/agent/test-runs/20141221200151-cmu-snapshot-2014-12___20f_unicode_-linux-x86/fasl/ql/dists/quicklisp/software/magicffi-20120703-git/grovel.c:6:32: fatal error: /usr/include/magic.h: No such file or directory compilation terminated.
ecl-13.5.1-76a84246-linux-x64-bytecode
(LOAD magicffi FAIL) ASDF/FIND-SYSTEM:LOAD-SYSTEM-DEFINITION-ERROR : Error while trying to load definition for system magicffi from pathname /home/hijarian/systems/cl-test-grid/work-dir/agent/quicklisp/dists/quicklisp/software/magicffi-20120703-git/magicffi.asd: The variable C::*CC-FLAGS* is unbound.
(LOAD magicffi FAIL) ASDF/FIND-SYSTEM:LOAD-SYSTEM-DEFINITION-ERROR : Error while trying to load definition for system magicffi from pathname /home/hijarian/systems/cl-test-grid/work-dir/agent/quicklisp/dists/quicklisp/software/magicffi-20120703-git/magicffi.asd: The variable C::*CC-FLAGS* is unbound.
ecl-13.5.1-76a84246-linux-x64-lisp-to-c
(LOAD magicffi FAIL) ffi-grovel, CFFI-GROVEL:GROVEL-ERROR : External process exited with code 1. Command was: "cc" "-m64" " -D_GNU_SOURCE -D_FILE_OFFSET_BITS=64 -g -O2 -fPIC -D_THREAD_SAFE -Dlinux" "-I/home/hijarian/systems/cl-test-grid/work-dir/agent/quicklisp/dists/quicklisp/software/cffi_0.14.0/" "-o" "/home/hijarian/systems/cl-test-grid/work-dir/agent/test-runs/20141218135157-ecl-13.5.1-76a84246-linux-x64-lisp-to-c/fasl/ql/dists/quicklisp/software/magicffi-20120703-git/grovel" "/home/hijarian/systems/cl-test-grid/work-dir/agent/test-runs/20141218135157-ecl-13.5.1-76a84246-linux-x64-lisp-to-c/fasl/ql/dists/quicklisp/software/magicffi-20120703-git/grovel.c" Output was: <see above>
(LOAD magicffi FAIL) ffi-grovel, CFFI-GROVEL:GROVEL-ERROR : External process exited with code 1. Command was: "cc" "-m64" " -D_GNU_SOURCE -D_FILE_OFFSET_BITS=64 -g -O2 -fPIC -D_THREAD_SAFE -Dlinux" "-I/home/hijarian/systems/cl-test-grid/work-dir/agent/quicklisp/dists/quicklisp/software/cffi_0.14.0/" "-o" "/home/hijarian/systems/cl-test-grid/work-dir/agent/test-runs/20141119155044-ecl-13.5.1-76a84246-linux-x64-lisp-to-c/fasl/ql/dists/quicklisp/software/magicffi-20120703-git/grovel" "/home/hijarian/systems/cl-test-grid/work-dir/agent/test-runs/20141119155044-ecl-13.5.1-76a84246-linux-x64-lisp-to-c/fasl/ql/dists/quicklisp/software/magicffi-20120703-git/grovel.c" Output was: <see above>
ecl-13.5.1-unknown-linux-i686-bytecode
(LOAD magicffi FAIL) ASDF/FIND-SYSTEM:LOAD-SYSTEM-DEFINITION-ERROR : Error while trying to load definition for system magicffi from pathname /home/testgrid/cl-test-grid/work-dir/agent/quicklisp/dists/quicklisp/software/magicffi-20120703-git/magicffi.asd: The variable C::*CC-FLAGS* is unbound.
(LOAD magicffi FAIL) ASDF/FIND-SYSTEM:LOAD-SYSTEM-DEFINITION-ERROR : Error while trying to load definition for system magicffi from pathname /home/testgrid/cl-test-grid/work-dir/agent/quicklisp/dists/quicklisp/software/magicffi-20120703-git/magicffi.asd: The variable C::*CC-FLAGS* is unbound.
ecl-13.5.1-unknown-linux-i686-lisp-to-c
(LOAD magicffi FAIL) ffi-grovel, CFFI-GROVEL:GROVEL-ERROR : External process exited with code 1. Command was: "cc" "-m32" " -D_GNU_SOURCE -D_FILE_OFFSET_BITS=64 -g -O2 -fPIC -D_GNU_SOURCE -D_FILE_OFFSET_BITS=64 -g -O2 -fPIC -D_THREAD_SAFE -Dlinux" "-I/home/testgrid/cl-test-grid/work-dir/agent/quicklisp/dists/quicklisp/software/cffi_0.14.0/" "-o" "/home/testgrid/cl-test-grid/work-dir/agent/test-runs/20141222033526-ecl-13.5.1-unknown-linux-i686-lisp-to-c/fasl/ql/dists/quicklisp/software/magicffi-20120703-git/grovel" "/home/testgrid/cl-test-grid/work-dir/agent/test-runs/20141222033526-ecl-13.5.1-unknown-linux-i686-lisp-to-c/fasl/ql/dists/quicklisp/software/magicffi-20120703-git/grovel.c" Output was: <see above>
(LOAD magicffi FAIL) ffi-grovel, CFFI-GROVEL:GROVEL-ERROR : External process exited with code 1. Command was: "cc" "-m32" " -D_GNU_SOURCE -D_FILE_OFFSET_BITS=64 -g -O2 -fPIC -D_GNU_SOURCE -D_FILE_OFFSET_BITS=64 -g -O2 -fPIC -D_THREAD_SAFE -Dlinux" "-I/home/testgrid/cl-test-grid/work-dir/agent/quicklisp/dists/quicklisp/software/cffi_0.14.0/" "-o" "/home/testgrid/cl-test-grid/work-dir/agent/test-runs/20141116081731-ecl-13.5.1-unknown-linux-i686-lisp-to-c/fasl/ql/dists/quicklisp/software/magicffi-20120703-git/grovel" "/home/testgrid/cl-test-grid/work-dir/agent/test-runs/20141116081731-ecl-13.5.1-unknown-linux-i686-lisp-to-c/fasl/ql/dists/quicklisp/software/magicffi-20120703-git/grovel.c" Output was: <see above>
sbcl-1.0.58-linux-x86
(LOAD magicffi FAIL) ffi-grovel, CFFI-GROVEL:GROVEL-ERROR : External process exited with code 1. Command was: "cc" "-m32" "-I/home/testgrid/cl-test-grid/work-dir/agent/quicklisp/dists/quicklisp/software/cffi_0.14.0/" "-o" "/home/testgrid/cl-test-grid/work-dir/agent/test-runs/20141221044048-sbcl-1.0.58-linux-x86/fasl/ql/dists/quicklisp/software/magicffi-20120703-git/grovel" "/home/testgrid/cl-test-grid/work-dir/agent/test-runs/20141221044048-sbcl-1.0.58-linux-x86/fasl/ql/dists/quicklisp/software/magicffi-20120703-git/grovel.c" Output was: /home/testgrid/cl-test-grid/work-dir/agent/test-runs/20141221044048-sbcl-1.0.58-linux-x86/fasl/ql/dists/quicklisp/software/magicffi-20120703-git/grovel.c:6:32: fatal error: /usr/include/magic.h: No such file or directory compilation terminated.
(LOAD magicffi FAIL) ffi-grovel, CFFI-GROVEL:GROVEL-ERROR : External process exited with code 1. Command was: "cc" "-m32" "-I/home/testgrid/cl-test-grid/work-dir/agent/quicklisp/dists/quicklisp/software/cffi_0.14.0/" "-o" "/home/testgrid/cl-test-grid/work-dir/agent/test-runs/20141115150426-sbcl-1.0.58-linux-x86/fasl/ql/dists/quicklisp/software/magicffi-20120703-git/grovel" "/home/testgrid/cl-test-grid/work-dir/agent/test-runs/20141115150426-sbcl-1.0.58-linux-x86/fasl/ql/dists/quicklisp/software/magicffi-20120703-git/grovel.c" Output was: /home/testgrid/cl-test-grid/work-dir/agent/test-runs/20141115150426-sbcl-1.0.58-linux-x86/fasl/ql/dists/quicklisp/software/magicffi-20120703-git/grovel.c:6:32: fatal error: /usr/include/magic.h: No such file or directory compilation terminated.
sbcl-1.1.11-linux-x86
(LOAD magicffi FAIL) ffi-grovel, CFFI-GROVEL:GROVEL-ERROR : External process exited with code 1. Command was: "cc" "-m32" "-I/home/testgrid/cl-test-grid/work-dir/agent/quicklisp/dists/quicklisp/software/cffi_0.14.0/" "-o" "/home/testgrid/cl-test-grid/work-dir/agent/test-runs/20141221012939-sbcl-1.1.11-linux-x86/fasl/ql/dists/quicklisp/software/magicffi-20120703-git/grovel" "/home/testgrid/cl-test-grid/work-dir/agent/test-runs/20141221012939-sbcl-1.1.11-linux-x86/fasl/ql/dists/quicklisp/software/magicffi-20120703-git/grovel.c" Output was: /home/testgrid/cl-test-grid/work-dir/agent/test-runs/20141221012939-sbcl-1.1.11-linux-x86/fasl/ql/dists/quicklisp/software/magicffi-20120703-git/grovel.c:6:32: fatal error: /usr/include/magic.h: No such file or directory compilation terminated.
(LOAD magicffi FAIL) ffi-grovel, CFFI-GROVEL:GROVEL-ERROR : External process exited with code 1. Command was: "cc" "-m32" "-I/home/testgrid/cl-test-grid/work-dir/agent/quicklisp/dists/quicklisp/software/cffi_0.14.0/" "-o" "/home/testgrid/cl-test-grid/work-dir/agent/test-runs/20141115131427-sbcl-1.1.11-linux-x86/fasl/ql/dists/quicklisp/software/magicffi-20120703-git/grovel" "/home/testgrid/cl-test-grid/work-dir/agent/test-runs/20141115131427-sbcl-1.1.11-linux-x86/fasl/ql/dists/quicklisp/software/magicffi-20120703-git/grovel.c" Output was: /home/testgrid/cl-test-grid/work-dir/agent/test-runs/20141115131427-sbcl-1.1.11-linux-x86/fasl/ql/dists/quicklisp/software/magicffi-20120703-git/grovel.c:6:32: fatal error: /usr/include/magic.h: No such file or directory compilation terminated.
sbcl-1.1.16-linux-x86
(LOAD magicffi FAIL) ffi-grovel, CFFI-GROVEL:GROVEL-ERROR : External process exited with code 1. Command was: "cc" "-m32" "-I/home/testgrid/cl-test-grid/work-dir/agent/quicklisp/dists/quicklisp/software/cffi_0.14.0/" "-o" "/home/testgrid/cl-test-grid/work-dir/agent/test-runs/20141220221806-sbcl-1.1.16-linux-x86/fasl/ql/dists/quicklisp/software/magicffi-20120703-git/grovel" "/home/testgrid/cl-test-grid/work-dir/agent/test-runs/20141220221806-sbcl-1.1.16-linux-x86/fasl/ql/dists/quicklisp/software/magicffi-20120703-git/grovel.c" Output was: /home/testgrid/cl-test-grid/work-dir/agent/test-runs/20141220221806-sbcl-1.1.16-linux-x86/fasl/ql/dists/quicklisp/software/magicffi-20120703-git/grovel.c:6:32: fatal error: /usr/include/magic.h: No such file or directory compilation terminated.
(LOAD magicffi FAIL) ffi-grovel, CFFI-GROVEL:GROVEL-ERROR : External process exited with code 1. Command was: "cc" "-m32" "-I/home/testgrid/cl-test-grid/work-dir/agent/quicklisp/dists/quicklisp/software/cffi_0.14.0/" "-o" "/home/testgrid/cl-test-grid/work-dir/agent/test-runs/20141115055137-sbcl-1.1.16-linux-x86/fasl/ql/dists/quicklisp/software/magicffi-20120703-git/grovel" "/home/testgrid/cl-test-grid/work-dir/agent/test-runs/20141115055137-sbcl-1.1.16-linux-x86/fasl/ql/dists/quicklisp/software/magicffi-20120703-git/grovel.c" Output was: /home/testgrid/cl-test-grid/work-dir/agent/test-runs/20141115055137-sbcl-1.1.16-linux-x86/fasl/ql/dists/quicklisp/software/magicffi-20120703-git/grovel.c:6:32: fatal error: /usr/include/magic.h: No such file or directory compilation terminated.
sbcl-1.2.3-linux-x64
(LOAD magicffi FAIL) ffi-grovel, CFFI-GROVEL:GROVEL-ERROR : External process exited with code 1. Command was: "cc" "-m64" "-I/home/hijarian/systems/cl-test-grid/work-dir/agent/quicklisp/dists/quicklisp/software/cffi_0.14.0/" "-o" "/home/hijarian/systems/cl-test-grid/work-dir/agent/test-runs/20141218115532-sbcl-1.2.3-linux-x64/fasl/ql/dists/quicklisp/software/magicffi-20120703-git/grovel" "/home/hijarian/systems/cl-test-grid/work-dir/agent/test-runs/20141218115532-sbcl-1.2.3-linux-x64/fasl/ql/dists/quicklisp/software/magicffi-20120703-git/grovel.c" Output was: /home/hijarian/systems/cl-test-grid/work-dir/agent/test-runs/20141218115532-sbcl-1.2.3-linux-x64/fasl/ql/dists/quicklisp/software/magicffi-20120703-git/grovel.c:6:32: fatal error: /usr/include/magic.h: Нет такого файла или каталога #include </usr/include/magic.h> ^ compilation terminated.
(LOAD magicffi FAIL) ffi-grovel, CFFI-GROVEL:GROVEL-ERROR : External process exited with code 1. Command was: "cc" "-m64" "-I/home/hijarian/systems/cl-test-grid/work-dir/agent/quicklisp/dists/quicklisp/software/cffi_0.14.0/" "-o" "/home/hijarian/systems/cl-test-grid/work-dir/agent/test-runs/20141119133959-sbcl-1.2.3-linux-x64/fasl/ql/dists/quicklisp/software/magicffi-20120703-git/grovel" "/home/hijarian/systems/cl-test-grid/work-dir/agent/test-runs/20141119133959-sbcl-1.2.3-linux-x64/fasl/ql/dists/quicklisp/software/magicffi-20120703-git/grovel.c" Output was: /home/hijarian/systems/cl-test-grid/work-dir/agent/test-runs/20141119133959-sbcl-1.2.3-linux-x64/fasl/ql/dists/quicklisp/software/magicffi-20120703-git/grovel.c:6:32: fatal error: /usr/include/magic.h: Нет такого файла или каталога #include </usr/include/magic.h> ^ compilation terminated.
sbcl-1.2.6-linux-x86
(LOAD magicffi FAIL) ffi-grovel, CFFI-GROVEL:GROVEL-ERROR : External process exited with code 1. Command was: "cc" "-m32" "-I/home/testgrid/cl-test-grid/work-dir/agent/quicklisp/dists/quicklisp/software/cffi_0.14.0/" "-o" "/home/testgrid/cl-test-grid/work-dir/agent/test-runs/20141220114217-sbcl-1.2.6-linux-x86/fasl/ql/dists/quicklisp/software/magicffi-20120703-git/grovel" "/home/testgrid/cl-test-grid/work-dir/agent/test-runs/20141220114217-sbcl-1.2.6-linux-x86/fasl/ql/dists/quicklisp/software/magicffi-20120703-git/grovel.c" Output was: /home/testgrid/cl-test-grid/work-dir/agent/test-runs/20141220114217-sbcl-1.2.6-linux-x86/fasl/ql/dists/quicklisp/software/magicffi-20120703-git/grovel.c:6:32: fatal error: /usr/include/magic.h: No such file or directory compilation terminated.

Breakdown by testcases: for every failed testcase the lisp implmentations it fails on

The library does not have a testsuite adapter for CL Test Grid.

To reports overview

Generated at: 2014-12-22 21:28:13 GMT.