m2cl results collected by cl-test-grid

Results on the last two Quicklisp distributions

 quicklisp 2014-11-06quicklisp 2014-10-06
abcl-1.2.1-fasl42-linux-x86
(LOAD m2cl-test FAIL) ffi-grovel, CFFI-GROVEL:GROVEL-ERROR : External process exited with code 1. Command was: "cc" "-m32" "-I/home/testgrid/cl-test-grid/work-dir/agent/quicklisp/dists/quicklisp/software/cffi_0.14.0/" "-o" "/home/testgrid/cl-test-grid/work-dir/agent/test-runs/20141117131245-abcl-1.2.1-fasl42-linux-x86/fasl/ql/dists/quicklisp/software/lisp-zmq-1.5.0/src/grovel" "/home/testgrid/cl-test-grid/work-dir/agent/test-runs/20141117131245-abcl-1.2.1-fasl42-linux-x86/fasl/ql/dists/quicklisp/software/lisp-zmq-1.5.0/src/grovel.c" Output was: /home/testgrid/cl-test-grid/work-dir/agent/test-runs/20141117131245-abcl-1.2.1-fasl42-linux-x86/fasl/ql/dists/quicklisp/software/lisp-zmq-1.5.0/src/grovel.c:6:17: fatal error: zmq.h: No such file or directory compilation terminated.
(LOAD m2cl-examples FAIL) ffi-grovel, CFFI-GROVEL:GROVEL-ERROR : External process exited with code 1. Command was: "cc" "-m32" "-I/home/testgrid/cl-test-grid/work-dir/agent/quicklisp/dists/quicklisp/software/cffi_0.14.0/" "-o" "/home/testgrid/cl-test-grid/work-dir/agent/test-runs/20141117131245-abcl-1.2.1-fasl42-linux-x86/fasl/ql/dists/quicklisp/software/lisp-zmq-1.5.0/src/grovel" "/home/testgrid/cl-test-grid/work-dir/agent/test-runs/20141117131245-abcl-1.2.1-fasl42-linux-x86/fasl/ql/dists/quicklisp/software/lisp-zmq-1.5.0/src/grovel.c" Output was: /home/testgrid/cl-test-grid/work-dir/agent/test-runs/20141117131245-abcl-1.2.1-fasl42-linux-x86/fasl/ql/dists/quicklisp/software/lisp-zmq-1.5.0/src/grovel.c:6:17: fatal error: zmq.h: No such file or directory compilation terminated.
(LOAD m2cl FAIL) ffi-grovel, CFFI-GROVEL:GROVEL-ERROR : External process exited with code 1. Command was: "cc" "-m32" "-I/home/testgrid/cl-test-grid/work-dir/agent/quicklisp/dists/quicklisp/software/cffi_0.14.0/" "-o" "/home/testgrid/cl-test-grid/work-dir/agent/test-runs/20141117131245-abcl-1.2.1-fasl42-linux-x86/fasl/ql/dists/quicklisp/software/lisp-zmq-1.5.0/src/grovel" "/home/testgrid/cl-test-grid/work-dir/agent/test-runs/20141117131245-abcl-1.2.1-fasl42-linux-x86/fasl/ql/dists/quicklisp/software/lisp-zmq-1.5.0/src/grovel.c" Output was: /home/testgrid/cl-test-grid/work-dir/agent/test-runs/20141117131245-abcl-1.2.1-fasl42-linux-x86/fasl/ql/dists/quicklisp/software/lisp-zmq-1.5.0/src/grovel.c:6:17: fatal error: zmq.h: No such file or directory compilation terminated.
(LOAD m2cl-test FAIL) ffi-grovel, CFFI-GROVEL:GROVEL-ERROR : External process exited with code 1. Command was: "cc" "-m32" "-I/home/testgrid/cl-test-grid/work-dir/agent/quicklisp/dists/quicklisp/software/cffi_0.14.0/" "-o" "/home/testgrid/cl-test-grid/work-dir/agent/test-runs/20141010031557-abcl-1.2.1-fasl42-linux-x86/fasl/ql/dists/quicklisp/software/lisp-zmq-1.5.0/src/grovel" "/home/testgrid/cl-test-grid/work-dir/agent/test-runs/20141010031557-abcl-1.2.1-fasl42-linux-x86/fasl/ql/dists/quicklisp/software/lisp-zmq-1.5.0/src/grovel.c" Output was: /home/testgrid/cl-test-grid/work-dir/agent/test-runs/20141010031557-abcl-1.2.1-fasl42-linux-x86/fasl/ql/dists/quicklisp/software/lisp-zmq-1.5.0/src/grovel.c:6:17: fatal error: zmq.h: No such file or directory compilation terminated.
(LOAD m2cl-examples FAIL) ffi-grovel, CFFI-GROVEL:GROVEL-ERROR : External process exited with code 1. Command was: "cc" "-m32" "-I/home/testgrid/cl-test-grid/work-dir/agent/quicklisp/dists/quicklisp/software/cffi_0.14.0/" "-o" "/home/testgrid/cl-test-grid/work-dir/agent/test-runs/20141010031557-abcl-1.2.1-fasl42-linux-x86/fasl/ql/dists/quicklisp/software/lisp-zmq-1.5.0/src/grovel" "/home/testgrid/cl-test-grid/work-dir/agent/test-runs/20141010031557-abcl-1.2.1-fasl42-linux-x86/fasl/ql/dists/quicklisp/software/lisp-zmq-1.5.0/src/grovel.c" Output was: /home/testgrid/cl-test-grid/work-dir/agent/test-runs/20141010031557-abcl-1.2.1-fasl42-linux-x86/fasl/ql/dists/quicklisp/software/lisp-zmq-1.5.0/src/grovel.c:6:17: fatal error: zmq.h: No such file or directory compilation terminated.
(LOAD m2cl FAIL) ffi-grovel, CFFI-GROVEL:GROVEL-ERROR : External process exited with code 1. Command was: "cc" "-m32" "-I/home/testgrid/cl-test-grid/work-dir/agent/quicklisp/dists/quicklisp/software/cffi_0.14.0/" "-o" "/home/testgrid/cl-test-grid/work-dir/agent/test-runs/20141010031557-abcl-1.2.1-fasl42-linux-x86/fasl/ql/dists/quicklisp/software/lisp-zmq-1.5.0/src/grovel" "/home/testgrid/cl-test-grid/work-dir/agent/test-runs/20141010031557-abcl-1.2.1-fasl42-linux-x86/fasl/ql/dists/quicklisp/software/lisp-zmq-1.5.0/src/grovel.c" Output was: /home/testgrid/cl-test-grid/work-dir/agent/test-runs/20141010031557-abcl-1.2.1-fasl42-linux-x86/fasl/ql/dists/quicklisp/software/lisp-zmq-1.5.0/src/grovel.c:6:17: fatal error: zmq.h: No such file or directory compilation terminated.
abcl-1.2.1-fasl42-macosx-x64
(LOAD m2cl-test FAIL) ffi, ASDF/FIND-SYSTEM:LOAD-SYSTEM-DEFINITION-ERROR : Error while trying to load definition for system zmq from pathname /Users/pnathan/cl-test-grid/work-dir/agent/quicklisp/dists/quicklisp/software/lisp-zmq-1.5.0/zmq.asd: Don't know how to COMMON-LISP:REQUIRE JNA.
(LOAD m2cl-examples FAIL) ffi, ASDF/FIND-SYSTEM:LOAD-SYSTEM-DEFINITION-ERROR : Error while trying to load definition for system zmq from pathname /Users/pnathan/cl-test-grid/work-dir/agent/quicklisp/dists/quicklisp/software/lisp-zmq-1.5.0/zmq.asd: Don't know how to COMMON-LISP:REQUIRE JNA.
(LOAD m2cl FAIL) ffi, ASDF/FIND-SYSTEM:LOAD-SYSTEM-DEFINITION-ERROR : Error while trying to load definition for system zmq from pathname /Users/pnathan/cl-test-grid/work-dir/agent/quicklisp/dists/quicklisp/software/lisp-zmq-1.5.0/zmq.asd: Don't know how to COMMON-LISP:REQUIRE JNA.
(LOAD m2cl-test FAIL) ffi, ASDF/FIND-SYSTEM:LOAD-SYSTEM-DEFINITION-ERROR : Error while trying to load definition for system zmq from pathname /Users/pnathan/cl-test-grid/work-dir/agent/quicklisp/dists/quicklisp/software/lisp-zmq-1.5.0/zmq.asd: Don't know how to COMMON-LISP:REQUIRE JNA.
(LOAD m2cl-examples FAIL) ffi, ASDF/FIND-SYSTEM:LOAD-SYSTEM-DEFINITION-ERROR : Error while trying to load definition for system zmq from pathname /Users/pnathan/cl-test-grid/work-dir/agent/quicklisp/dists/quicklisp/software/lisp-zmq-1.5.0/zmq.asd: Don't know how to COMMON-LISP:REQUIRE JNA.
(LOAD m2cl FAIL) ffi, ASDF/FIND-SYSTEM:LOAD-SYSTEM-DEFINITION-ERROR : Error while trying to load definition for system zmq from pathname /Users/pnathan/cl-test-grid/work-dir/agent/quicklisp/dists/quicklisp/software/lisp-zmq-1.5.0/zmq.asd: Don't know how to COMMON-LISP:REQUIRE JNA.
abcl-1.3.0-fasl42-linux-x86
(LOAD m2cl-test FAIL) ffi-grovel, CFFI-GROVEL:GROVEL-ERROR : External process exited with code 1. Command was: "cc" "-m32" "-I/home/testgrid/cl-test-grid/work-dir/agent/quicklisp/dists/quicklisp/software/cffi_0.14.0/" "-o" "/home/testgrid/cl-test-grid/work-dir/agent/test-runs/20141117012126-abcl-1.3.0-fasl42-linux-x86/fasl/ql/dists/quicklisp/software/lisp-zmq-1.5.0/src/grovel" "/home/testgrid/cl-test-grid/work-dir/agent/test-runs/20141117012126-abcl-1.3.0-fasl42-linux-x86/fasl/ql/dists/quicklisp/software/lisp-zmq-1.5.0/src/grovel.c" Output was: /home/testgrid/cl-test-grid/work-dir/agent/test-runs/20141117012126-abcl-1.3.0-fasl42-linux-x86/fasl/ql/dists/quicklisp/software/lisp-zmq-1.5.0/src/grovel.c:6:17: fatal error: zmq.h: No such file or directory compilation terminated.
(LOAD m2cl-examples FAIL) ffi-grovel, CFFI-GROVEL:GROVEL-ERROR : External process exited with code 1. Command was: "cc" "-m32" "-I/home/testgrid/cl-test-grid/work-dir/agent/quicklisp/dists/quicklisp/software/cffi_0.14.0/" "-o" "/home/testgrid/cl-test-grid/work-dir/agent/test-runs/20141117012126-abcl-1.3.0-fasl42-linux-x86/fasl/ql/dists/quicklisp/software/lisp-zmq-1.5.0/src/grovel" "/home/testgrid/cl-test-grid/work-dir/agent/test-runs/20141117012126-abcl-1.3.0-fasl42-linux-x86/fasl/ql/dists/quicklisp/software/lisp-zmq-1.5.0/src/grovel.c" Output was: /home/testgrid/cl-test-grid/work-dir/agent/test-runs/20141117012126-abcl-1.3.0-fasl42-linux-x86/fasl/ql/dists/quicklisp/software/lisp-zmq-1.5.0/src/grovel.c:6:17: fatal error: zmq.h: No such file or directory compilation terminated.
(LOAD m2cl FAIL) ffi-grovel, CFFI-GROVEL:GROVEL-ERROR : External process exited with code 1. Command was: "cc" "-m32" "-I/home/testgrid/cl-test-grid/work-dir/agent/quicklisp/dists/quicklisp/software/cffi_0.14.0/" "-o" "/home/testgrid/cl-test-grid/work-dir/agent/test-runs/20141117012126-abcl-1.3.0-fasl42-linux-x86/fasl/ql/dists/quicklisp/software/lisp-zmq-1.5.0/src/grovel" "/home/testgrid/cl-test-grid/work-dir/agent/test-runs/20141117012126-abcl-1.3.0-fasl42-linux-x86/fasl/ql/dists/quicklisp/software/lisp-zmq-1.5.0/src/grovel.c" Output was: /home/testgrid/cl-test-grid/work-dir/agent/test-runs/20141117012126-abcl-1.3.0-fasl42-linux-x86/fasl/ql/dists/quicklisp/software/lisp-zmq-1.5.0/src/grovel.c:6:17: fatal error: zmq.h: No such file or directory compilation terminated.
(LOAD m2cl-test FAIL) ffi-grovel, CFFI-GROVEL:GROVEL-ERROR : External process exited with code 1. Command was: "cc" "-m32" "-I/home/testgrid/cl-test-grid/work-dir/agent/quicklisp/dists/quicklisp/software/cffi_0.14.0/" "-o" "/home/testgrid/cl-test-grid/work-dir/agent/test-runs/20141009152958-abcl-1.3.0-fasl42-linux-x86/fasl/ql/dists/quicklisp/software/lisp-zmq-1.5.0/src/grovel" "/home/testgrid/cl-test-grid/work-dir/agent/test-runs/20141009152958-abcl-1.3.0-fasl42-linux-x86/fasl/ql/dists/quicklisp/software/lisp-zmq-1.5.0/src/grovel.c" Output was: /home/testgrid/cl-test-grid/work-dir/agent/test-runs/20141009152958-abcl-1.3.0-fasl42-linux-x86/fasl/ql/dists/quicklisp/software/lisp-zmq-1.5.0/src/grovel.c:6:17: fatal error: zmq.h: No such file or directory compilation terminated.
(LOAD m2cl-examples FAIL) ffi-grovel, CFFI-GROVEL:GROVEL-ERROR : External process exited with code 1. Command was: "cc" "-m32" "-I/home/testgrid/cl-test-grid/work-dir/agent/quicklisp/dists/quicklisp/software/cffi_0.14.0/" "-o" "/home/testgrid/cl-test-grid/work-dir/agent/test-runs/20141009152958-abcl-1.3.0-fasl42-linux-x86/fasl/ql/dists/quicklisp/software/lisp-zmq-1.5.0/src/grovel" "/home/testgrid/cl-test-grid/work-dir/agent/test-runs/20141009152958-abcl-1.3.0-fasl42-linux-x86/fasl/ql/dists/quicklisp/software/lisp-zmq-1.5.0/src/grovel.c" Output was: /home/testgrid/cl-test-grid/work-dir/agent/test-runs/20141009152958-abcl-1.3.0-fasl42-linux-x86/fasl/ql/dists/quicklisp/software/lisp-zmq-1.5.0/src/grovel.c:6:17: fatal error: zmq.h: No such file or directory compilation terminated.
(LOAD m2cl FAIL) ffi-grovel, CFFI-GROVEL:GROVEL-ERROR : External process exited with code 1. Command was: "cc" "-m32" "-I/home/testgrid/cl-test-grid/work-dir/agent/quicklisp/dists/quicklisp/software/cffi_0.14.0/" "-o" "/home/testgrid/cl-test-grid/work-dir/agent/test-runs/20141009152958-abcl-1.3.0-fasl42-linux-x86/fasl/ql/dists/quicklisp/software/lisp-zmq-1.5.0/src/grovel" "/home/testgrid/cl-test-grid/work-dir/agent/test-runs/20141009152958-abcl-1.3.0-fasl42-linux-x86/fasl/ql/dists/quicklisp/software/lisp-zmq-1.5.0/src/grovel.c" Output was: /home/testgrid/cl-test-grid/work-dir/agent/test-runs/20141009152958-abcl-1.3.0-fasl42-linux-x86/fasl/ql/dists/quicklisp/software/lisp-zmq-1.5.0/src/grovel.c:6:17: fatal error: zmq.h: No such file or directory compilation terminated.
abcl-1.3.1-fasl42-linux-x86
(LOAD m2cl-test FAIL) ffi-grovel, CFFI-GROVEL:GROVEL-ERROR : External process exited with code 1. Command was: "cc" "-m32" "-I/home/testgrid/cl-test-grid/work-dir/agent/quicklisp/dists/quicklisp/software/cffi_0.14.0/" "-o" "/home/testgrid/cl-test-grid/work-dir/agent/test-runs/20141116112208-abcl-1.3.1-fasl42-linux-x86/fasl/ql/dists/quicklisp/software/lisp-zmq-1.5.0/src/grovel" "/home/testgrid/cl-test-grid/work-dir/agent/test-runs/20141116112208-abcl-1.3.1-fasl42-linux-x86/fasl/ql/dists/quicklisp/software/lisp-zmq-1.5.0/src/grovel.c" Output was: /home/testgrid/cl-test-grid/work-dir/agent/test-runs/20141116112208-abcl-1.3.1-fasl42-linux-x86/fasl/ql/dists/quicklisp/software/lisp-zmq-1.5.0/src/grovel.c:6:17: fatal error: zmq.h: No such file or directory compilation terminated.
(LOAD m2cl-examples FAIL) ffi-grovel, CFFI-GROVEL:GROVEL-ERROR : External process exited with code 1. Command was: "cc" "-m32" "-I/home/testgrid/cl-test-grid/work-dir/agent/quicklisp/dists/quicklisp/software/cffi_0.14.0/" "-o" "/home/testgrid/cl-test-grid/work-dir/agent/test-runs/20141116112208-abcl-1.3.1-fasl42-linux-x86/fasl/ql/dists/quicklisp/software/lisp-zmq-1.5.0/src/grovel" "/home/testgrid/cl-test-grid/work-dir/agent/test-runs/20141116112208-abcl-1.3.1-fasl42-linux-x86/fasl/ql/dists/quicklisp/software/lisp-zmq-1.5.0/src/grovel.c" Output was: /home/testgrid/cl-test-grid/work-dir/agent/test-runs/20141116112208-abcl-1.3.1-fasl42-linux-x86/fasl/ql/dists/quicklisp/software/lisp-zmq-1.5.0/src/grovel.c:6:17: fatal error: zmq.h: No such file or directory compilation terminated.
(LOAD m2cl FAIL) ffi-grovel, CFFI-GROVEL:GROVEL-ERROR : External process exited with code 1. Command was: "cc" "-m32" "-I/home/testgrid/cl-test-grid/work-dir/agent/quicklisp/dists/quicklisp/software/cffi_0.14.0/" "-o" "/home/testgrid/cl-test-grid/work-dir/agent/test-runs/20141116112208-abcl-1.3.1-fasl42-linux-x86/fasl/ql/dists/quicklisp/software/lisp-zmq-1.5.0/src/grovel" "/home/testgrid/cl-test-grid/work-dir/agent/test-runs/20141116112208-abcl-1.3.1-fasl42-linux-x86/fasl/ql/dists/quicklisp/software/lisp-zmq-1.5.0/src/grovel.c" Output was: /home/testgrid/cl-test-grid/work-dir/agent/test-runs/20141116112208-abcl-1.3.1-fasl42-linux-x86/fasl/ql/dists/quicklisp/software/lisp-zmq-1.5.0/src/grovel.c:6:17: fatal error: zmq.h: No such file or directory compilation terminated.
(LOAD m2cl-test FAIL) ffi-grovel, CFFI-GROVEL:GROVEL-ERROR : External process exited with code 1. Command was: "cc" "-m32" "-I/home/testgrid/cl-test-grid/work-dir/agent/quicklisp/dists/quicklisp/software/cffi_0.14.0/" "-o" "/home/testgrid/cl-test-grid/work-dir/agent/test-runs/20141103135801-abcl-1.3.1-fasl42-linux-x86/fasl/ql/dists/quicklisp/software/lisp-zmq-1.5.0/src/grovel" "/home/testgrid/cl-test-grid/work-dir/agent/test-runs/20141103135801-abcl-1.3.1-fasl42-linux-x86/fasl/ql/dists/quicklisp/software/lisp-zmq-1.5.0/src/grovel.c" Output was: /home/testgrid/cl-test-grid/work-dir/agent/test-runs/20141103135801-abcl-1.3.1-fasl42-linux-x86/fasl/ql/dists/quicklisp/software/lisp-zmq-1.5.0/src/grovel.c:6:17: fatal error: zmq.h: No such file or directory compilation terminated.
(LOAD m2cl-examples FAIL) ffi-grovel, CFFI-GROVEL:GROVEL-ERROR : External process exited with code 1. Command was: "cc" "-m32" "-I/home/testgrid/cl-test-grid/work-dir/agent/quicklisp/dists/quicklisp/software/cffi_0.14.0/" "-o" "/home/testgrid/cl-test-grid/work-dir/agent/test-runs/20141103135801-abcl-1.3.1-fasl42-linux-x86/fasl/ql/dists/quicklisp/software/lisp-zmq-1.5.0/src/grovel" "/home/testgrid/cl-test-grid/work-dir/agent/test-runs/20141103135801-abcl-1.3.1-fasl42-linux-x86/fasl/ql/dists/quicklisp/software/lisp-zmq-1.5.0/src/grovel.c" Output was: /home/testgrid/cl-test-grid/work-dir/agent/test-runs/20141103135801-abcl-1.3.1-fasl42-linux-x86/fasl/ql/dists/quicklisp/software/lisp-zmq-1.5.0/src/grovel.c:6:17: fatal error: zmq.h: No such file or directory compilation terminated.
(LOAD m2cl FAIL) ffi-grovel, CFFI-GROVEL:GROVEL-ERROR : External process exited with code 1. Command was: "cc" "-m32" "-I/home/testgrid/cl-test-grid/work-dir/agent/quicklisp/dists/quicklisp/software/cffi_0.14.0/" "-o" "/home/testgrid/cl-test-grid/work-dir/agent/test-runs/20141103135801-abcl-1.3.1-fasl42-linux-x86/fasl/ql/dists/quicklisp/software/lisp-zmq-1.5.0/src/grovel" "/home/testgrid/cl-test-grid/work-dir/agent/test-runs/20141103135801-abcl-1.3.1-fasl42-linux-x86/fasl/ql/dists/quicklisp/software/lisp-zmq-1.5.0/src/grovel.c" Output was: /home/testgrid/cl-test-grid/work-dir/agent/test-runs/20141103135801-abcl-1.3.1-fasl42-linux-x86/fasl/ql/dists/quicklisp/software/lisp-zmq-1.5.0/src/grovel.c:6:17: fatal error: zmq.h: No such file or directory compilation terminated.
ccl-1.10-r16196-f96-linux-x64
(LOAD m2cl-test FAIL) ffi-grovel, CFFI-GROVEL:GROVEL-ERROR : External process exited with code 1. Command was: "cc" "-m64" "-I/home/hijarian/systems/cl-test-grid/work-dir/agent/quicklisp/dists/quicklisp/software/cffi_0.14.0/" "-o" "/home/hijarian/systems/cl-test-grid/work-dir/agent/test-runs/20141119112401-ccl-1.10-r16196-f96-linux-x64/fasl/ql/dists/quicklisp/software/lisp-zmq-1.5.0/src/grovel" "/home/hijarian/systems/cl-test-grid/work-dir/agent/test-runs/20141119112401-ccl-1.10-r16196-f96-linux-x64/fasl/ql/dists/quicklisp/software/lisp-zmq-1.5.0/src/grovel.c" Output was: /home/hijarian/systems/cl-test-grid/work-dir/agent/test-runs/20141119112401-ccl-1.10-r16196-f96-linux-x64/fasl/ql/dists/quicklisp/software/lisp-zmq-1.5.0/src/grovel.c:6:17: fatal error: zmq.h: Нет такого файла или каталога #include <zmq.h> ^ compilation terminated.
(LOAD m2cl-examples FAIL) ffi-grovel, CFFI-GROVEL:GROVEL-ERROR : External process exited with code 1. Command was: "cc" "-m64" "-I/home/hijarian/systems/cl-test-grid/work-dir/agent/quicklisp/dists/quicklisp/software/cffi_0.14.0/" "-o" "/home/hijarian/systems/cl-test-grid/work-dir/agent/test-runs/20141119112401-ccl-1.10-r16196-f96-linux-x64/fasl/ql/dists/quicklisp/software/lisp-zmq-1.5.0/src/grovel" "/home/hijarian/systems/cl-test-grid/work-dir/agent/test-runs/20141119112401-ccl-1.10-r16196-f96-linux-x64/fasl/ql/dists/quicklisp/software/lisp-zmq-1.5.0/src/grovel.c" Output was: /home/hijarian/systems/cl-test-grid/work-dir/agent/test-runs/20141119112401-ccl-1.10-r16196-f96-linux-x64/fasl/ql/dists/quicklisp/software/lisp-zmq-1.5.0/src/grovel.c:6:17: fatal error: zmq.h: Нет такого файла или каталога #include <zmq.h> ^ compilation terminated.
(LOAD m2cl FAIL) ffi-grovel, CFFI-GROVEL:GROVEL-ERROR : External process exited with code 1. Command was: "cc" "-m64" "-I/home/hijarian/systems/cl-test-grid/work-dir/agent/quicklisp/dists/quicklisp/software/cffi_0.14.0/" "-o" "/home/hijarian/systems/cl-test-grid/work-dir/agent/test-runs/20141119112401-ccl-1.10-r16196-f96-linux-x64/fasl/ql/dists/quicklisp/software/lisp-zmq-1.5.0/src/grovel" "/home/hijarian/systems/cl-test-grid/work-dir/agent/test-runs/20141119112401-ccl-1.10-r16196-f96-linux-x64/fasl/ql/dists/quicklisp/software/lisp-zmq-1.5.0/src/grovel.c" Output was: /home/hijarian/systems/cl-test-grid/work-dir/agent/test-runs/20141119112401-ccl-1.10-r16196-f96-linux-x64/fasl/ql/dists/quicklisp/software/lisp-zmq-1.5.0/src/grovel.c:6:17: fatal error: zmq.h: Нет такого файла или каталога #include <zmq.h> ^ compilation terminated.
ccl-1.8-r15286m-f95-linux-x86
(LOAD m2cl-test FAIL) ffi-grovel, CFFI-GROVEL:GROVEL-ERROR : External process exited with code 1. Command was: "cc" "-m32" "-I/home/testgrid/cl-test-grid/work-dir/agent/quicklisp/dists/quicklisp/software/cffi_0.14.0/" "-o" "/home/testgrid/cl-test-grid/work-dir/agent/test-runs/20141115164752-ccl-1.8-r15286m-f95-linux-x86/fasl/ql/dists/quicklisp/software/lisp-zmq-1.5.0/src/grovel" "/home/testgrid/cl-test-grid/work-dir/agent/test-runs/20141115164752-ccl-1.8-r15286m-f95-linux-x86/fasl/ql/dists/quicklisp/software/lisp-zmq-1.5.0/src/grovel.c" Output was: /home/testgrid/cl-test-grid/work-dir/agent/test-runs/20141115164752-ccl-1.8-r15286m-f95-linux-x86/fasl/ql/dists/quicklisp/software/lisp-zmq-1.5.0/src/grovel.c:6:17: fatal error: zmq.h: No such file or directory compilation terminated.
(LOAD m2cl-examples FAIL) ffi-grovel, CFFI-GROVEL:GROVEL-ERROR : External process exited with code 1. Command was: "cc" "-m32" "-I/home/testgrid/cl-test-grid/work-dir/agent/quicklisp/dists/quicklisp/software/cffi_0.14.0/" "-o" "/home/testgrid/cl-test-grid/work-dir/agent/test-runs/20141115164752-ccl-1.8-r15286m-f95-linux-x86/fasl/ql/dists/quicklisp/software/lisp-zmq-1.5.0/src/grovel" "/home/testgrid/cl-test-grid/work-dir/agent/test-runs/20141115164752-ccl-1.8-r15286m-f95-linux-x86/fasl/ql/dists/quicklisp/software/lisp-zmq-1.5.0/src/grovel.c" Output was: /home/testgrid/cl-test-grid/work-dir/agent/test-runs/20141115164752-ccl-1.8-r15286m-f95-linux-x86/fasl/ql/dists/quicklisp/software/lisp-zmq-1.5.0/src/grovel.c:6:17: fatal error: zmq.h: No such file or directory compilation terminated.
(LOAD m2cl FAIL) ffi-grovel, CFFI-GROVEL:GROVEL-ERROR : External process exited with code 1. Command was: "cc" "-m32" "-I/home/testgrid/cl-test-grid/work-dir/agent/quicklisp/dists/quicklisp/software/cffi_0.14.0/" "-o" "/home/testgrid/cl-test-grid/work-dir/agent/test-runs/20141115164752-ccl-1.8-r15286m-f95-linux-x86/fasl/ql/dists/quicklisp/software/lisp-zmq-1.5.0/src/grovel" "/home/testgrid/cl-test-grid/work-dir/agent/test-runs/20141115164752-ccl-1.8-r15286m-f95-linux-x86/fasl/ql/dists/quicklisp/software/lisp-zmq-1.5.0/src/grovel.c" Output was: /home/testgrid/cl-test-grid/work-dir/agent/test-runs/20141115164752-ccl-1.8-r15286m-f95-linux-x86/fasl/ql/dists/quicklisp/software/lisp-zmq-1.5.0/src/grovel.c:6:17: fatal error: zmq.h: No such file or directory compilation terminated.
(LOAD m2cl-test FAIL) ffi-grovel, CFFI-GROVEL:GROVEL-ERROR : External process exited with code 1. Command was: "cc" "-m32" "-I/home/testgrid/cl-test-grid/work-dir/agent/quicklisp/dists/quicklisp/software/cffi_0.14.0/" "-o" "/home/testgrid/cl-test-grid/work-dir/agent/test-runs/20141008055253-ccl-1.8-r15286m-f95-linux-x86/fasl/ql/dists/quicklisp/software/lisp-zmq-1.5.0/src/grovel" "/home/testgrid/cl-test-grid/work-dir/agent/test-runs/20141008055253-ccl-1.8-r15286m-f95-linux-x86/fasl/ql/dists/quicklisp/software/lisp-zmq-1.5.0/src/grovel.c" Output was: /home/testgrid/cl-test-grid/work-dir/agent/test-runs/20141008055253-ccl-1.8-r15286m-f95-linux-x86/fasl/ql/dists/quicklisp/software/lisp-zmq-1.5.0/src/grovel.c:6:17: fatal error: zmq.h: No such file or directory compilation terminated.
(LOAD m2cl-examples FAIL) ffi-grovel, CFFI-GROVEL:GROVEL-ERROR : External process exited with code 1. Command was: "cc" "-m32" "-I/home/testgrid/cl-test-grid/work-dir/agent/quicklisp/dists/quicklisp/software/cffi_0.14.0/" "-o" "/home/testgrid/cl-test-grid/work-dir/agent/test-runs/20141008055253-ccl-1.8-r15286m-f95-linux-x86/fasl/ql/dists/quicklisp/software/lisp-zmq-1.5.0/src/grovel" "/home/testgrid/cl-test-grid/work-dir/agent/test-runs/20141008055253-ccl-1.8-r15286m-f95-linux-x86/fasl/ql/dists/quicklisp/software/lisp-zmq-1.5.0/src/grovel.c" Output was: /home/testgrid/cl-test-grid/work-dir/agent/test-runs/20141008055253-ccl-1.8-r15286m-f95-linux-x86/fasl/ql/dists/quicklisp/software/lisp-zmq-1.5.0/src/grovel.c:6:17: fatal error: zmq.h: No such file or directory compilation terminated.
(LOAD m2cl FAIL) ffi-grovel, CFFI-GROVEL:GROVEL-ERROR : External process exited with code 1. Command was: "cc" "-m32" "-I/home/testgrid/cl-test-grid/work-dir/agent/quicklisp/dists/quicklisp/software/cffi_0.14.0/" "-o" "/home/testgrid/cl-test-grid/work-dir/agent/test-runs/20141008055253-ccl-1.8-r15286m-f95-linux-x86/fasl/ql/dists/quicklisp/software/lisp-zmq-1.5.0/src/grovel" "/home/testgrid/cl-test-grid/work-dir/agent/test-runs/20141008055253-ccl-1.8-r15286m-f95-linux-x86/fasl/ql/dists/quicklisp/software/lisp-zmq-1.5.0/src/grovel.c" Output was: /home/testgrid/cl-test-grid/work-dir/agent/test-runs/20141008055253-ccl-1.8-r15286m-f95-linux-x86/fasl/ql/dists/quicklisp/software/lisp-zmq-1.5.0/src/grovel.c:6:17: fatal error: zmq.h: No such file or directory compilation terminated.
ccl-1.9-f96-linux-x64
(LOAD m2cl-test FAIL) ffi-grovel, CFFI-GROVEL:GROVEL-ERROR : External process exited with code 1. Command was: "cc" "-m64" "-I/home/hijarian/systems/cl-test-grid/work-dir/agent/quicklisp/dists/quicklisp/software/cffi_0.14.0/" "-o" "/home/hijarian/systems/cl-test-grid/work-dir/agent/test-runs/20141007093127-ccl-1.9-f96-linux-x64/fasl/ql/dists/quicklisp/software/lisp-zmq-1.5.0/src/grovel" "/home/hijarian/systems/cl-test-grid/work-dir/agent/test-runs/20141007093127-ccl-1.9-f96-linux-x64/fasl/ql/dists/quicklisp/software/lisp-zmq-1.5.0/src/grovel.c" Output was: /home/hijarian/systems/cl-test-grid/work-dir/agent/test-runs/20141007093127-ccl-1.9-f96-linux-x64/fasl/ql/dists/quicklisp/software/lisp-zmq-1.5.0/src/grovel.c:6:17: fatal error: zmq.h: Нет такого файла или каталога compilation terminated.
(LOAD m2cl-examples FAIL) ffi-grovel, CFFI-GROVEL:GROVEL-ERROR : External process exited with code 1. Command was: "cc" "-m64" "-I/home/hijarian/systems/cl-test-grid/work-dir/agent/quicklisp/dists/quicklisp/software/cffi_0.14.0/" "-o" "/home/hijarian/systems/cl-test-grid/work-dir/agent/test-runs/20141007093127-ccl-1.9-f96-linux-x64/fasl/ql/dists/quicklisp/software/lisp-zmq-1.5.0/src/grovel" "/home/hijarian/systems/cl-test-grid/work-dir/agent/test-runs/20141007093127-ccl-1.9-f96-linux-x64/fasl/ql/dists/quicklisp/software/lisp-zmq-1.5.0/src/grovel.c" Output was: /home/hijarian/systems/cl-test-grid/work-dir/agent/test-runs/20141007093127-ccl-1.9-f96-linux-x64/fasl/ql/dists/quicklisp/software/lisp-zmq-1.5.0/src/grovel.c:6:17: fatal error: zmq.h: Нет такого файла или каталога compilation terminated.
(LOAD m2cl FAIL) ffi-grovel, CFFI-GROVEL:GROVEL-ERROR : External process exited with code 1. Command was: "cc" "-m64" "-I/home/hijarian/systems/cl-test-grid/work-dir/agent/quicklisp/dists/quicklisp/software/cffi_0.14.0/" "-o" "/home/hijarian/systems/cl-test-grid/work-dir/agent/test-runs/20141007093127-ccl-1.9-f96-linux-x64/fasl/ql/dists/quicklisp/software/lisp-zmq-1.5.0/src/grovel" "/home/hijarian/systems/cl-test-grid/work-dir/agent/test-runs/20141007093127-ccl-1.9-f96-linux-x64/fasl/ql/dists/quicklisp/software/lisp-zmq-1.5.0/src/grovel.c" Output was: /home/hijarian/systems/cl-test-grid/work-dir/agent/test-runs/20141007093127-ccl-1.9-f96-linux-x64/fasl/ql/dists/quicklisp/software/lisp-zmq-1.5.0/src/grovel.c:6:17: fatal error: zmq.h: Нет такого файла или каталога compilation terminated.
ccl-1.9-r15756-f96-linux-x86
(LOAD m2cl-test FAIL) ffi-grovel, CFFI-GROVEL:GROVEL-ERROR : External process exited with code 1. Command was: "cc" "-m32" "-I/home/testgrid/cl-test-grid/work-dir/agent/quicklisp/dists/quicklisp/software/cffi_0.14.0/" "-o" "/home/testgrid/cl-test-grid/work-dir/agent/test-runs/20141115074638-ccl-1.9-r15756-f96-linux-x86/fasl/ql/dists/quicklisp/software/lisp-zmq-1.5.0/src/grovel" "/home/testgrid/cl-test-grid/work-dir/agent/test-runs/20141115074638-ccl-1.9-r15756-f96-linux-x86/fasl/ql/dists/quicklisp/software/lisp-zmq-1.5.0/src/grovel.c" Output was: /home/testgrid/cl-test-grid/work-dir/agent/test-runs/20141115074638-ccl-1.9-r15756-f96-linux-x86/fasl/ql/dists/quicklisp/software/lisp-zmq-1.5.0/src/grovel.c:6:17: fatal error: zmq.h: No such file or directory compilation terminated.
(LOAD m2cl-examples FAIL) ffi-grovel, CFFI-GROVEL:GROVEL-ERROR : External process exited with code 1. Command was: "cc" "-m32" "-I/home/testgrid/cl-test-grid/work-dir/agent/quicklisp/dists/quicklisp/software/cffi_0.14.0/" "-o" "/home/testgrid/cl-test-grid/work-dir/agent/test-runs/20141115074638-ccl-1.9-r15756-f96-linux-x86/fasl/ql/dists/quicklisp/software/lisp-zmq-1.5.0/src/grovel" "/home/testgrid/cl-test-grid/work-dir/agent/test-runs/20141115074638-ccl-1.9-r15756-f96-linux-x86/fasl/ql/dists/quicklisp/software/lisp-zmq-1.5.0/src/grovel.c" Output was: /home/testgrid/cl-test-grid/work-dir/agent/test-runs/20141115074638-ccl-1.9-r15756-f96-linux-x86/fasl/ql/dists/quicklisp/software/lisp-zmq-1.5.0/src/grovel.c:6:17: fatal error: zmq.h: No such file or directory compilation terminated.
(LOAD m2cl FAIL) ffi-grovel, CFFI-GROVEL:GROVEL-ERROR : External process exited with code 1. Command was: "cc" "-m32" "-I/home/testgrid/cl-test-grid/work-dir/agent/quicklisp/dists/quicklisp/software/cffi_0.14.0/" "-o" "/home/testgrid/cl-test-grid/work-dir/agent/test-runs/20141115074638-ccl-1.9-r15756-f96-linux-x86/fasl/ql/dists/quicklisp/software/lisp-zmq-1.5.0/src/grovel" "/home/testgrid/cl-test-grid/work-dir/agent/test-runs/20141115074638-ccl-1.9-r15756-f96-linux-x86/fasl/ql/dists/quicklisp/software/lisp-zmq-1.5.0/src/grovel.c" Output was: /home/testgrid/cl-test-grid/work-dir/agent/test-runs/20141115074638-ccl-1.9-r15756-f96-linux-x86/fasl/ql/dists/quicklisp/software/lisp-zmq-1.5.0/src/grovel.c:6:17: fatal error: zmq.h: No such file or directory compilation terminated.
(LOAD m2cl-test FAIL) ffi-grovel, CFFI-GROVEL:GROVEL-ERROR : External process exited with code 1. Command was: "cc" "-m32" "-I/home/testgrid/cl-test-grid/work-dir/agent/quicklisp/dists/quicklisp/software/cffi_0.14.0/" "-o" "/home/testgrid/cl-test-grid/work-dir/agent/test-runs/20141007045958-ccl-1.9-r15756-f96-linux-x86/fasl/ql/dists/quicklisp/software/lisp-zmq-1.5.0/src/grovel" "/home/testgrid/cl-test-grid/work-dir/agent/test-runs/20141007045958-ccl-1.9-r15756-f96-linux-x86/fasl/ql/dists/quicklisp/software/lisp-zmq-1.5.0/src/grovel.c" Output was: /home/testgrid/cl-test-grid/work-dir/agent/test-runs/20141007045958-ccl-1.9-r15756-f96-linux-x86/fasl/ql/dists/quicklisp/software/lisp-zmq-1.5.0/src/grovel.c:6:17: fatal error: zmq.h: No such file or directory compilation terminated.
(LOAD m2cl-examples FAIL) ffi-grovel, CFFI-GROVEL:GROVEL-ERROR : External process exited with code 1. Command was: "cc" "-m32" "-I/home/testgrid/cl-test-grid/work-dir/agent/quicklisp/dists/quicklisp/software/cffi_0.14.0/" "-o" "/home/testgrid/cl-test-grid/work-dir/agent/test-runs/20141007045958-ccl-1.9-r15756-f96-linux-x86/fasl/ql/dists/quicklisp/software/lisp-zmq-1.5.0/src/grovel" "/home/testgrid/cl-test-grid/work-dir/agent/test-runs/20141007045958-ccl-1.9-r15756-f96-linux-x86/fasl/ql/dists/quicklisp/software/lisp-zmq-1.5.0/src/grovel.c" Output was: /home/testgrid/cl-test-grid/work-dir/agent/test-runs/20141007045958-ccl-1.9-r15756-f96-linux-x86/fasl/ql/dists/quicklisp/software/lisp-zmq-1.5.0/src/grovel.c:6:17: fatal error: zmq.h: No such file or directory compilation terminated.
(LOAD m2cl FAIL) ffi-grovel, CFFI-GROVEL:GROVEL-ERROR : External process exited with code 1. Command was: "cc" "-m32" "-I/home/testgrid/cl-test-grid/work-dir/agent/quicklisp/dists/quicklisp/software/cffi_0.14.0/" "-o" "/home/testgrid/cl-test-grid/work-dir/agent/test-runs/20141007045958-ccl-1.9-r15756-f96-linux-x86/fasl/ql/dists/quicklisp/software/lisp-zmq-1.5.0/src/grovel" "/home/testgrid/cl-test-grid/work-dir/agent/test-runs/20141007045958-ccl-1.9-r15756-f96-linux-x86/fasl/ql/dists/quicklisp/software/lisp-zmq-1.5.0/src/grovel.c" Output was: /home/testgrid/cl-test-grid/work-dir/agent/test-runs/20141007045958-ccl-1.9-r15756-f96-linux-x86/fasl/ql/dists/quicklisp/software/lisp-zmq-1.5.0/src/grovel.c:6:17: fatal error: zmq.h: No such file or directory compilation terminated.
ccl-1.9-r15758-f96-macosx-x86
(LOAD m2cl-test FAIL) ffi-grovel, CFFI-GROVEL:GROVEL-ERROR : External process exited with code 1. Command was: "cc" "-m32" "-I" "/opt/local/include/" "-I/Users/pnathan/cl-test-grid/work-dir/agent/quicklisp/dists/quicklisp/software/cffi_0.14.0/" "-o" "/Users/pnathan/cl-test-grid/work-dir/agent/test-runs/20141030074304-ccl-1.9-r15758-f96-macosx-x86/fasl/ql/dists/quicklisp/software/lisp-zmq-1.5.0/src/grovel" "/Users/pnathan/cl-test-grid/work-dir/agent/test-runs/20141030074304-ccl-1.9-r15758-f96-macosx-x86/fasl/ql/dists/quicklisp/software/lisp-zmq-1.5.0/src/grovel.c" Output was: /Users/pnathan/cl-test-grid/work-dir/agent/test-runs/20141030074304-ccl-1.9-r15758-f96-macosx-x86/fasl/ql/dists/quicklisp/software/lisp-zmq-1.5.0/src/grovel.c:6:17: error: zmq.h: No such file or directory /Users/pnathan/cl-test-grid/work-dir/agent/test-runs/20141030074304-ccl-1.9-r15758-f96-macosx-x86/fasl/ql/dists/quicklisp/software/lisp-zmq-1.5.0/src/grovel.c: In function ‘main’: /Users/pnathan/cl-test-grid/work-dir/agent/test-runs/20141030074304-ccl-1.9-r15758-f96-macosx-x86/fasl/ql/dists/quicklisp/software/lisp-zmq-1.5.0/src/grovel.c:881: error: ‘zmq_msg_t’ undeclared (first use in this function) /Users/pnathan/cl-test-grid/work-dir/agent/test-runs/20141030074304-ccl-1.9-r15758-f96-macosx-x86/fasl/ql/dists/quicklisp/software/lisp-zmq-1.5.0/src/grovel.c:881: error: (Each undeclared identifier is reported only once /Users/pnathan/cl-test-grid/work-dir/agent/test-runs/20141030074304-ccl-1.9-r15758-f96-macosx-x86/fasl/ql/dists/quicklisp/software/lisp-zmq-1.5.0/src/grovel.c:881: error: for each function it appears in.) /Users/pnathan/cl-test-grid/work-dir/agent/test-runs/20141030074304-ccl-1.9-r15758-f96-macosx-x86/fasl/ql/dists/quicklisp/software/lisp-zmq-1.5.0/src/grovel.c:892: error: ‘zmq_pollitem_t’ undeclared (first use in this function) /Users/pnathan/cl-test-grid/work-dir/agent/test-runs/20141030074304-ccl-1.9-r15758-f96-macosx-x86/fasl/ql/dists/quicklisp/software/lisp-zmq-1.5.0/src/grovel.c:897: error: expected expression before ‘)’ token /Users/pnathan/cl-test-grid/work-dir/agent/test-runs/20141030074304-ccl-1.9-r15758-f96-macosx-x86/fasl/ql/dists/quicklisp/software/lisp-zmq-1.5.0/src/grovel.c:901: error: expected ‘;’ before ‘slot_signed_p_struct’ /Users/pnathan/cl-test-grid/work-dir/agent/test-runs/20141030074304-ccl-1.9-r15758-f96-macosx-x86/fasl/ql/dists/quicklisp/software/lisp-zmq-1.5.0/src/grovel.c:901: error: ‘slot_signed_p_struct’ undeclared (first use in this function) /Users/pnathan/cl-test-grid/work-dir/agent/test-runs/20141030074304-ccl-1.9-r15758-f96-macosx-x86/fasl/ql/dists/quicklisp/software/lisp-zmq-1.5.0/src/grovel.c:902: error: expected expression before ‘)’ token /Users/pnathan/cl-test-grid/work-dir/agent/test-runs/20141030074304-ccl-1.9-r15758-f96-macosx-x86/fasl/ql/dists/quicklisp/software/lisp-zmq-1.5.0/src/grovel.c:903: error: expected expression before ‘)’ token /Users/pnathan/cl-test-grid/work-dir/agent/test-runs/20141030074304-ccl-1.9-r15758-f96-macosx-x86/fasl/ql/dists/quicklisp/software/lisp-zmq-1.5.0/src/grovel.c:908: error: expected expression before ‘)’ token /Users/pnathan/cl-test-grid/work-dir/agent/test-runs/20141030074304-ccl-1.9-r15758-f96-macosx-x86/fasl/ql/dists/quicklisp/software/lisp-zmq-1.5.0/src/grovel.c:913: error: expected expression before ‘)’ token
(LOAD m2cl-examples FAIL) ffi-grovel, CFFI-GROVEL:GROVEL-ERROR : External process exited with code 1. Command was: "cc" "-m32" "-I" "/opt/local/include/" "-I/Users/pnathan/cl-test-grid/work-dir/agent/quicklisp/dists/quicklisp/software/cffi_0.14.0/" "-o" "/Users/pnathan/cl-test-grid/work-dir/agent/test-runs/20141030074304-ccl-1.9-r15758-f96-macosx-x86/fasl/ql/dists/quicklisp/software/lisp-zmq-1.5.0/src/grovel" "/Users/pnathan/cl-test-grid/work-dir/agent/test-runs/20141030074304-ccl-1.9-r15758-f96-macosx-x86/fasl/ql/dists/quicklisp/software/lisp-zmq-1.5.0/src/grovel.c" Output was: /Users/pnathan/cl-test-grid/work-dir/agent/test-runs/20141030074304-ccl-1.9-r15758-f96-macosx-x86/fasl/ql/dists/quicklisp/software/lisp-zmq-1.5.0/src/grovel.c:6:17: error: zmq.h: No such file or directory /Users/pnathan/cl-test-grid/work-dir/agent/test-runs/20141030074304-ccl-1.9-r15758-f96-macosx-x86/fasl/ql/dists/quicklisp/software/lisp-zmq-1.5.0/src/grovel.c: In function ‘main’: /Users/pnathan/cl-test-grid/work-dir/agent/test-runs/20141030074304-ccl-1.9-r15758-f96-macosx-x86/fasl/ql/dists/quicklisp/software/lisp-zmq-1.5.0/src/grovel.c:881: error: ‘zmq_msg_t’ undeclared (first use in this function) /Users/pnathan/cl-test-grid/work-dir/agent/test-runs/20141030074304-ccl-1.9-r15758-f96-macosx-x86/fasl/ql/dists/quicklisp/software/lisp-zmq-1.5.0/src/grovel.c:881: error: (Each undeclared identifier is reported only once /Users/pnathan/cl-test-grid/work-dir/agent/test-runs/20141030074304-ccl-1.9-r15758-f96-macosx-x86/fasl/ql/dists/quicklisp/software/lisp-zmq-1.5.0/src/grovel.c:881: error: for each function it appears in.) /Users/pnathan/cl-test-grid/work-dir/agent/test-runs/20141030074304-ccl-1.9-r15758-f96-macosx-x86/fasl/ql/dists/quicklisp/software/lisp-zmq-1.5.0/src/grovel.c:892: error: ‘zmq_pollitem_t’ undeclared (first use in this function) /Users/pnathan/cl-test-grid/work-dir/agent/test-runs/20141030074304-ccl-1.9-r15758-f96-macosx-x86/fasl/ql/dists/quicklisp/software/lisp-zmq-1.5.0/src/grovel.c:897: error: expected expression before ‘)’ token /Users/pnathan/cl-test-grid/work-dir/agent/test-runs/20141030074304-ccl-1.9-r15758-f96-macosx-x86/fasl/ql/dists/quicklisp/software/lisp-zmq-1.5.0/src/grovel.c:901: error: expected ‘;’ before ‘slot_signed_p_struct’ /Users/pnathan/cl-test-grid/work-dir/agent/test-runs/20141030074304-ccl-1.9-r15758-f96-macosx-x86/fasl/ql/dists/quicklisp/software/lisp-zmq-1.5.0/src/grovel.c:901: error: ‘slot_signed_p_struct’ undeclared (first use in this function) /Users/pnathan/cl-test-grid/work-dir/agent/test-runs/20141030074304-ccl-1.9-r15758-f96-macosx-x86/fasl/ql/dists/quicklisp/software/lisp-zmq-1.5.0/src/grovel.c:902: error: expected expression before ‘)’ token /Users/pnathan/cl-test-grid/work-dir/agent/test-runs/20141030074304-ccl-1.9-r15758-f96-macosx-x86/fasl/ql/dists/quicklisp/software/lisp-zmq-1.5.0/src/grovel.c:903: error: expected expression before ‘)’ token /Users/pnathan/cl-test-grid/work-dir/agent/test-runs/20141030074304-ccl-1.9-r15758-f96-macosx-x86/fasl/ql/dists/quicklisp/software/lisp-zmq-1.5.0/src/grovel.c:908: error: expected expression before ‘)’ token /Users/pnathan/cl-test-grid/work-dir/agent/test-runs/20141030074304-ccl-1.9-r15758-f96-macosx-x86/fasl/ql/dists/quicklisp/software/lisp-zmq-1.5.0/src/grovel.c:913: error: expected expression before ‘)’ token
(LOAD m2cl FAIL) ffi-grovel, CFFI-GROVEL:GROVEL-ERROR : External process exited with code 1. Command was: "cc" "-m32" "-I" "/opt/local/include/" "-I/Users/pnathan/cl-test-grid/work-dir/agent/quicklisp/dists/quicklisp/software/cffi_0.14.0/" "-o" "/Users/pnathan/cl-test-grid/work-dir/agent/test-runs/20141030074304-ccl-1.9-r15758-f96-macosx-x86/fasl/ql/dists/quicklisp/software/lisp-zmq-1.5.0/src/grovel" "/Users/pnathan/cl-test-grid/work-dir/agent/test-runs/20141030074304-ccl-1.9-r15758-f96-macosx-x86/fasl/ql/dists/quicklisp/software/lisp-zmq-1.5.0/src/grovel.c" Output was: /Users/pnathan/cl-test-grid/work-dir/agent/test-runs/20141030074304-ccl-1.9-r15758-f96-macosx-x86/fasl/ql/dists/quicklisp/software/lisp-zmq-1.5.0/src/grovel.c:6:17: error: zmq.h: No such file or directory /Users/pnathan/cl-test-grid/work-dir/agent/test-runs/20141030074304-ccl-1.9-r15758-f96-macosx-x86/fasl/ql/dists/quicklisp/software/lisp-zmq-1.5.0/src/grovel.c: In function ‘main’: /Users/pnathan/cl-test-grid/work-dir/agent/test-runs/20141030074304-ccl-1.9-r15758-f96-macosx-x86/fasl/ql/dists/quicklisp/software/lisp-zmq-1.5.0/src/grovel.c:881: error: ‘zmq_msg_t’ undeclared (first use in this function) /Users/pnathan/cl-test-grid/work-dir/agent/test-runs/20141030074304-ccl-1.9-r15758-f96-macosx-x86/fasl/ql/dists/quicklisp/software/lisp-zmq-1.5.0/src/grovel.c:881: error: (Each undeclared identifier is reported only once /Users/pnathan/cl-test-grid/work-dir/agent/test-runs/20141030074304-ccl-1.9-r15758-f96-macosx-x86/fasl/ql/dists/quicklisp/software/lisp-zmq-1.5.0/src/grovel.c:881: error: for each function it appears in.) /Users/pnathan/cl-test-grid/work-dir/agent/test-runs/20141030074304-ccl-1.9-r15758-f96-macosx-x86/fasl/ql/dists/quicklisp/software/lisp-zmq-1.5.0/src/grovel.c:892: error: ‘zmq_pollitem_t’ undeclared (first use in this function) /Users/pnathan/cl-test-grid/work-dir/agent/test-runs/20141030074304-ccl-1.9-r15758-f96-macosx-x86/fasl/ql/dists/quicklisp/software/lisp-zmq-1.5.0/src/grovel.c:897: error: expected expression before ‘)’ token /Users/pnathan/cl-test-grid/work-dir/agent/test-runs/20141030074304-ccl-1.9-r15758-f96-macosx-x86/fasl/ql/dists/quicklisp/software/lisp-zmq-1.5.0/src/grovel.c:901: error: expected ‘;’ before ‘slot_signed_p_struct’ /Users/pnathan/cl-test-grid/work-dir/agent/test-runs/20141030074304-ccl-1.9-r15758-f96-macosx-x86/fasl/ql/dists/quicklisp/software/lisp-zmq-1.5.0/src/grovel.c:901: error: ‘slot_signed_p_struct’ undeclared (first use in this function) /Users/pnathan/cl-test-grid/work-dir/agent/test-runs/20141030074304-ccl-1.9-r15758-f96-macosx-x86/fasl/ql/dists/quicklisp/software/lisp-zmq-1.5.0/src/grovel.c:902: error: expected expression before ‘)’ token /Users/pnathan/cl-test-grid/work-dir/agent/test-runs/20141030074304-ccl-1.9-r15758-f96-macosx-x86/fasl/ql/dists/quicklisp/software/lisp-zmq-1.5.0/src/grovel.c:903: error: expected expression before ‘)’ token /Users/pnathan/cl-test-grid/work-dir/agent/test-runs/20141030074304-ccl-1.9-r15758-f96-macosx-x86/fasl/ql/dists/quicklisp/software/lisp-zmq-1.5.0/src/grovel.c:908: error: expected expression before ‘)’ token /Users/pnathan/cl-test-grid/work-dir/agent/test-runs/20141030074304-ccl-1.9-r15758-f96-macosx-x86/fasl/ql/dists/quicklisp/software/lisp-zmq-1.5.0/src/grovel.c:913: error: expected expression before ‘)’ token
ccl-1.9-r15759-f96-macosx-x64
(LOAD m2cl-test FAIL) ffi-grovel, CFFI-GROVEL:GROVEL-ERROR : External process exited with code 1. Command was: "cc" "-m64" "-I" "/opt/local/include/" "-I/Users/pnathan/cl-test-grid/work-dir/agent/quicklisp/dists/quicklisp/software/cffi_0.14.0/" "-o" "/Users/pnathan/cl-test-grid/work-dir/agent/test-runs/20141105004833-ccl-1.9-r15759-f96-macosx-x64/fasl/ql/dists/quicklisp/software/lisp-zmq-1.5.0/src/grovel" "/Users/pnathan/cl-test-grid/work-dir/agent/test-runs/20141105004833-ccl-1.9-r15759-f96-macosx-x64/fasl/ql/dists/quicklisp/software/lisp-zmq-1.5.0/src/grovel.c" Output was: /Users/pnathan/cl-test-grid/work-dir/agent/test-runs/20141105004833-ccl-1.9-r15759-f96-macosx-x64/fasl/ql/dists/quicklisp/software/lisp-zmq-1.5.0/src/grovel.c:6:17: error: zmq.h: No such file or directory /Users/pnathan/cl-test-grid/work-dir/agent/test-runs/20141105004833-ccl-1.9-r15759-f96-macosx-x64/fasl/ql/dists/quicklisp/software/lisp-zmq-1.5.0/src/grovel.c: In function ‘main’: /Users/pnathan/cl-test-grid/work-dir/agent/test-runs/20141105004833-ccl-1.9-r15759-f96-macosx-x64/fasl/ql/dists/quicklisp/software/lisp-zmq-1.5.0/src/grovel.c:881: error: ‘zmq_msg_t’ undeclared (first use in this function) /Users/pnathan/cl-test-grid/work-dir/agent/test-runs/20141105004833-ccl-1.9-r15759-f96-macosx-x64/fasl/ql/dists/quicklisp/software/lisp-zmq-1.5.0/src/grovel.c:881: error: (Each undeclared identifier is reported only once /Users/pnathan/cl-test-grid/work-dir/agent/test-runs/20141105004833-ccl-1.9-r15759-f96-macosx-x64/fasl/ql/dists/quicklisp/software/lisp-zmq-1.5.0/src/grovel.c:881: error: for each function it appears in.) /Users/pnathan/cl-test-grid/work-dir/agent/test-runs/20141105004833-ccl-1.9-r15759-f96-macosx-x64/fasl/ql/dists/quicklisp/software/lisp-zmq-1.5.0/src/grovel.c:892: error: ‘zmq_pollitem_t’ undeclared (first use in this function) /Users/pnathan/cl-test-grid/work-dir/agent/test-runs/20141105004833-ccl-1.9-r15759-f96-macosx-x64/fasl/ql/dists/quicklisp/software/lisp-zmq-1.5.0/src/grovel.c:897: error: expected expression before ‘)’ token /Users/pnathan/cl-test-grid/work-dir/agent/test-runs/20141105004833-ccl-1.9-r15759-f96-macosx-x64/fasl/ql/dists/quicklisp/software/lisp-zmq-1.5.0/src/grovel.c:901: error: expected ‘;’ before ‘slot_signed_p_struct’ /Users/pnathan/cl-test-grid/work-dir/agent/test-runs/20141105004833-ccl-1.9-r15759-f96-macosx-x64/fasl/ql/dists/quicklisp/software/lisp-zmq-1.5.0/src/grovel.c:901: error: ‘slot_signed_p_struct’ undeclared (first use in this function) /Users/pnathan/cl-test-grid/work-dir/agent/test-runs/20141105004833-ccl-1.9-r15759-f96-macosx-x64/fasl/ql/dists/quicklisp/software/lisp-zmq-1.5.0/src/grovel.c:902: error: expected expression before ‘)’ token /Users/pnathan/cl-test-grid/work-dir/agent/test-runs/20141105004833-ccl-1.9-r15759-f96-macosx-x64/fasl/ql/dists/quicklisp/software/lisp-zmq-1.5.0/src/grovel.c:903: error: expected expression before ‘)’ token /Users/pnathan/cl-test-grid/work-dir/agent/test-runs/20141105004833-ccl-1.9-r15759-f96-macosx-x64/fasl/ql/dists/quicklisp/software/lisp-zmq-1.5.0/src/grovel.c:908: error: expected expression before ‘)’ token /Users/pnathan/cl-test-grid/work-dir/agent/test-runs/20141105004833-ccl-1.9-r15759-f96-macosx-x64/fasl/ql/dists/quicklisp/software/lisp-zmq-1.5.0/src/grovel.c:913: error: expected expression before ‘)’ token
(LOAD m2cl-examples FAIL) ffi-grovel, CFFI-GROVEL:GROVEL-ERROR : External process exited with code 1. Command was: "cc" "-m64" "-I" "/opt/local/include/" "-I/Users/pnathan/cl-test-grid/work-dir/agent/quicklisp/dists/quicklisp/software/cffi_0.14.0/" "-o" "/Users/pnathan/cl-test-grid/work-dir/agent/test-runs/20141105004833-ccl-1.9-r15759-f96-macosx-x64/fasl/ql/dists/quicklisp/software/lisp-zmq-1.5.0/src/grovel" "/Users/pnathan/cl-test-grid/work-dir/agent/test-runs/20141105004833-ccl-1.9-r15759-f96-macosx-x64/fasl/ql/dists/quicklisp/software/lisp-zmq-1.5.0/src/grovel.c" Output was: /Users/pnathan/cl-test-grid/work-dir/agent/test-runs/20141105004833-ccl-1.9-r15759-f96-macosx-x64/fasl/ql/dists/quicklisp/software/lisp-zmq-1.5.0/src/grovel.c:6:17: error: zmq.h: No such file or directory /Users/pnathan/cl-test-grid/work-dir/agent/test-runs/20141105004833-ccl-1.9-r15759-f96-macosx-x64/fasl/ql/dists/quicklisp/software/lisp-zmq-1.5.0/src/grovel.c: In function ‘main’: /Users/pnathan/cl-test-grid/work-dir/agent/test-runs/20141105004833-ccl-1.9-r15759-f96-macosx-x64/fasl/ql/dists/quicklisp/software/lisp-zmq-1.5.0/src/grovel.c:881: error: ‘zmq_msg_t’ undeclared (first use in this function) /Users/pnathan/cl-test-grid/work-dir/agent/test-runs/20141105004833-ccl-1.9-r15759-f96-macosx-x64/fasl/ql/dists/quicklisp/software/lisp-zmq-1.5.0/src/grovel.c:881: error: (Each undeclared identifier is reported only once /Users/pnathan/cl-test-grid/work-dir/agent/test-runs/20141105004833-ccl-1.9-r15759-f96-macosx-x64/fasl/ql/dists/quicklisp/software/lisp-zmq-1.5.0/src/grovel.c:881: error: for each function it appears in.) /Users/pnathan/cl-test-grid/work-dir/agent/test-runs/20141105004833-ccl-1.9-r15759-f96-macosx-x64/fasl/ql/dists/quicklisp/software/lisp-zmq-1.5.0/src/grovel.c:892: error: ‘zmq_pollitem_t’ undeclared (first use in this function) /Users/pnathan/cl-test-grid/work-dir/agent/test-runs/20141105004833-ccl-1.9-r15759-f96-macosx-x64/fasl/ql/dists/quicklisp/software/lisp-zmq-1.5.0/src/grovel.c:897: error: expected expression before ‘)’ token /Users/pnathan/cl-test-grid/work-dir/agent/test-runs/20141105004833-ccl-1.9-r15759-f96-macosx-x64/fasl/ql/dists/quicklisp/software/lisp-zmq-1.5.0/src/grovel.c:901: error: expected ‘;’ before ‘slot_signed_p_struct’ /Users/pnathan/cl-test-grid/work-dir/agent/test-runs/20141105004833-ccl-1.9-r15759-f96-macosx-x64/fasl/ql/dists/quicklisp/software/lisp-zmq-1.5.0/src/grovel.c:901: error: ‘slot_signed_p_struct’ undeclared (first use in this function) /Users/pnathan/cl-test-grid/work-dir/agent/test-runs/20141105004833-ccl-1.9-r15759-f96-macosx-x64/fasl/ql/dists/quicklisp/software/lisp-zmq-1.5.0/src/grovel.c:902: error: expected expression before ‘)’ token /Users/pnathan/cl-test-grid/work-dir/agent/test-runs/20141105004833-ccl-1.9-r15759-f96-macosx-x64/fasl/ql/dists/quicklisp/software/lisp-zmq-1.5.0/src/grovel.c:903: error: expected expression before ‘)’ token /Users/pnathan/cl-test-grid/work-dir/agent/test-runs/20141105004833-ccl-1.9-r15759-f96-macosx-x64/fasl/ql/dists/quicklisp/software/lisp-zmq-1.5.0/src/grovel.c:908: error: expected expression before ‘)’ token /Users/pnathan/cl-test-grid/work-dir/agent/test-runs/20141105004833-ccl-1.9-r15759-f96-macosx-x64/fasl/ql/dists/quicklisp/software/lisp-zmq-1.5.0/src/grovel.c:913: error: expected expression before ‘)’ token
(LOAD m2cl FAIL) ffi-grovel, CFFI-GROVEL:GROVEL-ERROR : External process exited with code 1. Command was: "cc" "-m64" "-I" "/opt/local/include/" "-I/Users/pnathan/cl-test-grid/work-dir/agent/quicklisp/dists/quicklisp/software/cffi_0.14.0/" "-o" "/Users/pnathan/cl-test-grid/work-dir/agent/test-runs/20141105004833-ccl-1.9-r15759-f96-macosx-x64/fasl/ql/dists/quicklisp/software/lisp-zmq-1.5.0/src/grovel" "/Users/pnathan/cl-test-grid/work-dir/agent/test-runs/20141105004833-ccl-1.9-r15759-f96-macosx-x64/fasl/ql/dists/quicklisp/software/lisp-zmq-1.5.0/src/grovel.c" Output was: /Users/pnathan/cl-test-grid/work-dir/agent/test-runs/20141105004833-ccl-1.9-r15759-f96-macosx-x64/fasl/ql/dists/quicklisp/software/lisp-zmq-1.5.0/src/grovel.c:6:17: error: zmq.h: No such file or directory /Users/pnathan/cl-test-grid/work-dir/agent/test-runs/20141105004833-ccl-1.9-r15759-f96-macosx-x64/fasl/ql/dists/quicklisp/software/lisp-zmq-1.5.0/src/grovel.c: In function ‘main’: /Users/pnathan/cl-test-grid/work-dir/agent/test-runs/20141105004833-ccl-1.9-r15759-f96-macosx-x64/fasl/ql/dists/quicklisp/software/lisp-zmq-1.5.0/src/grovel.c:881: error: ‘zmq_msg_t’ undeclared (first use in this function) /Users/pnathan/cl-test-grid/work-dir/agent/test-runs/20141105004833-ccl-1.9-r15759-f96-macosx-x64/fasl/ql/dists/quicklisp/software/lisp-zmq-1.5.0/src/grovel.c:881: error: (Each undeclared identifier is reported only once /Users/pnathan/cl-test-grid/work-dir/agent/test-runs/20141105004833-ccl-1.9-r15759-f96-macosx-x64/fasl/ql/dists/quicklisp/software/lisp-zmq-1.5.0/src/grovel.c:881: error: for each function it appears in.) /Users/pnathan/cl-test-grid/work-dir/agent/test-runs/20141105004833-ccl-1.9-r15759-f96-macosx-x64/fasl/ql/dists/quicklisp/software/lisp-zmq-1.5.0/src/grovel.c:892: error: ‘zmq_pollitem_t’ undeclared (first use in this function) /Users/pnathan/cl-test-grid/work-dir/agent/test-runs/20141105004833-ccl-1.9-r15759-f96-macosx-x64/fasl/ql/dists/quicklisp/software/lisp-zmq-1.5.0/src/grovel.c:897: error: expected expression before ‘)’ token /Users/pnathan/cl-test-grid/work-dir/agent/test-runs/20141105004833-ccl-1.9-r15759-f96-macosx-x64/fasl/ql/dists/quicklisp/software/lisp-zmq-1.5.0/src/grovel.c:901: error: expected ‘;’ before ‘slot_signed_p_struct’ /Users/pnathan/cl-test-grid/work-dir/agent/test-runs/20141105004833-ccl-1.9-r15759-f96-macosx-x64/fasl/ql/dists/quicklisp/software/lisp-zmq-1.5.0/src/grovel.c:901: error: ‘slot_signed_p_struct’ undeclared (first use in this function) /Users/pnathan/cl-test-grid/work-dir/agent/test-runs/20141105004833-ccl-1.9-r15759-f96-macosx-x64/fasl/ql/dists/quicklisp/software/lisp-zmq-1.5.0/src/grovel.c:902: error: expected expression before ‘)’ token /Users/pnathan/cl-test-grid/work-dir/agent/test-runs/20141105004833-ccl-1.9-r15759-f96-macosx-x64/fasl/ql/dists/quicklisp/software/lisp-zmq-1.5.0/src/grovel.c:903: error: expected expression before ‘)’ token /Users/pnathan/cl-test-grid/work-dir/agent/test-runs/20141105004833-ccl-1.9-r15759-f96-macosx-x64/fasl/ql/dists/quicklisp/software/lisp-zmq-1.5.0/src/grovel.c:908: error: expected expression before ‘)’ token /Users/pnathan/cl-test-grid/work-dir/agent/test-runs/20141105004833-ccl-1.9-r15759-f96-macosx-x64/fasl/ql/dists/quicklisp/software/lisp-zmq-1.5.0/src/grovel.c:913: error: expected expression before ‘)’ token
clisp-2.49-unix-i386
(LOAD m2cl-test FAIL) ffi, ASDF:LOAD-SYSTEM-DEFINITION-ERROR : Error while trying to load definition for system zmq from pathname /Users/pnathan/cl-test-grid/work-dir/agent/quicklisp/dists/quicklisp/software/lisp-zmq-1.5.0/zmq.asd: CFFI requires CLISP compiled with dynamic FFI support.
(LOAD m2cl-examples FAIL) ffi, ASDF:LOAD-SYSTEM-DEFINITION-ERROR : Error while trying to load definition for system zmq from pathname /Users/pnathan/cl-test-grid/work-dir/agent/quicklisp/dists/quicklisp/software/lisp-zmq-1.5.0/zmq.asd: CFFI requires CLISP compiled with dynamic FFI support.
(LOAD m2cl FAIL) ffi, ASDF:LOAD-SYSTEM-DEFINITION-ERROR : Error while trying to load definition for system zmq from pathname /Users/pnathan/cl-test-grid/work-dir/agent/quicklisp/dists/quicklisp/software/lisp-zmq-1.5.0/zmq.asd: CFFI requires CLISP compiled with dynamic FFI support.
clisp-2.49-unix-x64
(LOAD m2cl-test FAIL) ffi-grovel, CFFI-GROVEL:GROVEL-ERROR : External process exited with code 1. Command was: "cc" "-m64" "-I/home/hijarian/systems/cl-test-grid/work-dir/agent/quicklisp/dists/quicklisp/software/cffi_0.14.0/" "-o" "/home/hijarian/systems/cl-test-grid/work-dir/agent/test-runs/20141119082304-clisp-2.49-unix-x64/fasl/ql/dists/quicklisp/software/lisp-zmq-1.5.0/src/grovel" "/home/hijarian/systems/cl-test-grid/work-dir/agent/test-runs/20141119082304-clisp-2.49-unix-x64/fasl/ql/dists/quicklisp/software/lisp-zmq-1.5.0/src/grovel.c" Output was: <see above>
(LOAD m2cl-examples FAIL) ffi-grovel, CFFI-GROVEL:GROVEL-ERROR : External process exited with code 1. Command was: "cc" "-m64" "-I/home/hijarian/systems/cl-test-grid/work-dir/agent/quicklisp/dists/quicklisp/software/cffi_0.14.0/" "-o" "/home/hijarian/systems/cl-test-grid/work-dir/agent/test-runs/20141119082304-clisp-2.49-unix-x64/fasl/ql/dists/quicklisp/software/lisp-zmq-1.5.0/src/grovel" "/home/hijarian/systems/cl-test-grid/work-dir/agent/test-runs/20141119082304-clisp-2.49-unix-x64/fasl/ql/dists/quicklisp/software/lisp-zmq-1.5.0/src/grovel.c" Output was: <see above>
(LOAD m2cl FAIL) ffi-grovel, CFFI-GROVEL:GROVEL-ERROR : External process exited with code 1. Command was: "cc" "-m64" "-I/home/hijarian/systems/cl-test-grid/work-dir/agent/quicklisp/dists/quicklisp/software/cffi_0.14.0/" "-o" "/home/hijarian/systems/cl-test-grid/work-dir/agent/test-runs/20141119082304-clisp-2.49-unix-x64/fasl/ql/dists/quicklisp/software/lisp-zmq-1.5.0/src/grovel" "/home/hijarian/systems/cl-test-grid/work-dir/agent/test-runs/20141119082304-clisp-2.49-unix-x64/fasl/ql/dists/quicklisp/software/lisp-zmq-1.5.0/src/grovel.c" Output was: <see above>
(LOAD m2cl-test FAIL) ffi-grovel, CFFI-GROVEL:GROVEL-ERROR : External process exited with code 1. Command was: "cc" "-m64" "-I/home/hijarian/systems/cl-test-grid/work-dir/agent/quicklisp/dists/quicklisp/software/cffi_0.14.0/" "-o" "/home/hijarian/systems/cl-test-grid/work-dir/agent/test-runs/20141007051340-clisp-2.49-unix-x64/fasl/ql/dists/quicklisp/software/lisp-zmq-1.5.0/src/grovel" "/home/hijarian/systems/cl-test-grid/work-dir/agent/test-runs/20141007051340-clisp-2.49-unix-x64/fasl/ql/dists/quicklisp/software/lisp-zmq-1.5.0/src/grovel.c" Output was: <see above>
(LOAD m2cl-examples FAIL) ffi-grovel, CFFI-GROVEL:GROVEL-ERROR : External process exited with code 1. Command was: "cc" "-m64" "-I/home/hijarian/systems/cl-test-grid/work-dir/agent/quicklisp/dists/quicklisp/software/cffi_0.14.0/" "-o" "/home/hijarian/systems/cl-test-grid/work-dir/agent/test-runs/20141007051340-clisp-2.49-unix-x64/fasl/ql/dists/quicklisp/software/lisp-zmq-1.5.0/src/grovel" "/home/hijarian/systems/cl-test-grid/work-dir/agent/test-runs/20141007051340-clisp-2.49-unix-x64/fasl/ql/dists/quicklisp/software/lisp-zmq-1.5.0/src/grovel.c" Output was: <see above>
(LOAD m2cl FAIL) ffi-grovel, CFFI-GROVEL:GROVEL-ERROR : External process exited with code 1. Command was: "cc" "-m64" "-I/home/hijarian/systems/cl-test-grid/work-dir/agent/quicklisp/dists/quicklisp/software/cffi_0.14.0/" "-o" "/home/hijarian/systems/cl-test-grid/work-dir/agent/test-runs/20141007051340-clisp-2.49-unix-x64/fasl/ql/dists/quicklisp/software/lisp-zmq-1.5.0/src/grovel" "/home/hijarian/systems/cl-test-grid/work-dir/agent/test-runs/20141007051340-clisp-2.49-unix-x64/fasl/ql/dists/quicklisp/software/lisp-zmq-1.5.0/src/grovel.c" Output was: <see above>
clisp-2.49-unix-x86
(LOAD m2cl-test FAIL) ffi-grovel, CFFI-GROVEL:GROVEL-ERROR : External process exited with code 1. Command was: "cc" "-m32" "-I/home/testgrid/cl-test-grid/work-dir/agent/quicklisp/dists/quicklisp/software/cffi_0.14.0/" "-o" "/home/testgrid/cl-test-grid/work-dir/agent/test-runs/20141116021855-clisp-2.49-unix-x86/fasl/ql/dists/quicklisp/software/lisp-zmq-1.5.0/src/grovel" "/home/testgrid/cl-test-grid/work-dir/agent/test-runs/20141116021855-clisp-2.49-unix-x86/fasl/ql/dists/quicklisp/software/lisp-zmq-1.5.0/src/grovel.c" Output was: <see above>
(LOAD m2cl-examples FAIL) ffi-grovel, CFFI-GROVEL:GROVEL-ERROR : External process exited with code 1. Command was: "cc" "-m32" "-I/home/testgrid/cl-test-grid/work-dir/agent/quicklisp/dists/quicklisp/software/cffi_0.14.0/" "-o" "/home/testgrid/cl-test-grid/work-dir/agent/test-runs/20141116021855-clisp-2.49-unix-x86/fasl/ql/dists/quicklisp/software/lisp-zmq-1.5.0/src/grovel" "/home/testgrid/cl-test-grid/work-dir/agent/test-runs/20141116021855-clisp-2.49-unix-x86/fasl/ql/dists/quicklisp/software/lisp-zmq-1.5.0/src/grovel.c" Output was: <see above>
(LOAD m2cl FAIL) ffi-grovel, CFFI-GROVEL:GROVEL-ERROR : External process exited with code 1. Command was: "cc" "-m32" "-I/home/testgrid/cl-test-grid/work-dir/agent/quicklisp/dists/quicklisp/software/cffi_0.14.0/" "-o" "/home/testgrid/cl-test-grid/work-dir/agent/test-runs/20141116021855-clisp-2.49-unix-x86/fasl/ql/dists/quicklisp/software/lisp-zmq-1.5.0/src/grovel" "/home/testgrid/cl-test-grid/work-dir/agent/test-runs/20141116021855-clisp-2.49-unix-x86/fasl/ql/dists/quicklisp/software/lisp-zmq-1.5.0/src/grovel.c" Output was: <see above>
(LOAD m2cl-test FAIL) ffi-grovel, CFFI-GROVEL:GROVEL-ERROR : External process exited with code 1. Command was: "cc" "-m32" "-I/home/testgrid/cl-test-grid/work-dir/agent/quicklisp/dists/quicklisp/software/cffi_0.14.0/" "-o" "/home/testgrid/cl-test-grid/work-dir/agent/test-runs/20141008165628-clisp-2.49-unix-x86/fasl/ql/dists/quicklisp/software/lisp-zmq-1.5.0/src/grovel" "/home/testgrid/cl-test-grid/work-dir/agent/test-runs/20141008165628-clisp-2.49-unix-x86/fasl/ql/dists/quicklisp/software/lisp-zmq-1.5.0/src/grovel.c" Output was: <see above>
(LOAD m2cl-examples FAIL) ffi-grovel, CFFI-GROVEL:GROVEL-ERROR : External process exited with code 1. Command was: "cc" "-m32" "-I/home/testgrid/cl-test-grid/work-dir/agent/quicklisp/dists/quicklisp/software/cffi_0.14.0/" "-o" "/home/testgrid/cl-test-grid/work-dir/agent/test-runs/20141008165628-clisp-2.49-unix-x86/fasl/ql/dists/quicklisp/software/lisp-zmq-1.5.0/src/grovel" "/home/testgrid/cl-test-grid/work-dir/agent/test-runs/20141008165628-clisp-2.49-unix-x86/fasl/ql/dists/quicklisp/software/lisp-zmq-1.5.0/src/grovel.c" Output was: <see above>
(LOAD m2cl FAIL) ffi-grovel, CFFI-GROVEL:GROVEL-ERROR : External process exited with code 1. Command was: "cc" "-m32" "-I/home/testgrid/cl-test-grid/work-dir/agent/quicklisp/dists/quicklisp/software/cffi_0.14.0/" "-o" "/home/testgrid/cl-test-grid/work-dir/agent/test-runs/20141008165628-clisp-2.49-unix-x86/fasl/ql/dists/quicklisp/software/lisp-zmq-1.5.0/src/grovel" "/home/testgrid/cl-test-grid/work-dir/agent/test-runs/20141008165628-clisp-2.49-unix-x86/fasl/ql/dists/quicklisp/software/lisp-zmq-1.5.0/src/grovel.c" Output was: <see above>
cmu-snapshot-2013-04__20d_unicode_-linux-x86
(LOAD m2cl-test FAIL) ffi-grovel, CFFI-GROVEL:GROVEL-ERROR : Error in function CFFI-GROVEL:GROVEL-ERROR: External process exited with code 1. Command was: "cc" "-m32" "-I/home/testgrid/cl-test-grid/work-dir/agent/quicklisp/dists/quicklisp/software/cffi_0.14.0/" "-o" "/home/testgrid/cl-test-grid/work-dir/agent/test-runs/20141115185927-cmu-snapshot-2013-04__20d_unicode_-linux-x86/fasl/ql/dists/quicklisp/software/lisp-zmq-1.5.0/src/grovel" "/home/testgrid/cl-test-grid/work-dir/agent/test-runs/20141115185927-cmu-snapshot-2013-04__20d_unicode_-linux-x86/fasl/ql/dists/quicklisp/software/lisp-zmq-1.5.0/src/grovel.c" Output was: /home/testgrid/cl-test-grid/work-dir/agent/test-runs/20141115185927-cmu-snapshot-2013-04__20d_unicode_-linux-x86/fasl/ql/dists/quicklisp/software/lisp-zmq-1.5.0/src/grovel.c:6:17: fatal error: zmq.h: No such file or directory compilation terminated.
(LOAD m2cl-examples FAIL) ffi-grovel, CFFI-GROVEL:GROVEL-ERROR : Error in function CFFI-GROVEL:GROVEL-ERROR: External process exited with code 1. Command was: "cc" "-m32" "-I/home/testgrid/cl-test-grid/work-dir/agent/quicklisp/dists/quicklisp/software/cffi_0.14.0/" "-o" "/home/testgrid/cl-test-grid/work-dir/agent/test-runs/20141115185927-cmu-snapshot-2013-04__20d_unicode_-linux-x86/fasl/ql/dists/quicklisp/software/lisp-zmq-1.5.0/src/grovel" "/home/testgrid/cl-test-grid/work-dir/agent/test-runs/20141115185927-cmu-snapshot-2013-04__20d_unicode_-linux-x86/fasl/ql/dists/quicklisp/software/lisp-zmq-1.5.0/src/grovel.c" Output was: /home/testgrid/cl-test-grid/work-dir/agent/test-runs/20141115185927-cmu-snapshot-2013-04__20d_unicode_-linux-x86/fasl/ql/dists/quicklisp/software/lisp-zmq-1.5.0/src/grovel.c:6:17: fatal error: zmq.h: No such file or directory compilation terminated.
(LOAD m2cl FAIL) ffi-grovel, CFFI-GROVEL:GROVEL-ERROR : Error in function CFFI-GROVEL:GROVEL-ERROR: External process exited with code 1. Command was: "cc" "-m32" "-I/home/testgrid/cl-test-grid/work-dir/agent/quicklisp/dists/quicklisp/software/cffi_0.14.0/" "-o" "/home/testgrid/cl-test-grid/work-dir/agent/test-runs/20141115185927-cmu-snapshot-2013-04__20d_unicode_-linux-x86/fasl/ql/dists/quicklisp/software/lisp-zmq-1.5.0/src/grovel" "/home/testgrid/cl-test-grid/work-dir/agent/test-runs/20141115185927-cmu-snapshot-2013-04__20d_unicode_-linux-x86/fasl/ql/dists/quicklisp/software/lisp-zmq-1.5.0/src/grovel.c" Output was: /home/testgrid/cl-test-grid/work-dir/agent/test-runs/20141115185927-cmu-snapshot-2013-04__20d_unicode_-linux-x86/fasl/ql/dists/quicklisp/software/lisp-zmq-1.5.0/src/grovel.c:6:17: fatal error: zmq.h: No such file or directory compilation terminated.
(LOAD m2cl-test FAIL) ffi-grovel, CFFI-GROVEL:GROVEL-ERROR : Error in function CFFI-GROVEL:GROVEL-ERROR: External process exited with code 1. Command was: "cc" "-m32" "-I/home/testgrid/cl-test-grid/work-dir/agent/quicklisp/dists/quicklisp/software/cffi_0.14.0/" "-o" "/home/testgrid/cl-test-grid/work-dir/agent/test-runs/20141008085755-cmu-snapshot-2013-04__20d_unicode_-linux-x86/fasl/ql/dists/quicklisp/software/lisp-zmq-1.5.0/src/grovel" "/home/testgrid/cl-test-grid/work-dir/agent/test-runs/20141008085755-cmu-snapshot-2013-04__20d_unicode_-linux-x86/fasl/ql/dists/quicklisp/software/lisp-zmq-1.5.0/src/grovel.c" Output was: /home/testgrid/cl-test-grid/work-dir/agent/test-runs/20141008085755-cmu-snapshot-2013-04__20d_unicode_-linux-x86/fasl/ql/dists/quicklisp/software/lisp-zmq-1.5.0/src/grovel.c:6:17: fatal error: zmq.h: No such file or directory compilation terminated.
(LOAD m2cl-examples FAIL) ffi-grovel, CFFI-GROVEL:GROVEL-ERROR : Error in function CFFI-GROVEL:GROVEL-ERROR: External process exited with code 1. Command was: "cc" "-m32" "-I/home/testgrid/cl-test-grid/work-dir/agent/quicklisp/dists/quicklisp/software/cffi_0.14.0/" "-o" "/home/testgrid/cl-test-grid/work-dir/agent/test-runs/20141008085755-cmu-snapshot-2013-04__20d_unicode_-linux-x86/fasl/ql/dists/quicklisp/software/lisp-zmq-1.5.0/src/grovel" "/home/testgrid/cl-test-grid/work-dir/agent/test-runs/20141008085755-cmu-snapshot-2013-04__20d_unicode_-linux-x86/fasl/ql/dists/quicklisp/software/lisp-zmq-1.5.0/src/grovel.c" Output was: /home/testgrid/cl-test-grid/work-dir/agent/test-runs/20141008085755-cmu-snapshot-2013-04__20d_unicode_-linux-x86/fasl/ql/dists/quicklisp/software/lisp-zmq-1.5.0/src/grovel.c:6:17: fatal error: zmq.h: No such file or directory compilation terminated.
(LOAD m2cl FAIL) ffi-grovel, CFFI-GROVEL:GROVEL-ERROR : Error in function CFFI-GROVEL:GROVEL-ERROR: External process exited with code 1. Command was: "cc" "-m32" "-I/home/testgrid/cl-test-grid/work-dir/agent/quicklisp/dists/quicklisp/software/cffi_0.14.0/" "-o" "/home/testgrid/cl-test-grid/work-dir/agent/test-runs/20141008085755-cmu-snapshot-2013-04__20d_unicode_-linux-x86/fasl/ql/dists/quicklisp/software/lisp-zmq-1.5.0/src/grovel" "/home/testgrid/cl-test-grid/work-dir/agent/test-runs/20141008085755-cmu-snapshot-2013-04__20d_unicode_-linux-x86/fasl/ql/dists/quicklisp/software/lisp-zmq-1.5.0/src/grovel.c" Output was: /home/testgrid/cl-test-grid/work-dir/agent/test-runs/20141008085755-cmu-snapshot-2013-04__20d_unicode_-linux-x86/fasl/ql/dists/quicklisp/software/lisp-zmq-1.5.0/src/grovel.c:6:17: fatal error: zmq.h: No such file or directory compilation terminated.
cmu-snapshot-2014-01__20e_unicode_-linux-x86
(LOAD m2cl-test FAIL) ffi-grovel, CFFI-GROVEL:GROVEL-ERROR : Error in function CFFI-GROVEL:GROVEL-ERROR: External process exited with code 1. Command was: "cc" "-m32" "-I/home/testgrid/cl-test-grid/work-dir/agent/quicklisp/dists/quicklisp/software/cffi_0.14.0/" "-o" "/home/testgrid/cl-test-grid/work-dir/agent/test-runs/20141115212908-cmu-snapshot-2014-01__20e_unicode_-linux-x86/fasl/ql/dists/quicklisp/software/lisp-zmq-1.5.0/src/grovel" "/home/testgrid/cl-test-grid/work-dir/agent/test-runs/20141115212908-cmu-snapshot-2014-01__20e_unicode_-linux-x86/fasl/ql/dists/quicklisp/software/lisp-zmq-1.5.0/src/grovel.c" Output was: /home/testgrid/cl-test-grid/work-dir/agent/test-runs/20141115212908-cmu-snapshot-2014-01__20e_unicode_-linux-x86/fasl/ql/dists/quicklisp/software/lisp-zmq-1.5.0/src/grovel.c:6:17: fatal error: zmq.h: No such file or directory compilation terminated.
(LOAD m2cl-examples FAIL) ffi-grovel, CFFI-GROVEL:GROVEL-ERROR : Error in function CFFI-GROVEL:GROVEL-ERROR: External process exited with code 1. Command was: "cc" "-m32" "-I/home/testgrid/cl-test-grid/work-dir/agent/quicklisp/dists/quicklisp/software/cffi_0.14.0/" "-o" "/home/testgrid/cl-test-grid/work-dir/agent/test-runs/20141115212908-cmu-snapshot-2014-01__20e_unicode_-linux-x86/fasl/ql/dists/quicklisp/software/lisp-zmq-1.5.0/src/grovel" "/home/testgrid/cl-test-grid/work-dir/agent/test-runs/20141115212908-cmu-snapshot-2014-01__20e_unicode_-linux-x86/fasl/ql/dists/quicklisp/software/lisp-zmq-1.5.0/src/grovel.c" Output was: /home/testgrid/cl-test-grid/work-dir/agent/test-runs/20141115212908-cmu-snapshot-2014-01__20e_unicode_-linux-x86/fasl/ql/dists/quicklisp/software/lisp-zmq-1.5.0/src/grovel.c:6:17: fatal error: zmq.h: No such file or directory compilation terminated.
(LOAD m2cl FAIL) ffi-grovel, CFFI-GROVEL:GROVEL-ERROR : Error in function CFFI-GROVEL:GROVEL-ERROR: External process exited with code 1. Command was: "cc" "-m32" "-I/home/testgrid/cl-test-grid/work-dir/agent/quicklisp/dists/quicklisp/software/cffi_0.14.0/" "-o" "/home/testgrid/cl-test-grid/work-dir/agent/test-runs/20141115212908-cmu-snapshot-2014-01__20e_unicode_-linux-x86/fasl/ql/dists/quicklisp/software/lisp-zmq-1.5.0/src/grovel" "/home/testgrid/cl-test-grid/work-dir/agent/test-runs/20141115212908-cmu-snapshot-2014-01__20e_unicode_-linux-x86/fasl/ql/dists/quicklisp/software/lisp-zmq-1.5.0/src/grovel.c" Output was: /home/testgrid/cl-test-grid/work-dir/agent/test-runs/20141115212908-cmu-snapshot-2014-01__20e_unicode_-linux-x86/fasl/ql/dists/quicklisp/software/lisp-zmq-1.5.0/src/grovel.c:6:17: fatal error: zmq.h: No such file or directory compilation terminated.
(LOAD m2cl-test FAIL) ffi-grovel, CFFI-GROVEL:GROVEL-ERROR : Error in function CFFI-GROVEL:GROVEL-ERROR: External process exited with code 1. Command was: "cc" "-m32" "-I/home/testgrid/cl-test-grid/work-dir/agent/quicklisp/dists/quicklisp/software/cffi_0.14.0/" "-o" "/home/testgrid/cl-test-grid/work-dir/agent/test-runs/20141008114223-cmu-snapshot-2014-01__20e_unicode_-linux-x86/fasl/ql/dists/quicklisp/software/lisp-zmq-1.5.0/src/grovel" "/home/testgrid/cl-test-grid/work-dir/agent/test-runs/20141008114223-cmu-snapshot-2014-01__20e_unicode_-linux-x86/fasl/ql/dists/quicklisp/software/lisp-zmq-1.5.0/src/grovel.c" Output was: /home/testgrid/cl-test-grid/work-dir/agent/test-runs/20141008114223-cmu-snapshot-2014-01__20e_unicode_-linux-x86/fasl/ql/dists/quicklisp/software/lisp-zmq-1.5.0/src/grovel.c:6:17: fatal error: zmq.h: No such file or directory compilation terminated.
(LOAD m2cl-examples FAIL) ffi-grovel, CFFI-GROVEL:GROVEL-ERROR : Error in function CFFI-GROVEL:GROVEL-ERROR: External process exited with code 1. Command was: "cc" "-m32" "-I/home/testgrid/cl-test-grid/work-dir/agent/quicklisp/dists/quicklisp/software/cffi_0.14.0/" "-o" "/home/testgrid/cl-test-grid/work-dir/agent/test-runs/20141008114223-cmu-snapshot-2014-01__20e_unicode_-linux-x86/fasl/ql/dists/quicklisp/software/lisp-zmq-1.5.0/src/grovel" "/home/testgrid/cl-test-grid/work-dir/agent/test-runs/20141008114223-cmu-snapshot-2014-01__20e_unicode_-linux-x86/fasl/ql/dists/quicklisp/software/lisp-zmq-1.5.0/src/grovel.c" Output was: /home/testgrid/cl-test-grid/work-dir/agent/test-runs/20141008114223-cmu-snapshot-2014-01__20e_unicode_-linux-x86/fasl/ql/dists/quicklisp/software/lisp-zmq-1.5.0/src/grovel.c:6:17: fatal error: zmq.h: No such file or directory compilation terminated.
(LOAD m2cl FAIL) ffi-grovel, CFFI-GROVEL:GROVEL-ERROR : Error in function CFFI-GROVEL:GROVEL-ERROR: External process exited with code 1. Command was: "cc" "-m32" "-I/home/testgrid/cl-test-grid/work-dir/agent/quicklisp/dists/quicklisp/software/cffi_0.14.0/" "-o" "/home/testgrid/cl-test-grid/work-dir/agent/test-runs/20141008114223-cmu-snapshot-2014-01__20e_unicode_-linux-x86/fasl/ql/dists/quicklisp/software/lisp-zmq-1.5.0/src/grovel" "/home/testgrid/cl-test-grid/work-dir/agent/test-runs/20141008114223-cmu-snapshot-2014-01__20e_unicode_-linux-x86/fasl/ql/dists/quicklisp/software/lisp-zmq-1.5.0/src/grovel.c" Output was: /home/testgrid/cl-test-grid/work-dir/agent/test-runs/20141008114223-cmu-snapshot-2014-01__20e_unicode_-linux-x86/fasl/ql/dists/quicklisp/software/lisp-zmq-1.5.0/src/grovel.c:6:17: fatal error: zmq.h: No such file or directory compilation terminated.
cmu-snapshot-2014-05-dirty__20e_unicode_-linux-x86
(LOAD m2cl-test FAIL) ffi-grovel, CFFI-GROVEL:GROVEL-ERROR : Error in function CFFI-GROVEL:GROVEL-ERROR: External process exited with code 1. Command was: "cc" "-m32" "-I/home/testgrid/cl-test-grid/work-dir/agent/quicklisp/dists/quicklisp/software/cffi_0.14.0/" "-o" "/home/testgrid/cl-test-grid/work-dir/agent/test-runs/20141115235548-cmu-snapshot-2014-05-dirty__20e_unicode_-linux-x86/fasl/ql/dists/quicklisp/software/lisp-zmq-1.5.0/src/grovel" "/home/testgrid/cl-test-grid/work-dir/agent/test-runs/20141115235548-cmu-snapshot-2014-05-dirty__20e_unicode_-linux-x86/fasl/ql/dists/quicklisp/software/lisp-zmq-1.5.0/src/grovel.c" Output was: /home/testgrid/cl-test-grid/work-dir/agent/test-runs/20141115235548-cmu-snapshot-2014-05-dirty__20e_unicode_-linux-x86/fasl/ql/dists/quicklisp/software/lisp-zmq-1.5.0/src/grovel.c:6:17: fatal error: zmq.h: No such file or directory compilation terminated.
(LOAD m2cl-examples FAIL) ffi-grovel, CFFI-GROVEL:GROVEL-ERROR : Error in function CFFI-GROVEL:GROVEL-ERROR: External process exited with code 1. Command was: "cc" "-m32" "-I/home/testgrid/cl-test-grid/work-dir/agent/quicklisp/dists/quicklisp/software/cffi_0.14.0/" "-o" "/home/testgrid/cl-test-grid/work-dir/agent/test-runs/20141115235548-cmu-snapshot-2014-05-dirty__20e_unicode_-linux-x86/fasl/ql/dists/quicklisp/software/lisp-zmq-1.5.0/src/grovel" "/home/testgrid/cl-test-grid/work-dir/agent/test-runs/20141115235548-cmu-snapshot-2014-05-dirty__20e_unicode_-linux-x86/fasl/ql/dists/quicklisp/software/lisp-zmq-1.5.0/src/grovel.c" Output was: /home/testgrid/cl-test-grid/work-dir/agent/test-runs/20141115235548-cmu-snapshot-2014-05-dirty__20e_unicode_-linux-x86/fasl/ql/dists/quicklisp/software/lisp-zmq-1.5.0/src/grovel.c:6:17: fatal error: zmq.h: No such file or directory compilation terminated.
(LOAD m2cl FAIL) ffi-grovel, CFFI-GROVEL:GROVEL-ERROR : Error in function CFFI-GROVEL:GROVEL-ERROR: External process exited with code 1. Command was: "cc" "-m32" "-I/home/testgrid/cl-test-grid/work-dir/agent/quicklisp/dists/quicklisp/software/cffi_0.14.0/" "-o" "/home/testgrid/cl-test-grid/work-dir/agent/test-runs/20141115235548-cmu-snapshot-2014-05-dirty__20e_unicode_-linux-x86/fasl/ql/dists/quicklisp/software/lisp-zmq-1.5.0/src/grovel" "/home/testgrid/cl-test-grid/work-dir/agent/test-runs/20141115235548-cmu-snapshot-2014-05-dirty__20e_unicode_-linux-x86/fasl/ql/dists/quicklisp/software/lisp-zmq-1.5.0/src/grovel.c" Output was: /home/testgrid/cl-test-grid/work-dir/agent/test-runs/20141115235548-cmu-snapshot-2014-05-dirty__20e_unicode_-linux-x86/fasl/ql/dists/quicklisp/software/lisp-zmq-1.5.0/src/grovel.c:6:17: fatal error: zmq.h: No such file or directory compilation terminated.
(LOAD m2cl-test FAIL) ffi-grovel, CFFI-GROVEL:GROVEL-ERROR : Error in function CFFI-GROVEL:GROVEL-ERROR: External process exited with code 1. Command was: "cc" "-m32" "-I/home/testgrid/cl-test-grid/work-dir/agent/quicklisp/dists/quicklisp/software/cffi_0.14.0/" "-o" "/home/testgrid/cl-test-grid/work-dir/agent/test-runs/20141008142038-cmu-snapshot-2014-05-dirty__20e_unicode_-linux-x86/fasl/ql/dists/quicklisp/software/lisp-zmq-1.5.0/src/grovel" "/home/testgrid/cl-test-grid/work-dir/agent/test-runs/20141008142038-cmu-snapshot-2014-05-dirty__20e_unicode_-linux-x86/fasl/ql/dists/quicklisp/software/lisp-zmq-1.5.0/src/grovel.c" Output was: /home/testgrid/cl-test-grid/work-dir/agent/test-runs/20141008142038-cmu-snapshot-2014-05-dirty__20e_unicode_-linux-x86/fasl/ql/dists/quicklisp/software/lisp-zmq-1.5.0/src/grovel.c:6:17: fatal error: zmq.h: No such file or directory compilation terminated.
(LOAD m2cl-examples FAIL) ffi-grovel, CFFI-GROVEL:GROVEL-ERROR : Error in function CFFI-GROVEL:GROVEL-ERROR: External process exited with code 1. Command was: "cc" "-m32" "-I/home/testgrid/cl-test-grid/work-dir/agent/quicklisp/dists/quicklisp/software/cffi_0.14.0/" "-o" "/home/testgrid/cl-test-grid/work-dir/agent/test-runs/20141008142038-cmu-snapshot-2014-05-dirty__20e_unicode_-linux-x86/fasl/ql/dists/quicklisp/software/lisp-zmq-1.5.0/src/grovel" "/home/testgrid/cl-test-grid/work-dir/agent/test-runs/20141008142038-cmu-snapshot-2014-05-dirty__20e_unicode_-linux-x86/fasl/ql/dists/quicklisp/software/lisp-zmq-1.5.0/src/grovel.c" Output was: /home/testgrid/cl-test-grid/work-dir/agent/test-runs/20141008142038-cmu-snapshot-2014-05-dirty__20e_unicode_-linux-x86/fasl/ql/dists/quicklisp/software/lisp-zmq-1.5.0/src/grovel.c:6:17: fatal error: zmq.h: No such file or directory compilation terminated.
(LOAD m2cl FAIL) ffi-grovel, CFFI-GROVEL:GROVEL-ERROR : Error in function CFFI-GROVEL:GROVEL-ERROR: External process exited with code 1. Command was: "cc" "-m32" "-I/home/testgrid/cl-test-grid/work-dir/agent/quicklisp/dists/quicklisp/software/cffi_0.14.0/" "-o" "/home/testgrid/cl-test-grid/work-dir/agent/test-runs/20141008142038-cmu-snapshot-2014-05-dirty__20e_unicode_-linux-x86/fasl/ql/dists/quicklisp/software/lisp-zmq-1.5.0/src/grovel" "/home/testgrid/cl-test-grid/work-dir/agent/test-runs/20141008142038-cmu-snapshot-2014-05-dirty__20e_unicode_-linux-x86/fasl/ql/dists/quicklisp/software/lisp-zmq-1.5.0/src/grovel.c" Output was: /home/testgrid/cl-test-grid/work-dir/agent/test-runs/20141008142038-cmu-snapshot-2014-05-dirty__20e_unicode_-linux-x86/fasl/ql/dists/quicklisp/software/lisp-zmq-1.5.0/src/grovel.c:6:17: fatal error: zmq.h: No such file or directory compilation terminated.
ecl-13.5.1-76a84246-linux-x64-bytecode
(LOAD m2cl-test FAIL) ASDF/FIND-SYSTEM:LOAD-SYSTEM-DEFINITION-ERROR : Error while trying to load definition for system zmq from pathname /home/hijarian/systems/cl-test-grid/work-dir/agent/quicklisp/dists/quicklisp/software/lisp-zmq-1.5.0/zmq.asd: The variable C::*CC-FLAGS* is unbound.
(LOAD m2cl-examples FAIL) ASDF/FIND-SYSTEM:LOAD-SYSTEM-DEFINITION-ERROR : Error while trying to load definition for system zmq from pathname /home/hijarian/systems/cl-test-grid/work-dir/agent/quicklisp/dists/quicklisp/software/lisp-zmq-1.5.0/zmq.asd: The variable C::*CC-FLAGS* is unbound.
(LOAD m2cl FAIL) ASDF/FIND-SYSTEM:LOAD-SYSTEM-DEFINITION-ERROR : Error while trying to load definition for system zmq from pathname /home/hijarian/systems/cl-test-grid/work-dir/agent/quicklisp/dists/quicklisp/software/lisp-zmq-1.5.0/zmq.asd: The variable C::*CC-FLAGS* is unbound.
(LOAD m2cl-test FAIL) ASDF/FIND-SYSTEM:LOAD-SYSTEM-DEFINITION-ERROR : Error while trying to load definition for system zmq from pathname /home/hijarian/systems/cl-test-grid/work-dir/agent/quicklisp/dists/quicklisp/software/lisp-zmq-1.5.0/zmq.asd: The variable C::*CC-FLAGS* is unbound.
(LOAD m2cl-examples FAIL) ASDF/FIND-SYSTEM:LOAD-SYSTEM-DEFINITION-ERROR : Error while trying to load definition for system zmq from pathname /home/hijarian/systems/cl-test-grid/work-dir/agent/quicklisp/dists/quicklisp/software/lisp-zmq-1.5.0/zmq.asd: The variable C::*CC-FLAGS* is unbound.
(LOAD m2cl FAIL) ASDF/FIND-SYSTEM:LOAD-SYSTEM-DEFINITION-ERROR : Error while trying to load definition for system zmq from pathname /home/hijarian/systems/cl-test-grid/work-dir/agent/quicklisp/dists/quicklisp/software/lisp-zmq-1.5.0/zmq.asd: The variable C::*CC-FLAGS* is unbound.
ecl-13.5.1-76a84246-linux-x64-lisp-to-c
(LOAD m2cl-test FAIL) ffi-grovel, CFFI-GROVEL:GROVEL-ERROR : External process exited with code 1. Command was: "cc" "-m64" " -D_GNU_SOURCE -D_FILE_OFFSET_BITS=64 -g -O2 -fPIC -D_THREAD_SAFE -Dlinux" "-I/home/hijarian/systems/cl-test-grid/work-dir/agent/quicklisp/dists/quicklisp/software/cffi_0.14.0/" "-o" "/home/hijarian/systems/cl-test-grid/work-dir/agent/test-runs/20141119155044-ecl-13.5.1-76a84246-linux-x64-lisp-to-c/fasl/ql/dists/quicklisp/software/lisp-zmq-1.5.0/src/grovel" "/home/hijarian/systems/cl-test-grid/work-dir/agent/test-runs/20141119155044-ecl-13.5.1-76a84246-linux-x64-lisp-to-c/fasl/ql/dists/quicklisp/software/lisp-zmq-1.5.0/src/grovel.c" Output was: <see above>
(LOAD m2cl-examples FAIL) ffi-grovel, CFFI-GROVEL:GROVEL-ERROR : External process exited with code 1. Command was: "cc" "-m64" " -D_GNU_SOURCE -D_FILE_OFFSET_BITS=64 -g -O2 -fPIC -D_THREAD_SAFE -Dlinux" "-I/home/hijarian/systems/cl-test-grid/work-dir/agent/quicklisp/dists/quicklisp/software/cffi_0.14.0/" "-o" "/home/hijarian/systems/cl-test-grid/work-dir/agent/test-runs/20141119155044-ecl-13.5.1-76a84246-linux-x64-lisp-to-c/fasl/ql/dists/quicklisp/software/lisp-zmq-1.5.0/src/grovel" "/home/hijarian/systems/cl-test-grid/work-dir/agent/test-runs/20141119155044-ecl-13.5.1-76a84246-linux-x64-lisp-to-c/fasl/ql/dists/quicklisp/software/lisp-zmq-1.5.0/src/grovel.c" Output was: <see above>
(LOAD m2cl FAIL) ffi-grovel, CFFI-GROVEL:GROVEL-ERROR : External process exited with code 1. Command was: "cc" "-m64" " -D_GNU_SOURCE -D_FILE_OFFSET_BITS=64 -g -O2 -fPIC -D_THREAD_SAFE -Dlinux" "-I/home/hijarian/systems/cl-test-grid/work-dir/agent/quicklisp/dists/quicklisp/software/cffi_0.14.0/" "-o" "/home/hijarian/systems/cl-test-grid/work-dir/agent/test-runs/20141119155044-ecl-13.5.1-76a84246-linux-x64-lisp-to-c/fasl/ql/dists/quicklisp/software/lisp-zmq-1.5.0/src/grovel" "/home/hijarian/systems/cl-test-grid/work-dir/agent/test-runs/20141119155044-ecl-13.5.1-76a84246-linux-x64-lisp-to-c/fasl/ql/dists/quicklisp/software/lisp-zmq-1.5.0/src/grovel.c" Output was: <see above>
(LOAD m2cl-test FAIL) ffi-grovel, CFFI-GROVEL:GROVEL-ERROR : External process exited with code 1. Command was: "cc" "-m64" " -D_GNU_SOURCE -D_FILE_OFFSET_BITS=64 -g -O2 -fPIC -D_THREAD_SAFE -Dlinux" "-I/home/hijarian/systems/cl-test-grid/work-dir/agent/quicklisp/dists/quicklisp/software/cffi_0.14.0/" "-o" "/home/hijarian/systems/cl-test-grid/work-dir/agent/test-runs/20141007135809-ecl-13.5.1-76a84246-linux-x64-lisp-to-c/fasl/ql/dists/quicklisp/software/lisp-zmq-1.5.0/src/grovel" "/home/hijarian/systems/cl-test-grid/work-dir/agent/test-runs/20141007135809-ecl-13.5.1-76a84246-linux-x64-lisp-to-c/fasl/ql/dists/quicklisp/software/lisp-zmq-1.5.0/src/grovel.c" Output was: <see above>
(LOAD m2cl-examples FAIL) ffi-grovel, CFFI-GROVEL:GROVEL-ERROR : External process exited with code 1. Command was: "cc" "-m64" " -D_GNU_SOURCE -D_FILE_OFFSET_BITS=64 -g -O2 -fPIC -D_THREAD_SAFE -Dlinux" "-I/home/hijarian/systems/cl-test-grid/work-dir/agent/quicklisp/dists/quicklisp/software/cffi_0.14.0/" "-o" "/home/hijarian/systems/cl-test-grid/work-dir/agent/test-runs/20141007135809-ecl-13.5.1-76a84246-linux-x64-lisp-to-c/fasl/ql/dists/quicklisp/software/lisp-zmq-1.5.0/src/grovel" "/home/hijarian/systems/cl-test-grid/work-dir/agent/test-runs/20141007135809-ecl-13.5.1-76a84246-linux-x64-lisp-to-c/fasl/ql/dists/quicklisp/software/lisp-zmq-1.5.0/src/grovel.c" Output was: <see above>
(LOAD m2cl FAIL) ffi-grovel, CFFI-GROVEL:GROVEL-ERROR : External process exited with code 1. Command was: "cc" "-m64" " -D_GNU_SOURCE -D_FILE_OFFSET_BITS=64 -g -O2 -fPIC -D_THREAD_SAFE -Dlinux" "-I/home/hijarian/systems/cl-test-grid/work-dir/agent/quicklisp/dists/quicklisp/software/cffi_0.14.0/" "-o" "/home/hijarian/systems/cl-test-grid/work-dir/agent/test-runs/20141007135809-ecl-13.5.1-76a84246-linux-x64-lisp-to-c/fasl/ql/dists/quicklisp/software/lisp-zmq-1.5.0/src/grovel" "/home/hijarian/systems/cl-test-grid/work-dir/agent/test-runs/20141007135809-ecl-13.5.1-76a84246-linux-x64-lisp-to-c/fasl/ql/dists/quicklisp/software/lisp-zmq-1.5.0/src/grovel.c" Output was: <see above>
ecl-13.5.1-unknown-linux-i686-bytecode
(LOAD m2cl-test FAIL) ASDF/FIND-SYSTEM:LOAD-SYSTEM-DEFINITION-ERROR : Error while trying to load definition for system zmq from pathname /home/testgrid/cl-test-grid/work-dir/agent/quicklisp/dists/quicklisp/software/lisp-zmq-1.5.0/zmq.asd: The variable C::*CC-FLAGS* is unbound.
(LOAD m2cl-examples FAIL) ASDF/FIND-SYSTEM:LOAD-SYSTEM-DEFINITION-ERROR : Error while trying to load definition for system zmq from pathname /home/testgrid/cl-test-grid/work-dir/agent/quicklisp/dists/quicklisp/software/lisp-zmq-1.5.0/zmq.asd: The variable C::*CC-FLAGS* is unbound.
(LOAD m2cl FAIL) ASDF/FIND-SYSTEM:LOAD-SYSTEM-DEFINITION-ERROR : Error while trying to load definition for system zmq from pathname /home/testgrid/cl-test-grid/work-dir/agent/quicklisp/dists/quicklisp/software/lisp-zmq-1.5.0/zmq.asd: The variable C::*CC-FLAGS* is unbound.
(LOAD m2cl-test FAIL) ASDF/FIND-SYSTEM:LOAD-SYSTEM-DEFINITION-ERROR : Error while trying to load definition for system zmq from pathname /home/testgrid/cl-test-grid/work-dir/agent/quicklisp/dists/quicklisp/software/lisp-zmq-1.5.0/zmq.asd: The variable C::*CC-FLAGS* is unbound.
(LOAD m2cl-examples FAIL) ASDF/FIND-SYSTEM:LOAD-SYSTEM-DEFINITION-ERROR : Error while trying to load definition for system zmq from pathname /home/testgrid/cl-test-grid/work-dir/agent/quicklisp/dists/quicklisp/software/lisp-zmq-1.5.0/zmq.asd: The variable C::*CC-FLAGS* is unbound.
(LOAD m2cl FAIL) ASDF/FIND-SYSTEM:LOAD-SYSTEM-DEFINITION-ERROR : Error while trying to load definition for system zmq from pathname /home/testgrid/cl-test-grid/work-dir/agent/quicklisp/dists/quicklisp/software/lisp-zmq-1.5.0/zmq.asd: The variable C::*CC-FLAGS* is unbound.
ecl-13.5.1-unknown-linux-i686-lisp-to-c
(LOAD m2cl-test FAIL) ffi-grovel, CFFI-GROVEL:GROVEL-ERROR : External process exited with code 1. Command was: "cc" "-m32" " -D_GNU_SOURCE -D_FILE_OFFSET_BITS=64 -g -O2 -fPIC -D_GNU_SOURCE -D_FILE_OFFSET_BITS=64 -g -O2 -fPIC -D_THREAD_SAFE -Dlinux" "-I/home/testgrid/cl-test-grid/work-dir/agent/quicklisp/dists/quicklisp/software/cffi_0.14.0/" "-o" "/home/testgrid/cl-test-grid/work-dir/agent/test-runs/20141116081731-ecl-13.5.1-unknown-linux-i686-lisp-to-c/fasl/ql/dists/quicklisp/software/lisp-zmq-1.5.0/src/grovel" "/home/testgrid/cl-test-grid/work-dir/agent/test-runs/20141116081731-ecl-13.5.1-unknown-linux-i686-lisp-to-c/fasl/ql/dists/quicklisp/software/lisp-zmq-1.5.0/src/grovel.c" Output was: <see above>
(LOAD m2cl-examples FAIL) ffi-grovel, CFFI-GROVEL:GROVEL-ERROR : External process exited with code 1. Command was: "cc" "-m32" " -D_GNU_SOURCE -D_FILE_OFFSET_BITS=64 -g -O2 -fPIC -D_GNU_SOURCE -D_FILE_OFFSET_BITS=64 -g -O2 -fPIC -D_THREAD_SAFE -Dlinux" "-I/home/testgrid/cl-test-grid/work-dir/agent/quicklisp/dists/quicklisp/software/cffi_0.14.0/" "-o" "/home/testgrid/cl-test-grid/work-dir/agent/test-runs/20141116081731-ecl-13.5.1-unknown-linux-i686-lisp-to-c/fasl/ql/dists/quicklisp/software/lisp-zmq-1.5.0/src/grovel" "/home/testgrid/cl-test-grid/work-dir/agent/test-runs/20141116081731-ecl-13.5.1-unknown-linux-i686-lisp-to-c/fasl/ql/dists/quicklisp/software/lisp-zmq-1.5.0/src/grovel.c" Output was: <see above>
(LOAD m2cl FAIL) ffi-grovel, CFFI-GROVEL:GROVEL-ERROR : External process exited with code 1. Command was: "cc" "-m32" " -D_GNU_SOURCE -D_FILE_OFFSET_BITS=64 -g -O2 -fPIC -D_GNU_SOURCE -D_FILE_OFFSET_BITS=64 -g -O2 -fPIC -D_THREAD_SAFE -Dlinux" "-I/home/testgrid/cl-test-grid/work-dir/agent/quicklisp/dists/quicklisp/software/cffi_0.14.0/" "-o" "/home/testgrid/cl-test-grid/work-dir/agent/test-runs/20141116081731-ecl-13.5.1-unknown-linux-i686-lisp-to-c/fasl/ql/dists/quicklisp/software/lisp-zmq-1.5.0/src/grovel" "/home/testgrid/cl-test-grid/work-dir/agent/test-runs/20141116081731-ecl-13.5.1-unknown-linux-i686-lisp-to-c/fasl/ql/dists/quicklisp/software/lisp-zmq-1.5.0/src/grovel.c" Output was: <see above>
(LOAD m2cl-test FAIL) ffi-grovel, CFFI-GROVEL:GROVEL-ERROR : External process exited with code 1. Command was: "cc" "-m32" " -D_GNU_SOURCE -D_FILE_OFFSET_BITS=64 -g -O2 -fPIC -D_GNU_SOURCE -D_FILE_OFFSET_BITS=64 -g -O2 -fPIC -D_THREAD_SAFE -Dlinux" "-I/home/testgrid/cl-test-grid/work-dir/agent/quicklisp/dists/quicklisp/software/cffi_0.14.0/" "-o" "/home/testgrid/cl-test-grid/work-dir/agent/test-runs/20141103110324-ecl-13.5.1-unknown-linux-i686-lisp-to-c/fasl/ql/dists/quicklisp/software/lisp-zmq-1.5.0/src/grovel" "/home/testgrid/cl-test-grid/work-dir/agent/test-runs/20141103110324-ecl-13.5.1-unknown-linux-i686-lisp-to-c/fasl/ql/dists/quicklisp/software/lisp-zmq-1.5.0/src/grovel.c" Output was: <see above>
(LOAD m2cl-examples FAIL) ffi-grovel, CFFI-GROVEL:GROVEL-ERROR : External process exited with code 1. Command was: "cc" "-m32" " -D_GNU_SOURCE -D_FILE_OFFSET_BITS=64 -g -O2 -fPIC -D_GNU_SOURCE -D_FILE_OFFSET_BITS=64 -g -O2 -fPIC -D_THREAD_SAFE -Dlinux" "-I/home/testgrid/cl-test-grid/work-dir/agent/quicklisp/dists/quicklisp/software/cffi_0.14.0/" "-o" "/home/testgrid/cl-test-grid/work-dir/agent/test-runs/20141103110324-ecl-13.5.1-unknown-linux-i686-lisp-to-c/fasl/ql/dists/quicklisp/software/lisp-zmq-1.5.0/src/grovel" "/home/testgrid/cl-test-grid/work-dir/agent/test-runs/20141103110324-ecl-13.5.1-unknown-linux-i686-lisp-to-c/fasl/ql/dists/quicklisp/software/lisp-zmq-1.5.0/src/grovel.c" Output was: <see above>
(LOAD m2cl FAIL) ffi-grovel, CFFI-GROVEL:GROVEL-ERROR : External process exited with code 1. Command was: "cc" "-m32" " -D_GNU_SOURCE -D_FILE_OFFSET_BITS=64 -g -O2 -fPIC -D_GNU_SOURCE -D_FILE_OFFSET_BITS=64 -g -O2 -fPIC -D_THREAD_SAFE -Dlinux" "-I/home/testgrid/cl-test-grid/work-dir/agent/quicklisp/dists/quicklisp/software/cffi_0.14.0/" "-o" "/home/testgrid/cl-test-grid/work-dir/agent/test-runs/20141103110324-ecl-13.5.1-unknown-linux-i686-lisp-to-c/fasl/ql/dists/quicklisp/software/lisp-zmq-1.5.0/src/grovel" "/home/testgrid/cl-test-grid/work-dir/agent/test-runs/20141103110324-ecl-13.5.1-unknown-linux-i686-lisp-to-c/fasl/ql/dists/quicklisp/software/lisp-zmq-1.5.0/src/grovel.c" Output was: <see above>
sbcl-1.0.58-linux-x86
(LOAD m2cl-test FAIL) ffi-grovel, CFFI-GROVEL:GROVEL-ERROR : External process exited with code 1. Command was: "cc" "-m32" "-I/home/testgrid/cl-test-grid/work-dir/agent/quicklisp/dists/quicklisp/software/cffi_0.14.0/" "-o" "/home/testgrid/cl-test-grid/work-dir/agent/test-runs/20141115150426-sbcl-1.0.58-linux-x86/fasl/ql/dists/quicklisp/software/lisp-zmq-1.5.0/src/grovel" "/home/testgrid/cl-test-grid/work-dir/agent/test-runs/20141115150426-sbcl-1.0.58-linux-x86/fasl/ql/dists/quicklisp/software/lisp-zmq-1.5.0/src/grovel.c" Output was: /home/testgrid/cl-test-grid/work-dir/agent/test-runs/20141115150426-sbcl-1.0.58-linux-x86/fasl/ql/dists/quicklisp/software/lisp-zmq-1.5.0/src/grovel.c:6:17: fatal error: zmq.h: No such file or directory compilation terminated.
(LOAD m2cl-examples FAIL) ffi-grovel, CFFI-GROVEL:GROVEL-ERROR : External process exited with code 1. Command was: "cc" "-m32" "-I/home/testgrid/cl-test-grid/work-dir/agent/quicklisp/dists/quicklisp/software/cffi_0.14.0/" "-o" "/home/testgrid/cl-test-grid/work-dir/agent/test-runs/20141115150426-sbcl-1.0.58-linux-x86/fasl/ql/dists/quicklisp/software/lisp-zmq-1.5.0/src/grovel" "/home/testgrid/cl-test-grid/work-dir/agent/test-runs/20141115150426-sbcl-1.0.58-linux-x86/fasl/ql/dists/quicklisp/software/lisp-zmq-1.5.0/src/grovel.c" Output was: /home/testgrid/cl-test-grid/work-dir/agent/test-runs/20141115150426-sbcl-1.0.58-linux-x86/fasl/ql/dists/quicklisp/software/lisp-zmq-1.5.0/src/grovel.c:6:17: fatal error: zmq.h: No such file or directory compilation terminated.
(LOAD m2cl FAIL) ffi-grovel, CFFI-GROVEL:GROVEL-ERROR : External process exited with code 1. Command was: "cc" "-m32" "-I/home/testgrid/cl-test-grid/work-dir/agent/quicklisp/dists/quicklisp/software/cffi_0.14.0/" "-o" "/home/testgrid/cl-test-grid/work-dir/agent/test-runs/20141115150426-sbcl-1.0.58-linux-x86/fasl/ql/dists/quicklisp/software/lisp-zmq-1.5.0/src/grovel" "/home/testgrid/cl-test-grid/work-dir/agent/test-runs/20141115150426-sbcl-1.0.58-linux-x86/fasl/ql/dists/quicklisp/software/lisp-zmq-1.5.0/src/grovel.c" Output was: /home/testgrid/cl-test-grid/work-dir/agent/test-runs/20141115150426-sbcl-1.0.58-linux-x86/fasl/ql/dists/quicklisp/software/lisp-zmq-1.5.0/src/grovel.c:6:17: fatal error: zmq.h: No such file or directory compilation terminated.
(LOAD m2cl-test FAIL) ffi-grovel, CFFI-GROVEL:GROVEL-ERROR : External process exited with code 1. Command was: "cc" "-m32" "-I/home/testgrid/cl-test-grid/work-dir/agent/quicklisp/dists/quicklisp/software/cffi_0.14.0/" "-o" "/home/testgrid/cl-test-grid/work-dir/agent/test-runs/20141008035530-sbcl-1.0.58-linux-x86/fasl/ql/dists/quicklisp/software/lisp-zmq-1.5.0/src/grovel" "/home/testgrid/cl-test-grid/work-dir/agent/test-runs/20141008035530-sbcl-1.0.58-linux-x86/fasl/ql/dists/quicklisp/software/lisp-zmq-1.5.0/src/grovel.c" Output was: /home/testgrid/cl-test-grid/work-dir/agent/test-runs/20141008035530-sbcl-1.0.58-linux-x86/fasl/ql/dists/quicklisp/software/lisp-zmq-1.5.0/src/grovel.c:6:17: fatal error: zmq.h: No such file or directory compilation terminated.
(LOAD m2cl-examples FAIL) ffi-grovel, CFFI-GROVEL:GROVEL-ERROR : External process exited with code 1. Command was: "cc" "-m32" "-I/home/testgrid/cl-test-grid/work-dir/agent/quicklisp/dists/quicklisp/software/cffi_0.14.0/" "-o" "/home/testgrid/cl-test-grid/work-dir/agent/test-runs/20141008035530-sbcl-1.0.58-linux-x86/fasl/ql/dists/quicklisp/software/lisp-zmq-1.5.0/src/grovel" "/home/testgrid/cl-test-grid/work-dir/agent/test-runs/20141008035530-sbcl-1.0.58-linux-x86/fasl/ql/dists/quicklisp/software/lisp-zmq-1.5.0/src/grovel.c" Output was: /home/testgrid/cl-test-grid/work-dir/agent/test-runs/20141008035530-sbcl-1.0.58-linux-x86/fasl/ql/dists/quicklisp/software/lisp-zmq-1.5.0/src/grovel.c:6:17: fatal error: zmq.h: No such file or directory compilation terminated.
(LOAD m2cl FAIL) ffi-grovel, CFFI-GROVEL:GROVEL-ERROR : External process exited with code 1. Command was: "cc" "-m32" "-I/home/testgrid/cl-test-grid/work-dir/agent/quicklisp/dists/quicklisp/software/cffi_0.14.0/" "-o" "/home/testgrid/cl-test-grid/work-dir/agent/test-runs/20141008035530-sbcl-1.0.58-linux-x86/fasl/ql/dists/quicklisp/software/lisp-zmq-1.5.0/src/grovel" "/home/testgrid/cl-test-grid/work-dir/agent/test-runs/20141008035530-sbcl-1.0.58-linux-x86/fasl/ql/dists/quicklisp/software/lisp-zmq-1.5.0/src/grovel.c" Output was: /home/testgrid/cl-test-grid/work-dir/agent/test-runs/20141008035530-sbcl-1.0.58-linux-x86/fasl/ql/dists/quicklisp/software/lisp-zmq-1.5.0/src/grovel.c:6:17: fatal error: zmq.h: No such file or directory compilation terminated.
sbcl-1.1.11-linux-x86
(LOAD m2cl-test FAIL) ffi-grovel, CFFI-GROVEL:GROVEL-ERROR : External process exited with code 1. Command was: "cc" "-m32" "-I/home/testgrid/cl-test-grid/work-dir/agent/quicklisp/dists/quicklisp/software/cffi_0.14.0/" "-o" "/home/testgrid/cl-test-grid/work-dir/agent/test-runs/20141115131427-sbcl-1.1.11-linux-x86/fasl/ql/dists/quicklisp/software/lisp-zmq-1.5.0/src/grovel" "/home/testgrid/cl-test-grid/work-dir/agent/test-runs/20141115131427-sbcl-1.1.11-linux-x86/fasl/ql/dists/quicklisp/software/lisp-zmq-1.5.0/src/grovel.c" Output was: /home/testgrid/cl-test-grid/work-dir/agent/test-runs/20141115131427-sbcl-1.1.11-linux-x86/fasl/ql/dists/quicklisp/software/lisp-zmq-1.5.0/src/grovel.c:6:17: fatal error: zmq.h: No such file or directory compilation terminated.
(LOAD m2cl-examples FAIL) ffi-grovel, CFFI-GROVEL:GROVEL-ERROR : External process exited with code 1. Command was: "cc" "-m32" "-I/home/testgrid/cl-test-grid/work-dir/agent/quicklisp/dists/quicklisp/software/cffi_0.14.0/" "-o" "/home/testgrid/cl-test-grid/work-dir/agent/test-runs/20141115131427-sbcl-1.1.11-linux-x86/fasl/ql/dists/quicklisp/software/lisp-zmq-1.5.0/src/grovel" "/home/testgrid/cl-test-grid/work-dir/agent/test-runs/20141115131427-sbcl-1.1.11-linux-x86/fasl/ql/dists/quicklisp/software/lisp-zmq-1.5.0/src/grovel.c" Output was: /home/testgrid/cl-test-grid/work-dir/agent/test-runs/20141115131427-sbcl-1.1.11-linux-x86/fasl/ql/dists/quicklisp/software/lisp-zmq-1.5.0/src/grovel.c:6:17: fatal error: zmq.h: No such file or directory compilation terminated.
(LOAD m2cl FAIL) ffi-grovel, CFFI-GROVEL:GROVEL-ERROR : External process exited with code 1. Command was: "cc" "-m32" "-I/home/testgrid/cl-test-grid/work-dir/agent/quicklisp/dists/quicklisp/software/cffi_0.14.0/" "-o" "/home/testgrid/cl-test-grid/work-dir/agent/test-runs/20141115131427-sbcl-1.1.11-linux-x86/fasl/ql/dists/quicklisp/software/lisp-zmq-1.5.0/src/grovel" "/home/testgrid/cl-test-grid/work-dir/agent/test-runs/20141115131427-sbcl-1.1.11-linux-x86/fasl/ql/dists/quicklisp/software/lisp-zmq-1.5.0/src/grovel.c" Output was: /home/testgrid/cl-test-grid/work-dir/agent/test-runs/20141115131427-sbcl-1.1.11-linux-x86/fasl/ql/dists/quicklisp/software/lisp-zmq-1.5.0/src/grovel.c:6:17: fatal error: zmq.h: No such file or directory compilation terminated.
(LOAD m2cl-test FAIL) ffi-grovel, CFFI-GROVEL:GROVEL-ERROR : External process exited with code 1. Command was: "cc" "-m32" "-I/home/testgrid/cl-test-grid/work-dir/agent/quicklisp/dists/quicklisp/software/cffi_0.14.0/" "-o" "/home/testgrid/cl-test-grid/work-dir/agent/test-runs/20141007112213-sbcl-1.1.11-linux-x86/fasl/ql/dists/quicklisp/software/lisp-zmq-1.5.0/src/grovel" "/home/testgrid/cl-test-grid/work-dir/agent/test-runs/20141007112213-sbcl-1.1.11-linux-x86/fasl/ql/dists/quicklisp/software/lisp-zmq-1.5.0/src/grovel.c" Output was: /home/testgrid/cl-test-grid/work-dir/agent/test-runs/20141007112213-sbcl-1.1.11-linux-x86/fasl/ql/dists/quicklisp/software/lisp-zmq-1.5.0/src/grovel.c:6:17: fatal error: zmq.h: No such file or directory compilation terminated.
(LOAD m2cl-examples FAIL) ffi-grovel, CFFI-GROVEL:GROVEL-ERROR : External process exited with code 1. Command was: "cc" "-m32" "-I/home/testgrid/cl-test-grid/work-dir/agent/quicklisp/dists/quicklisp/software/cffi_0.14.0/" "-o" "/home/testgrid/cl-test-grid/work-dir/agent/test-runs/20141007112213-sbcl-1.1.11-linux-x86/fasl/ql/dists/quicklisp/software/lisp-zmq-1.5.0/src/grovel" "/home/testgrid/cl-test-grid/work-dir/agent/test-runs/20141007112213-sbcl-1.1.11-linux-x86/fasl/ql/dists/quicklisp/software/lisp-zmq-1.5.0/src/grovel.c" Output was: /home/testgrid/cl-test-grid/work-dir/agent/test-runs/20141007112213-sbcl-1.1.11-linux-x86/fasl/ql/dists/quicklisp/software/lisp-zmq-1.5.0/src/grovel.c:6:17: fatal error: zmq.h: No such file or directory compilation terminated.
(LOAD m2cl FAIL) ffi-grovel, CFFI-GROVEL:GROVEL-ERROR : External process exited with code 1. Command was: "cc" "-m32" "-I/home/testgrid/cl-test-grid/work-dir/agent/quicklisp/dists/quicklisp/software/cffi_0.14.0/" "-o" "/home/testgrid/cl-test-grid/work-dir/agent/test-runs/20141007112213-sbcl-1.1.11-linux-x86/fasl/ql/dists/quicklisp/software/lisp-zmq-1.5.0/src/grovel" "/home/testgrid/cl-test-grid/work-dir/agent/test-runs/20141007112213-sbcl-1.1.11-linux-x86/fasl/ql/dists/quicklisp/software/lisp-zmq-1.5.0/src/grovel.c" Output was: /home/testgrid/cl-test-grid/work-dir/agent/test-runs/20141007112213-sbcl-1.1.11-linux-x86/fasl/ql/dists/quicklisp/software/lisp-zmq-1.5.0/src/grovel.c:6:17: fatal error: zmq.h: No such file or directory compilation terminated.
sbcl-1.1.16-linux-x86
(LOAD m2cl-test FAIL) ffi-grovel, CFFI-GROVEL:GROVEL-ERROR : External process exited with code 1. Command was: "cc" "-m32" "-I/home/testgrid/cl-test-grid/work-dir/agent/quicklisp/dists/quicklisp/software/cffi_0.14.0/" "-o" "/home/testgrid/cl-test-grid/work-dir/agent/test-runs/20141115055137-sbcl-1.1.16-linux-x86/fasl/ql/dists/quicklisp/software/lisp-zmq-1.5.0/src/grovel" "/home/testgrid/cl-test-grid/work-dir/agent/test-runs/20141115055137-sbcl-1.1.16-linux-x86/fasl/ql/dists/quicklisp/software/lisp-zmq-1.5.0/src/grovel.c" Output was: /home/testgrid/cl-test-grid/work-dir/agent/test-runs/20141115055137-sbcl-1.1.16-linux-x86/fasl/ql/dists/quicklisp/software/lisp-zmq-1.5.0/src/grovel.c:6:17: fatal error: zmq.h: No such file or directory compilation terminated.
(LOAD m2cl-examples FAIL) ffi-grovel, CFFI-GROVEL:GROVEL-ERROR : External process exited with code 1. Command was: "cc" "-m32" "-I/home/testgrid/cl-test-grid/work-dir/agent/quicklisp/dists/quicklisp/software/cffi_0.14.0/" "-o" "/home/testgrid/cl-test-grid/work-dir/agent/test-runs/20141115055137-sbcl-1.1.16-linux-x86/fasl/ql/dists/quicklisp/software/lisp-zmq-1.5.0/src/grovel" "/home/testgrid/cl-test-grid/work-dir/agent/test-runs/20141115055137-sbcl-1.1.16-linux-x86/fasl/ql/dists/quicklisp/software/lisp-zmq-1.5.0/src/grovel.c" Output was: /home/testgrid/cl-test-grid/work-dir/agent/test-runs/20141115055137-sbcl-1.1.16-linux-x86/fasl/ql/dists/quicklisp/software/lisp-zmq-1.5.0/src/grovel.c:6:17: fatal error: zmq.h: No such file or directory compilation terminated.
(LOAD m2cl FAIL) ffi-grovel, CFFI-GROVEL:GROVEL-ERROR : External process exited with code 1. Command was: "cc" "-m32" "-I/home/testgrid/cl-test-grid/work-dir/agent/quicklisp/dists/quicklisp/software/cffi_0.14.0/" "-o" "/home/testgrid/cl-test-grid/work-dir/agent/test-runs/20141115055137-sbcl-1.1.16-linux-x86/fasl/ql/dists/quicklisp/software/lisp-zmq-1.5.0/src/grovel" "/home/testgrid/cl-test-grid/work-dir/agent/test-runs/20141115055137-sbcl-1.1.16-linux-x86/fasl/ql/dists/quicklisp/software/lisp-zmq-1.5.0/src/grovel.c" Output was: /home/testgrid/cl-test-grid/work-dir/agent/test-runs/20141115055137-sbcl-1.1.16-linux-x86/fasl/ql/dists/quicklisp/software/lisp-zmq-1.5.0/src/grovel.c:6:17: fatal error: zmq.h: No such file or directory compilation terminated.
(LOAD m2cl-test FAIL) ffi-grovel, CFFI-GROVEL:GROVEL-ERROR : External process exited with code 1. Command was: "cc" "-m32" "-I/home/testgrid/cl-test-grid/work-dir/agent/quicklisp/dists/quicklisp/software/cffi_0.14.0/" "-o" "/home/testgrid/cl-test-grid/work-dir/agent/test-runs/20141007030239-sbcl-1.1.16-linux-x86/fasl/ql/dists/quicklisp/software/lisp-zmq-1.5.0/src/grovel" "/home/testgrid/cl-test-grid/work-dir/agent/test-runs/20141007030239-sbcl-1.1.16-linux-x86/fasl/ql/dists/quicklisp/software/lisp-zmq-1.5.0/src/grovel.c" Output was: /home/testgrid/cl-test-grid/work-dir/agent/test-runs/20141007030239-sbcl-1.1.16-linux-x86/fasl/ql/dists/quicklisp/software/lisp-zmq-1.5.0/src/grovel.c:6:17: fatal error: zmq.h: No such file or directory compilation terminated.
(LOAD m2cl-examples FAIL) ffi-grovel, CFFI-GROVEL:GROVEL-ERROR : External process exited with code 1. Command was: "cc" "-m32" "-I/home/testgrid/cl-test-grid/work-dir/agent/quicklisp/dists/quicklisp/software/cffi_0.14.0/" "-o" "/home/testgrid/cl-test-grid/work-dir/agent/test-runs/20141007030239-sbcl-1.1.16-linux-x86/fasl/ql/dists/quicklisp/software/lisp-zmq-1.5.0/src/grovel" "/home/testgrid/cl-test-grid/work-dir/agent/test-runs/20141007030239-sbcl-1.1.16-linux-x86/fasl/ql/dists/quicklisp/software/lisp-zmq-1.5.0/src/grovel.c" Output was: /home/testgrid/cl-test-grid/work-dir/agent/test-runs/20141007030239-sbcl-1.1.16-linux-x86/fasl/ql/dists/quicklisp/software/lisp-zmq-1.5.0/src/grovel.c:6:17: fatal error: zmq.h: No such file or directory compilation terminated.
(LOAD m2cl FAIL) ffi-grovel, CFFI-GROVEL:GROVEL-ERROR : External process exited with code 1. Command was: "cc" "-m32" "-I/home/testgrid/cl-test-grid/work-dir/agent/quicklisp/dists/quicklisp/software/cffi_0.14.0/" "-o" "/home/testgrid/cl-test-grid/work-dir/agent/test-runs/20141007030239-sbcl-1.1.16-linux-x86/fasl/ql/dists/quicklisp/software/lisp-zmq-1.5.0/src/grovel" "/home/testgrid/cl-test-grid/work-dir/agent/test-runs/20141007030239-sbcl-1.1.16-linux-x86/fasl/ql/dists/quicklisp/software/lisp-zmq-1.5.0/src/grovel.c" Output was: /home/testgrid/cl-test-grid/work-dir/agent/test-runs/20141007030239-sbcl-1.1.16-linux-x86/fasl/ql/dists/quicklisp/software/lisp-zmq-1.5.0/src/grovel.c:6:17: fatal error: zmq.h: No such file or directory compilation terminated.
sbcl-1.2.3-linux-x64
(LOAD m2cl-test FAIL) ffi-grovel, CFFI-GROVEL:GROVEL-ERROR : External process exited with code 1. Command was: "cc" "-m64" "-I/home/hijarian/systems/cl-test-grid/work-dir/agent/quicklisp/dists/quicklisp/software/cffi_0.14.0/" "-o" "/home/hijarian/systems/cl-test-grid/work-dir/agent/test-runs/20141119133959-sbcl-1.2.3-linux-x64/fasl/ql/dists/quicklisp/software/lisp-zmq-1.5.0/src/grovel" "/home/hijarian/systems/cl-test-grid/work-dir/agent/test-runs/20141119133959-sbcl-1.2.3-linux-x64/fasl/ql/dists/quicklisp/software/lisp-zmq-1.5.0/src/grovel.c" Output was: /home/hijarian/systems/cl-test-grid/work-dir/agent/test-runs/20141119133959-sbcl-1.2.3-linux-x64/fasl/ql/dists/quicklisp/software/lisp-zmq-1.5.0/src/grovel.c:6:17: fatal error: zmq.h: Нет такого файла или каталога #include <zmq.h> ^ compilation terminated.
(LOAD m2cl-examples FAIL) ffi-grovel, CFFI-GROVEL:GROVEL-ERROR : External process exited with code 1. Command was: "cc" "-m64" "-I/home/hijarian/systems/cl-test-grid/work-dir/agent/quicklisp/dists/quicklisp/software/cffi_0.14.0/" "-o" "/home/hijarian/systems/cl-test-grid/work-dir/agent/test-runs/20141119133959-sbcl-1.2.3-linux-x64/fasl/ql/dists/quicklisp/software/lisp-zmq-1.5.0/src/grovel" "/home/hijarian/systems/cl-test-grid/work-dir/agent/test-runs/20141119133959-sbcl-1.2.3-linux-x64/fasl/ql/dists/quicklisp/software/lisp-zmq-1.5.0/src/grovel.c" Output was: /home/hijarian/systems/cl-test-grid/work-dir/agent/test-runs/20141119133959-sbcl-1.2.3-linux-x64/fasl/ql/dists/quicklisp/software/lisp-zmq-1.5.0/src/grovel.c:6:17: fatal error: zmq.h: Нет такого файла или каталога #include <zmq.h> ^ compilation terminated.
(LOAD m2cl FAIL) ffi-grovel, CFFI-GROVEL:GROVEL-ERROR : External process exited with code 1. Command was: "cc" "-m64" "-I/home/hijarian/systems/cl-test-grid/work-dir/agent/quicklisp/dists/quicklisp/software/cffi_0.14.0/" "-o" "/home/hijarian/systems/cl-test-grid/work-dir/agent/test-runs/20141119133959-sbcl-1.2.3-linux-x64/fasl/ql/dists/quicklisp/software/lisp-zmq-1.5.0/src/grovel" "/home/hijarian/systems/cl-test-grid/work-dir/agent/test-runs/20141119133959-sbcl-1.2.3-linux-x64/fasl/ql/dists/quicklisp/software/lisp-zmq-1.5.0/src/grovel.c" Output was: /home/hijarian/systems/cl-test-grid/work-dir/agent/test-runs/20141119133959-sbcl-1.2.3-linux-x64/fasl/ql/dists/quicklisp/software/lisp-zmq-1.5.0/src/grovel.c:6:17: fatal error: zmq.h: Нет такого файла или каталога #include <zmq.h> ^ compilation terminated.
(LOAD m2cl-test FAIL) ffi-grovel, CFFI-GROVEL:GROVEL-ERROR : External process exited with code 1. Command was: "cc" "-m64" "-I/home/hijarian/systems/cl-test-grid/work-dir/agent/quicklisp/dists/quicklisp/software/cffi_0.14.0/" "-o" "/home/hijarian/systems/cl-test-grid/work-dir/agent/test-runs/20141007115353-sbcl-1.2.3-linux-x64/fasl/ql/dists/quicklisp/software/lisp-zmq-1.5.0/src/grovel" "/home/hijarian/systems/cl-test-grid/work-dir/agent/test-runs/20141007115353-sbcl-1.2.3-linux-x64/fasl/ql/dists/quicklisp/software/lisp-zmq-1.5.0/src/grovel.c" Output was: /home/hijarian/systems/cl-test-grid/work-dir/agent/test-runs/20141007115353-sbcl-1.2.3-linux-x64/fasl/ql/dists/quicklisp/software/lisp-zmq-1.5.0/src/grovel.c:6:17: fatal error: zmq.h: Нет такого файла или каталога compilation terminated.
(LOAD m2cl-examples FAIL) ffi-grovel, CFFI-GROVEL:GROVEL-ERROR : External process exited with code 1. Command was: "cc" "-m64" "-I/home/hijarian/systems/cl-test-grid/work-dir/agent/quicklisp/dists/quicklisp/software/cffi_0.14.0/" "-o" "/home/hijarian/systems/cl-test-grid/work-dir/agent/test-runs/20141007115353-sbcl-1.2.3-linux-x64/fasl/ql/dists/quicklisp/software/lisp-zmq-1.5.0/src/grovel" "/home/hijarian/systems/cl-test-grid/work-dir/agent/test-runs/20141007115353-sbcl-1.2.3-linux-x64/fasl/ql/dists/quicklisp/software/lisp-zmq-1.5.0/src/grovel.c" Output was: /home/hijarian/systems/cl-test-grid/work-dir/agent/test-runs/20141007115353-sbcl-1.2.3-linux-x64/fasl/ql/dists/quicklisp/software/lisp-zmq-1.5.0/src/grovel.c:6:17: fatal error: zmq.h: Нет такого файла или каталога compilation terminated.
(LOAD m2cl FAIL) ffi-grovel, CFFI-GROVEL:GROVEL-ERROR : External process exited with code 1. Command was: "cc" "-m64" "-I/home/hijarian/systems/cl-test-grid/work-dir/agent/quicklisp/dists/quicklisp/software/cffi_0.14.0/" "-o" "/home/hijarian/systems/cl-test-grid/work-dir/agent/test-runs/20141007115353-sbcl-1.2.3-linux-x64/fasl/ql/dists/quicklisp/software/lisp-zmq-1.5.0/src/grovel" "/home/hijarian/systems/cl-test-grid/work-dir/agent/test-runs/20141007115353-sbcl-1.2.3-linux-x64/fasl/ql/dists/quicklisp/software/lisp-zmq-1.5.0/src/grovel.c" Output was: /home/hijarian/systems/cl-test-grid/work-dir/agent/test-runs/20141007115353-sbcl-1.2.3-linux-x64/fasl/ql/dists/quicklisp/software/lisp-zmq-1.5.0/src/grovel.c:6:17: fatal error: zmq.h: Нет такого файла или каталога compilation terminated.

Breakdown by testcases: for every failed testcase the lisp implmentations it fails on

The library does not have a testsuite adapter for CL Test Grid.

To reports overview

Generated at: 2014-11-20 12:37:40 GMT.