lfarm results collected by cl-test-grid

Results on the last two Quicklisp distributions

 quicklisp 2014-09-14quicklisp 2014-08-26
abcl-1.2.0-fasl42-linux-x86
(LOAD lfarm-gss FAIL) ffi-grovel, CFFI-GROVEL:GROVEL-ERROR : External process exited with code 1. Command was: "cc" "-m32" "-I/home/testgrid/cl-test-grid/work-dir/agent/quicklisp/dists/quicklisp/software/cffi_0.13.0/" "-o" "/home/testgrid/cl-test-grid/work-dir/agent/test-runs/20140918225720-abcl-1.2.0-fasl42-linux-x86/fasl/ql/dists/quicklisp/software/cl-gss-20140914-git/src/gss-grovel" "/home/testgrid/cl-test-grid/work-dir/agent/test-runs/20140918225720-abcl-1.2.0-fasl42-linux-x86/fasl/ql/dists/quicklisp/software/cl-gss-20140914-git/src/gss-grovel.c" Output was: /home/testgrid/cl-test-grid/work-dir/agent/test-runs/20140918225720-abcl-1.2.0-fasl42-linux-x86/fasl/ql/dists/quicklisp/software/cl-gss-20140914-git/src/gss-grovel.c:6:27: fatal error: gssapi/gssapi.h: No such file or directory compilation terminated.
(LOAD lfarm-gss FAIL) ffi-grovel, CFFI-GROVEL:GROVEL-ERROR : External process exited with code 1. Command was: "cc" "-m32" "-I/home/testgrid/cl-test-grid/work-dir/agent/quicklisp/dists/quicklisp/software/cffi_0.13.0/" "-o" "/home/testgrid/cl-test-grid/work-dir/agent/test-runs/20140831233725-abcl-1.2.0-fasl42-linux-x86/fasl/ql/dists/quicklisp/software/cl-gss-20140826-git/src/gss-grovel" "/home/testgrid/cl-test-grid/work-dir/agent/test-runs/20140831233725-abcl-1.2.0-fasl42-linux-x86/fasl/ql/dists/quicklisp/software/cl-gss-20140826-git/src/gss-grovel.c" Output was: /home/testgrid/cl-test-grid/work-dir/agent/test-runs/20140831233725-abcl-1.2.0-fasl42-linux-x86/fasl/ql/dists/quicklisp/software/cl-gss-20140826-git/src/gss-grovel.c:6:27: fatal error: gssapi/gssapi.h: No such file or directory compilation terminated.
abcl-1.2.1-fasl42-linux-x86
(LOAD lfarm-gss FAIL) ffi-grovel, CFFI-GROVEL:GROVEL-ERROR : External process exited with code 1. Command was: "cc" "-m32" "-I/home/testgrid/cl-test-grid/work-dir/agent/quicklisp/dists/quicklisp/software/cffi_0.13.0/" "-o" "/home/testgrid/cl-test-grid/work-dir/agent/test-runs/20140918095625-abcl-1.2.1-fasl42-linux-x86/fasl/ql/dists/quicklisp/software/cl-gss-20140914-git/src/gss-grovel" "/home/testgrid/cl-test-grid/work-dir/agent/test-runs/20140918095625-abcl-1.2.1-fasl42-linux-x86/fasl/ql/dists/quicklisp/software/cl-gss-20140914-git/src/gss-grovel.c" Output was: /home/testgrid/cl-test-grid/work-dir/agent/test-runs/20140918095625-abcl-1.2.1-fasl42-linux-x86/fasl/ql/dists/quicklisp/software/cl-gss-20140914-git/src/gss-grovel.c:6:27: fatal error: gssapi/gssapi.h: No such file or directory compilation terminated.
(LOAD lfarm-gss FAIL) ffi-grovel, CFFI-GROVEL:GROVEL-ERROR : External process exited with code 1. Command was: "cc" "-m32" "-I/home/testgrid/cl-test-grid/work-dir/agent/quicklisp/dists/quicklisp/software/cffi_0.13.0/" "-o" "/home/testgrid/cl-test-grid/work-dir/agent/test-runs/20140831100849-abcl-1.2.1-fasl42-linux-x86/fasl/ql/dists/quicklisp/software/cl-gss-20140826-git/src/gss-grovel" "/home/testgrid/cl-test-grid/work-dir/agent/test-runs/20140831100849-abcl-1.2.1-fasl42-linux-x86/fasl/ql/dists/quicklisp/software/cl-gss-20140826-git/src/gss-grovel.c" Output was: /home/testgrid/cl-test-grid/work-dir/agent/test-runs/20140831100849-abcl-1.2.1-fasl42-linux-x86/fasl/ql/dists/quicklisp/software/cl-gss-20140826-git/src/gss-grovel.c:6:27: fatal error: gssapi/gssapi.h: No such file or directory compilation terminated.
abcl-1.2.1-fasl42-macosx-x64
(LOAD lfarm-ssl FAIL) ffi, COMMON-LISP:SIMPLE-ERROR : Don't know how to REQUIRE JNA.
(LOAD lfarm-gss FAIL) ffi, ASDF/FIND-SYSTEM:LOAD-SYSTEM-DEFINITION-ERROR : Error while trying to load definition for system cl-gss from pathname /Users/pnathan/cl-test-grid/work-dir/agent/quicklisp/dists/quicklisp/software/cl-gss-20140914-git/cl-gss.asd: Don't know how to REQUIRE JNA.
(LOAD lfarm-ssl FAIL) ffi, COMMON-LISP:SIMPLE-ERROR : Don't know how to REQUIRE JNA.
(LOAD lfarm-gss FAIL) ffi, ASDF/FIND-SYSTEM:LOAD-SYSTEM-DEFINITION-ERROR : Error while trying to load definition for system cl-gss from pathname /Users/pnathan/cl-test-grid/work-dir/agent/quicklisp/dists/quicklisp/software/cl-gss-20140826-git/cl-gss.asd: Don't know how to REQUIRE JNA.
abcl-1.3.0-fasl42-linux-x86
(LOAD lfarm-test FAIL) ASDF/FIND-SYSTEM:LOAD-SYSTEM-DEFINITION-ERROR : Error while trying to load definition for system cl-store from pathname /home/testgrid/cl-test-grid/work-dir/agent/quicklisp/dists/quicklisp/software/cl-store-20130420-git/cl-store.asd: don't recognize component type :NON-REQUIRED-FILE
(LOAD lfarm-ssl FAIL) ASDF/FIND-SYSTEM:LOAD-SYSTEM-DEFINITION-ERROR : Error while trying to load definition for system cl-store from pathname /home/testgrid/cl-test-grid/work-dir/agent/quicklisp/dists/quicklisp/software/cl-store-20130420-git/cl-store.asd: don't recognize component type :NON-REQUIRED-FILE
(LOAD lfarm-server FAIL) ASDF/FIND-SYSTEM:LOAD-SYSTEM-DEFINITION-ERROR : Error while trying to load definition for system cl-store from pathname /home/testgrid/cl-test-grid/work-dir/agent/quicklisp/dists/quicklisp/software/cl-store-20130420-git/cl-store.asd: don't recognize component type :NON-REQUIRED-FILE
(LOAD lfarm-launcher FAIL) ASDF/FIND-SYSTEM:LOAD-SYSTEM-DEFINITION-ERROR : Error while trying to load definition for system cl-store from pathname /home/testgrid/cl-test-grid/work-dir/agent/quicklisp/dists/quicklisp/software/cl-store-20130420-git/cl-store.asd: don't recognize component type :NON-REQUIRED-FILE
(LOAD lfarm-gss FAIL) ASDF/FIND-SYSTEM:LOAD-SYSTEM-DEFINITION-ERROR : Error while trying to load definition for system cl-store from pathname /home/testgrid/cl-test-grid/work-dir/agent/quicklisp/dists/quicklisp/software/cl-store-20130420-git/cl-store.asd: don't recognize component type :NON-REQUIRED-FILE
(LOAD lfarm-common FAIL) ASDF/FIND-SYSTEM:LOAD-SYSTEM-DEFINITION-ERROR : Error while trying to load definition for system cl-store from pathname /home/testgrid/cl-test-grid/work-dir/agent/quicklisp/dists/quicklisp/software/cl-store-20130420-git/cl-store.asd: don't recognize component type :NON-REQUIRED-FILE
(LOAD lfarm-client FAIL) ASDF/FIND-SYSTEM:LOAD-SYSTEM-DEFINITION-ERROR : Error while trying to load definition for system cl-store from pathname /home/testgrid/cl-test-grid/work-dir/agent/quicklisp/dists/quicklisp/software/cl-store-20130420-git/cl-store.asd: don't recognize component type :NON-REQUIRED-FILE
(LOAD lfarm-admin FAIL) ASDF/FIND-SYSTEM:LOAD-SYSTEM-DEFINITION-ERROR : Error while trying to load definition for system cl-store from pathname /home/testgrid/cl-test-grid/work-dir/agent/quicklisp/dists/quicklisp/software/cl-store-20130420-git/cl-store.asd: don't recognize component type :NON-REQUIRED-FILE
(LOAD lfarm-test FAIL) ASDF/FIND-SYSTEM:LOAD-SYSTEM-DEFINITION-ERROR : Error while trying to load definition for system cl-store from pathname /home/testgrid/cl-test-grid/work-dir/agent/quicklisp/dists/quicklisp/software/cl-store-20130420-git/cl-store.asd: don't recognize component type :NON-REQUIRED-FILE
(LOAD lfarm-ssl FAIL) ASDF/FIND-SYSTEM:LOAD-SYSTEM-DEFINITION-ERROR : Error while trying to load definition for system cl-store from pathname /home/testgrid/cl-test-grid/work-dir/agent/quicklisp/dists/quicklisp/software/cl-store-20130420-git/cl-store.asd: don't recognize component type :NON-REQUIRED-FILE
(LOAD lfarm-server FAIL) ASDF/FIND-SYSTEM:LOAD-SYSTEM-DEFINITION-ERROR : Error while trying to load definition for system cl-store from pathname /home/testgrid/cl-test-grid/work-dir/agent/quicklisp/dists/quicklisp/software/cl-store-20130420-git/cl-store.asd: don't recognize component type :NON-REQUIRED-FILE
(LOAD lfarm-launcher FAIL) ASDF/FIND-SYSTEM:LOAD-SYSTEM-DEFINITION-ERROR : Error while trying to load definition for system cl-store from pathname /home/testgrid/cl-test-grid/work-dir/agent/quicklisp/dists/quicklisp/software/cl-store-20130420-git/cl-store.asd: don't recognize component type :NON-REQUIRED-FILE
(LOAD lfarm-gss FAIL) ASDF/FIND-SYSTEM:LOAD-SYSTEM-DEFINITION-ERROR : Error while trying to load definition for system cl-store from pathname /home/testgrid/cl-test-grid/work-dir/agent/quicklisp/dists/quicklisp/software/cl-store-20130420-git/cl-store.asd: don't recognize component type :NON-REQUIRED-FILE
(LOAD lfarm-common FAIL) ASDF/FIND-SYSTEM:LOAD-SYSTEM-DEFINITION-ERROR : Error while trying to load definition for system cl-store from pathname /home/testgrid/cl-test-grid/work-dir/agent/quicklisp/dists/quicklisp/software/cl-store-20130420-git/cl-store.asd: don't recognize component type :NON-REQUIRED-FILE
(LOAD lfarm-client FAIL) ASDF/FIND-SYSTEM:LOAD-SYSTEM-DEFINITION-ERROR : Error while trying to load definition for system cl-store from pathname /home/testgrid/cl-test-grid/work-dir/agent/quicklisp/dists/quicklisp/software/cl-store-20130420-git/cl-store.asd: don't recognize component type :NON-REQUIRED-FILE
(LOAD lfarm-admin FAIL) ASDF/FIND-SYSTEM:LOAD-SYSTEM-DEFINITION-ERROR : Error while trying to load definition for system cl-store from pathname /home/testgrid/cl-test-grid/work-dir/agent/quicklisp/dists/quicklisp/software/cl-store-20130420-git/cl-store.asd: don't recognize component type :NON-REQUIRED-FILE
abcl-1.3.1-fasl42-linux-x86
(LOAD lfarm-gss FAIL) ffi-grovel, CFFI-GROVEL:GROVEL-ERROR : External process exited with code 1. Command was: "cc" "-m32" "-I/home/testgrid/cl-test-grid/work-dir/agent/quicklisp/dists/quicklisp/software/cffi_0.13.0/" "-o" "/home/testgrid/cl-test-grid/work-dir/agent/test-runs/20140917091242-abcl-1.3.1-fasl42-linux-x86/fasl/ql/dists/quicklisp/software/cl-gss-20140914-git/src/gss-grovel" "/home/testgrid/cl-test-grid/work-dir/agent/test-runs/20140917091242-abcl-1.3.1-fasl42-linux-x86/fasl/ql/dists/quicklisp/software/cl-gss-20140914-git/src/gss-grovel.c" Output was: /home/testgrid/cl-test-grid/work-dir/agent/test-runs/20140917091242-abcl-1.3.1-fasl42-linux-x86/fasl/ql/dists/quicklisp/software/cl-gss-20140914-git/src/gss-grovel.c:6:27: fatal error: gssapi/gssapi.h: No such file or directory compilation terminated.
(LOAD lfarm-gss FAIL) ffi-grovel, CFFI-GROVEL:GROVEL-ERROR : External process exited with code 1. Command was: "cc" "-m32" "-I/home/testgrid/cl-test-grid/work-dir/agent/quicklisp/dists/quicklisp/software/cffi_0.13.0/" "-o" "/home/testgrid/cl-test-grid/work-dir/agent/test-runs/20140830094925-abcl-1.3.1-fasl42-linux-x86/fasl/ql/dists/quicklisp/software/cl-gss-20140826-git/src/gss-grovel" "/home/testgrid/cl-test-grid/work-dir/agent/test-runs/20140830094925-abcl-1.3.1-fasl42-linux-x86/fasl/ql/dists/quicklisp/software/cl-gss-20140826-git/src/gss-grovel.c" Output was: /home/testgrid/cl-test-grid/work-dir/agent/test-runs/20140830094925-abcl-1.3.1-fasl42-linux-x86/fasl/ql/dists/quicklisp/software/cl-gss-20140826-git/src/gss-grovel.c:6:27: fatal error: gssapi/gssapi.h: No such file or directory compilation terminated.
ccl-1.10-f96-macosx-x86
ccl-1.10-rc1-r16192-f96-macosx-x86
ccl-1.8-r15286m-f95-linux-x86
(LOAD lfarm-gss FAIL) ffi-grovel, CFFI-GROVEL:GROVEL-ERROR : External process exited with code 1. Command was: "cc" "-m32" "-I/home/testgrid/cl-test-grid/work-dir/agent/quicklisp/dists/quicklisp/software/cffi_0.13.0/" "-o" "/home/testgrid/cl-test-grid/work-dir/agent/test-runs/20140916134836-ccl-1.8-r15286m-f95-linux-x86/fasl/ql/dists/quicklisp/software/cl-gss-20140914-git/src/gss-grovel" "/home/testgrid/cl-test-grid/work-dir/agent/test-runs/20140916134836-ccl-1.8-r15286m-f95-linux-x86/fasl/ql/dists/quicklisp/software/cl-gss-20140914-git/src/gss-grovel.c" Output was: /home/testgrid/cl-test-grid/work-dir/agent/test-runs/20140916134836-ccl-1.8-r15286m-f95-linux-x86/fasl/ql/dists/quicklisp/software/cl-gss-20140914-git/src/gss-grovel.c:6:27: fatal error: gssapi/gssapi.h: No such file or directory compilation terminated.
(LOAD lfarm-gss FAIL) ffi-grovel, CFFI-GROVEL:GROVEL-ERROR : External process exited with code 1. Command was: "cc" "-m32" "-I/home/testgrid/cl-test-grid/work-dir/agent/quicklisp/dists/quicklisp/software/cffi_0.13.0/" "-o" "/home/testgrid/cl-test-grid/work-dir/agent/test-runs/20140829155837-ccl-1.8-f95-linux-x86/fasl/ql/dists/quicklisp/software/cl-gss-20140826-git/src/gss-grovel" "/home/testgrid/cl-test-grid/work-dir/agent/test-runs/20140829155837-ccl-1.8-f95-linux-x86/fasl/ql/dists/quicklisp/software/cl-gss-20140826-git/src/gss-grovel.c" Output was: /home/testgrid/cl-test-grid/work-dir/agent/test-runs/20140829155837-ccl-1.8-f95-linux-x86/fasl/ql/dists/quicklisp/software/cl-gss-20140826-git/src/gss-grovel.c:6:27: fatal error: gssapi/gssapi.h: No such file or directory compilation terminated.
ccl-1.9-f96-linux-x64
(LOAD lfarm-gss FAIL) ffi-grovel, CFFI-GROVEL:GROVEL-ERROR : External process exited with code 1. Command was: "cc" "-m64" "-I/home/hijarian/systems/cl-test-grid/work-dir/agent/quicklisp/dists/quicklisp/software/cffi_0.13.0/" "-o" "/home/hijarian/systems/cl-test-grid/work-dir/agent/test-runs/20140915142853-ccl-1.9-f96-linux-x64/fasl/ql/dists/quicklisp/software/cl-gss-20140914-git/src/gss-grovel" "/home/hijarian/systems/cl-test-grid/work-dir/agent/test-runs/20140915142853-ccl-1.9-f96-linux-x64/fasl/ql/dists/quicklisp/software/cl-gss-20140914-git/src/gss-grovel.c" Output was: /home/hijarian/systems/cl-test-grid/work-dir/agent/test-runs/20140915142853-ccl-1.9-f96-linux-x64/fasl/ql/dists/quicklisp/software/cl-gss-20140914-git/src/gss-grovel.c:6:27: fatal error: gssapi/gssapi.h: Нет такого файла или каталога compilation terminated.
ccl-1.9-f96-linux-x86
(LOAD lfarm-gss FAIL) ffi, CFFI:LOAD-FOREIGN-LIBRARY-ERROR : Unable to load any of the alternatives: ("libgssapi_krb5.so" "libgss.so")
ccl-1.9-r15756-f96-linux-x86
(LOAD lfarm-gss FAIL) ffi-grovel, CFFI-GROVEL:GROVEL-ERROR : External process exited with code 1. Command was: "cc" "-m32" "-I/home/testgrid/cl-test-grid/work-dir/agent/quicklisp/dists/quicklisp/software/cffi_0.13.0/" "-o" "/home/testgrid/cl-test-grid/work-dir/agent/test-runs/20140915221737-ccl-1.9-r15756-f96-linux-x86/fasl/ql/dists/quicklisp/software/cl-gss-20140914-git/src/gss-grovel" "/home/testgrid/cl-test-grid/work-dir/agent/test-runs/20140915221737-ccl-1.9-r15756-f96-linux-x86/fasl/ql/dists/quicklisp/software/cl-gss-20140914-git/src/gss-grovel.c" Output was: /home/testgrid/cl-test-grid/work-dir/agent/test-runs/20140915221737-ccl-1.9-r15756-f96-linux-x86/fasl/ql/dists/quicklisp/software/cl-gss-20140914-git/src/gss-grovel.c:6:27: fatal error: gssapi/gssapi.h: No such file or directory compilation terminated.
(LOAD lfarm-gss FAIL) ffi-grovel, CFFI-GROVEL:GROVEL-ERROR : External process exited with code 1. Command was: "cc" "-m32" "-I/home/testgrid/cl-test-grid/work-dir/agent/quicklisp/dists/quicklisp/software/cffi_0.13.0/" "-o" "/home/testgrid/cl-test-grid/work-dir/agent/test-runs/20140827224850-ccl-1.9-f96-linux-x86/fasl/ql/dists/quicklisp/software/cl-gss-20140826-git/src/gss-grovel" "/home/testgrid/cl-test-grid/work-dir/agent/test-runs/20140827224850-ccl-1.9-f96-linux-x86/fasl/ql/dists/quicklisp/software/cl-gss-20140826-git/src/gss-grovel.c" Output was: /home/testgrid/cl-test-grid/work-dir/agent/test-runs/20140827224850-ccl-1.9-f96-linux-x86/fasl/ql/dists/quicklisp/software/cl-gss-20140826-git/src/gss-grovel.c:6:27: fatal error: gssapi/gssapi.h: No such file or directory compilation terminated.
clisp-2.49-unix-i386
(LOAD lfarm-ssl FAIL) ffi, COMMON-LISP:SIMPLE-ERROR : CFFI requires CLISP compiled with dynamic FFI support.
(LOAD lfarm-gss FAIL) ffi, ASDF:LOAD-SYSTEM-DEFINITION-ERROR : Error while trying to load definition for system cl-gss from pathname /Users/pnathan/cl-test-grid/work-dir/agent/quicklisp/dists/quicklisp/software/cl-gss-20140826-git/cl-gss.asd: CFFI requires CLISP compiled with dynamic FFI support.
clisp-2.49-unix-x64
(LOAD lfarm-gss FAIL) ffi-grovel, CFFI-GROVEL:GROVEL-ERROR : External process exited with code 1. Command was: "cc" "-m64" "-I/home/hijarian/systems/cl-test-grid/work-dir/agent/quicklisp/dists/quicklisp/software/cffi_0.13.0/" "-o" "/home/hijarian/systems/cl-test-grid/work-dir/agent/test-runs/20140915121117-clisp-2.49-unix-x64/fasl/ql/dists/quicklisp/software/cl-gss-20140914-git/src/gss-grovel" "/home/hijarian/systems/cl-test-grid/work-dir/agent/test-runs/20140915121117-clisp-2.49-unix-x64/fasl/ql/dists/quicklisp/software/cl-gss-20140914-git/src/gss-grovel.c" Output was: <see above>
clisp-2.49-unix-x86
(LOAD lfarm-gss FAIL) ffi-grovel, CFFI-GROVEL:GROVEL-ERROR : External process exited with code 1. Command was: "cc" "-m32" "-I/home/testgrid/cl-test-grid/work-dir/agent/quicklisp/dists/quicklisp/software/cffi_0.13.0/" "-o" "/home/testgrid/cl-test-grid/work-dir/agent/test-runs/20140830012552-clisp-2.49-unix-x86/fasl/ql/dists/quicklisp/software/cl-gss-20140826-git/src/gss-grovel" "/home/testgrid/cl-test-grid/work-dir/agent/test-runs/20140830012552-clisp-2.49-unix-x86/fasl/ql/dists/quicklisp/software/cl-gss-20140826-git/src/gss-grovel.c" Output was: <see above>
cmu-snapshot-2013-04__20d_unicode_-linux-x86
(LOAD lfarm-gss FAIL) ffi-grovel, CFFI-GROVEL:GROVEL-ERROR : Error in function CFFI-GROVEL:GROVEL-ERROR: External process exited with code 1. Command was: "cc" "-m32" "-I/home/testgrid/cl-test-grid/work-dir/agent/quicklisp/dists/quicklisp/software/cffi_0.13.0/" "-o" "/home/testgrid/cl-test-grid/work-dir/agent/test-runs/20140916161726-cmu-snapshot-2013-04__20d_unicode_-linux-x86/fasl/ql/dists/quicklisp/software/cl-gss-20140914-git/src/gss-grovel" "/home/testgrid/cl-test-grid/work-dir/agent/test-runs/20140916161726-cmu-snapshot-2013-04__20d_unicode_-linux-x86/fasl/ql/dists/quicklisp/software/cl-gss-20140914-git/src/gss-grovel.c" Output was: /home/testgrid/cl-test-grid/work-dir/agent/test-runs/20140916161726-cmu-snapshot-2013-04__20d_unicode_-linux-x86/fasl/ql/dists/quicklisp/software/cl-gss-20140914-git/src/gss-grovel.c:6:27: fatal error: gssapi/gssapi.h: No such file or directory compilation terminated.
(LOAD lfarm-gss FAIL) ffi-grovel, CFFI-GROVEL:GROVEL-ERROR : Error in function CFFI-GROVEL:GROVEL-ERROR: External process exited with code 1. Command was: "cc" "-m32" "-I/home/testgrid/cl-test-grid/work-dir/agent/quicklisp/dists/quicklisp/software/cffi_0.13.0/" "-o" "/home/testgrid/cl-test-grid/work-dir/agent/test-runs/20140829182011-cmu-snapshot-2013-04__20d_unicode_-linux-x86/fasl/ql/dists/quicklisp/software/cl-gss-20140826-git/src/gss-grovel" "/home/testgrid/cl-test-grid/work-dir/agent/test-runs/20140829182011-cmu-snapshot-2013-04__20d_unicode_-linux-x86/fasl/ql/dists/quicklisp/software/cl-gss-20140826-git/src/gss-grovel.c" Output was: /home/testgrid/cl-test-grid/work-dir/agent/test-runs/20140829182011-cmu-snapshot-2013-04__20d_unicode_-linux-x86/fasl/ql/dists/quicklisp/software/cl-gss-20140826-git/src/gss-grovel.c:6:27: fatal error: gssapi/gssapi.h: No such file or directory compilation terminated.
cmu-snapshot-2014-01__20e_unicode_-linux-x86
(LOAD lfarm-gss FAIL) ffi-grovel, CFFI-GROVEL:GROVEL-ERROR : Error in function CFFI-GROVEL:GROVEL-ERROR: External process exited with code 1. Command was: "cc" "-m32" "-I/home/testgrid/cl-test-grid/work-dir/agent/quicklisp/dists/quicklisp/software/cffi_0.13.0/" "-o" "/home/testgrid/cl-test-grid/work-dir/agent/test-runs/20140916185335-cmu-snapshot-2014-01__20e_unicode_-linux-x86/fasl/ql/dists/quicklisp/software/cl-gss-20140914-git/src/gss-grovel" "/home/testgrid/cl-test-grid/work-dir/agent/test-runs/20140916185335-cmu-snapshot-2014-01__20e_unicode_-linux-x86/fasl/ql/dists/quicklisp/software/cl-gss-20140914-git/src/gss-grovel.c" Output was: /home/testgrid/cl-test-grid/work-dir/agent/test-runs/20140916185335-cmu-snapshot-2014-01__20e_unicode_-linux-x86/fasl/ql/dists/quicklisp/software/cl-gss-20140914-git/src/gss-grovel.c:6:27: fatal error: gssapi/gssapi.h: No such file or directory compilation terminated.
(LOAD lfarm-gss FAIL) ffi-grovel, CFFI-GROVEL:GROVEL-ERROR : Error in function CFFI-GROVEL:GROVEL-ERROR: External process exited with code 1. Command was: "cc" "-m32" "-I/home/testgrid/cl-test-grid/work-dir/agent/quicklisp/dists/quicklisp/software/cffi_0.13.0/" "-o" "/home/testgrid/cl-test-grid/work-dir/agent/test-runs/20140829204656-cmu-snapshot-2014-01__20e_unicode_-linux-x86/fasl/ql/dists/quicklisp/software/cl-gss-20140826-git/src/gss-grovel" "/home/testgrid/cl-test-grid/work-dir/agent/test-runs/20140829204656-cmu-snapshot-2014-01__20e_unicode_-linux-x86/fasl/ql/dists/quicklisp/software/cl-gss-20140826-git/src/gss-grovel.c" Output was: /home/testgrid/cl-test-grid/work-dir/agent/test-runs/20140829204656-cmu-snapshot-2014-01__20e_unicode_-linux-x86/fasl/ql/dists/quicklisp/software/cl-gss-20140826-git/src/gss-grovel.c:6:27: fatal error: gssapi/gssapi.h: No such file or directory compilation terminated.
cmu-snapshot-2014-05-dirty__20e_unicode_-linux-x86
(LOAD lfarm-gss FAIL) ffi-grovel, CFFI-GROVEL:GROVEL-ERROR : Error in function CFFI-GROVEL:GROVEL-ERROR: External process exited with code 1. Command was: "cc" "-m32" "-I/home/testgrid/cl-test-grid/work-dir/agent/quicklisp/dists/quicklisp/software/cffi_0.13.0/" "-o" "/home/testgrid/cl-test-grid/work-dir/agent/test-runs/20140916212656-cmu-snapshot-2014-05-dirty__20e_unicode_-linux-x86/fasl/ql/dists/quicklisp/software/cl-gss-20140914-git/src/gss-grovel" "/home/testgrid/cl-test-grid/work-dir/agent/test-runs/20140916212656-cmu-snapshot-2014-05-dirty__20e_unicode_-linux-x86/fasl/ql/dists/quicklisp/software/cl-gss-20140914-git/src/gss-grovel.c" Output was: /home/testgrid/cl-test-grid/work-dir/agent/test-runs/20140916212656-cmu-snapshot-2014-05-dirty__20e_unicode_-linux-x86/fasl/ql/dists/quicklisp/software/cl-gss-20140914-git/src/gss-grovel.c:6:27: fatal error: gssapi/gssapi.h: No such file or directory compilation terminated.
(LOAD lfarm-gss FAIL) ffi-grovel, CFFI-GROVEL:GROVEL-ERROR : Error in function CFFI-GROVEL:GROVEL-ERROR: External process exited with code 1. Command was: "cc" "-m32" "-I/home/testgrid/cl-test-grid/work-dir/agent/quicklisp/dists/quicklisp/software/cffi_0.13.0/" "-o" "/home/testgrid/cl-test-grid/work-dir/agent/test-runs/20140829230732-cmu-snapshot-2014-05-dirty__20e_unicode_-linux-x86/fasl/ql/dists/quicklisp/software/cl-gss-20140826-git/src/gss-grovel" "/home/testgrid/cl-test-grid/work-dir/agent/test-runs/20140829230732-cmu-snapshot-2014-05-dirty__20e_unicode_-linux-x86/fasl/ql/dists/quicklisp/software/cl-gss-20140826-git/src/gss-grovel.c" Output was: /home/testgrid/cl-test-grid/work-dir/agent/test-runs/20140829230732-cmu-snapshot-2014-05-dirty__20e_unicode_-linux-x86/fasl/ql/dists/quicklisp/software/cl-gss-20140826-git/src/gss-grovel.c:6:27: fatal error: gssapi/gssapi.h: No such file or directory compilation terminated.
ecl-13.5.1-76a84246-linux-x64-bytecode
(LOAD lfarm-test FAIL) SI:SIMPLE-PROGRAM-ERROR : In form (CONS STREAM) CONS: Wrong number of arguments
(LOAD lfarm-ssl FAIL) SI:SIMPLE-PROGRAM-ERROR : In form (CONS STREAM) CONS: Wrong number of arguments
(LOAD lfarm-server FAIL) SI:SIMPLE-PROGRAM-ERROR : In form (CONS STREAM) CONS: Wrong number of arguments
(LOAD lfarm-launcher FAIL) SI:SIMPLE-PROGRAM-ERROR : In form (CONS STREAM) CONS: Wrong number of arguments
(LOAD lfarm-gss FAIL) ASDF/FIND-SYSTEM:LOAD-SYSTEM-DEFINITION-ERROR : Error while trying to load definition for system cl-gss from pathname /home/hijarian/systems/cl-test-grid/work-dir/agent/quicklisp/dists/quicklisp/software/cl-gss-20140914-git/cl-gss.asd: The variable C::*CC-FLAGS* is unbound.
(LOAD lfarm-common FAIL) SI:SIMPLE-PROGRAM-ERROR : In form (CONS STREAM) CONS: Wrong number of arguments
(LOAD lfarm-client FAIL) SI:SIMPLE-PROGRAM-ERROR : In form (CONS STREAM) CONS: Wrong number of arguments
(LOAD lfarm-admin FAIL) SI:SIMPLE-PROGRAM-ERROR : In form (CONS STREAM) CONS: Wrong number of arguments
(LOAD lfarm-test FAIL) SI:SIMPLE-PROGRAM-ERROR : In form (CONS STREAM) CONS: Wrong number of arguments
(LOAD lfarm-ssl FAIL) SI:SIMPLE-PROGRAM-ERROR : In form (CONS STREAM) CONS: Wrong number of arguments
(LOAD lfarm-server FAIL) SI:SIMPLE-PROGRAM-ERROR : In form (CONS STREAM) CONS: Wrong number of arguments
(LOAD lfarm-launcher FAIL) SI:SIMPLE-PROGRAM-ERROR : In form (CONS STREAM) CONS: Wrong number of arguments
(LOAD lfarm-gss FAIL) ASDF/FIND-SYSTEM:LOAD-SYSTEM-DEFINITION-ERROR : Error while trying to load definition for system cl-gss from pathname /home/hijarian/systems/cl-test-grid/work-dir/agent/quicklisp/dists/quicklisp/software/cl-gss-20140826-git/cl-gss.asd: The variable C::*CC-FLAGS* is unbound.
(LOAD lfarm-common FAIL) SI:SIMPLE-PROGRAM-ERROR : In form (CONS STREAM) CONS: Wrong number of arguments
(LOAD lfarm-client FAIL) SI:SIMPLE-PROGRAM-ERROR : In form (CONS STREAM) CONS: Wrong number of arguments
(LOAD lfarm-admin FAIL) SI:SIMPLE-PROGRAM-ERROR : In form (CONS STREAM) CONS: Wrong number of arguments
ecl-13.5.1-76a84246-linux-x64-lisp-to-c
(LOAD lfarm-gss FAIL) ffi-grovel, CFFI-GROVEL:GROVEL-ERROR : External process exited with code 1. Command was: "cc" "-m64" " -D_GNU_SOURCE -D_FILE_OFFSET_BITS=64 -g -O2 -fPIC -D_THREAD_SAFE -Dlinux" "-I/home/hijarian/systems/cl-test-grid/work-dir/agent/quicklisp/dists/quicklisp/software/cffi_0.13.0/" "-o" "/home/hijarian/systems/cl-test-grid/work-dir/agent/test-runs/20140915180851-ecl-13.5.1-76a84246-linux-x64-lisp-to-c/fasl/ql/dists/quicklisp/software/cl-gss-20140914-git/src/gss-grovel" "/home/hijarian/systems/cl-test-grid/work-dir/agent/test-runs/20140915180851-ecl-13.5.1-76a84246-linux-x64-lisp-to-c/fasl/ql/dists/quicklisp/software/cl-gss-20140914-git/src/gss-grovel.c" Output was: <see above>
(LOAD lfarm-gss FAIL) ffi-grovel, CFFI-GROVEL:GROVEL-ERROR : External process exited with code 1. Command was: "cc" "-m64" " -D_GNU_SOURCE -D_FILE_OFFSET_BITS=64 -g -O2 -fPIC -D_THREAD_SAFE -Dlinux" "-I/home/hijarian/systems/cl-test-grid/work-dir/agent/quicklisp/dists/quicklisp/software/cffi_0.13.0/" "-o" "/home/hijarian/systems/cl-test-grid/work-dir/agent/test-runs/20140908163429-ecl-13.5.1-76a84246-linux-x64-lisp-to-c/fasl/ql/dists/quicklisp/software/cl-gss-20140826-git/src/gss-grovel" "/home/hijarian/systems/cl-test-grid/work-dir/agent/test-runs/20140908163429-ecl-13.5.1-76a84246-linux-x64-lisp-to-c/fasl/ql/dists/quicklisp/software/cl-gss-20140826-git/src/gss-grovel.c" Output was: <see above>
ecl-13.5.1-efec0ee0-linux-x64-bytecode
(LOAD lfarm-test FAIL) SI:SIMPLE-PROGRAM-ERROR : In form (CONS STREAM) CONS: Wrong number of arguments
(LOAD lfarm-ssl FAIL) SI:SIMPLE-PROGRAM-ERROR : In form (CONS STREAM) CONS: Wrong number of arguments
(LOAD lfarm-server FAIL) SI:SIMPLE-PROGRAM-ERROR : In form (CONS STREAM) CONS: Wrong number of arguments
(LOAD lfarm-launcher FAIL) SI:SIMPLE-PROGRAM-ERROR : In form (CONS STREAM) CONS: Wrong number of arguments
(LOAD lfarm-gss FAIL) ASDF/FIND-SYSTEM:LOAD-SYSTEM-DEFINITION-ERROR : Error while trying to load definition for system cl-gss from pathname /home/hijarian/projects/others/cl-test-grid/work-dir/agent/quicklisp/dists/quicklisp/software/cl-gss-20140826-git/cl-gss.asd: The variable C::*CC-FLAGS* is unbound.
(LOAD lfarm-common FAIL) SI:SIMPLE-PROGRAM-ERROR : In form (CONS STREAM) CONS: Wrong number of arguments
(LOAD lfarm-client FAIL) SI:SIMPLE-PROGRAM-ERROR : In form (CONS STREAM) CONS: Wrong number of arguments
(LOAD lfarm-admin FAIL) SI:SIMPLE-PROGRAM-ERROR : In form (CONS STREAM) CONS: Wrong number of arguments
ecl-13.5.1-efec0ee0-linux-x64-lisp-to-c
ecl-13.5.1-unknown-linux-i686-bytecode
(LOAD lfarm-test FAIL) SI:SIMPLE-PROGRAM-ERROR : In form (CONS STREAM) CONS: Wrong number of arguments
(LOAD lfarm-ssl FAIL) SI:SIMPLE-PROGRAM-ERROR : In form (CONS STREAM) CONS: Wrong number of arguments
(LOAD lfarm-server FAIL) SI:SIMPLE-PROGRAM-ERROR : In form (CONS STREAM) CONS: Wrong number of arguments
(LOAD lfarm-launcher FAIL) SI:SIMPLE-PROGRAM-ERROR : In form (CONS STREAM) CONS: Wrong number of arguments
(LOAD lfarm-gss FAIL) ASDF/FIND-SYSTEM:LOAD-SYSTEM-DEFINITION-ERROR : Error while trying to load definition for system cl-gss from pathname /home/testgrid/cl-test-grid/work-dir/agent/quicklisp/dists/quicklisp/software/cl-gss-20140914-git/cl-gss.asd: The variable C::*CC-FLAGS* is unbound.
(LOAD lfarm-common FAIL) SI:SIMPLE-PROGRAM-ERROR : In form (CONS STREAM) CONS: Wrong number of arguments
(LOAD lfarm-client FAIL) SI:SIMPLE-PROGRAM-ERROR : In form (CONS STREAM) CONS: Wrong number of arguments
(LOAD lfarm-admin FAIL) SI:SIMPLE-PROGRAM-ERROR : In form (CONS STREAM) CONS: Wrong number of arguments
(LOAD lfarm-test FAIL) SI:SIMPLE-PROGRAM-ERROR : In form (CONS STREAM) CONS: Wrong number of arguments
(LOAD lfarm-ssl FAIL) SI:SIMPLE-PROGRAM-ERROR : In form (CONS STREAM) CONS: Wrong number of arguments
(LOAD lfarm-server FAIL) SI:SIMPLE-PROGRAM-ERROR : In form (CONS STREAM) CONS: Wrong number of arguments
(LOAD lfarm-launcher FAIL) SI:SIMPLE-PROGRAM-ERROR : In form (CONS STREAM) CONS: Wrong number of arguments
(LOAD lfarm-gss FAIL) ASDF/FIND-SYSTEM:LOAD-SYSTEM-DEFINITION-ERROR : Error while trying to load definition for system cl-gss from pathname /home/testgrid/cl-test-grid/work-dir/agent/quicklisp/dists/quicklisp/software/cl-gss-20140826-git/cl-gss.asd: The variable C::*CC-FLAGS* is unbound.
(LOAD lfarm-common FAIL) SI:SIMPLE-PROGRAM-ERROR : In form (CONS STREAM) CONS: Wrong number of arguments
(LOAD lfarm-client FAIL) SI:SIMPLE-PROGRAM-ERROR : In form (CONS STREAM) CONS: Wrong number of arguments
(LOAD lfarm-admin FAIL) SI:SIMPLE-PROGRAM-ERROR : In form (CONS STREAM) CONS: Wrong number of arguments
ecl-13.5.1-unknown-linux-i686-lisp-to-c
(LOAD lfarm-gss FAIL) ffi-grovel, CFFI-GROVEL:GROVEL-ERROR : External process exited with code 1. Command was: "cc" "-m32" " -D_GNU_SOURCE -D_FILE_OFFSET_BITS=64 -g -O2 -fPIC -D_GNU_SOURCE -D_FILE_OFFSET_BITS=64 -g -O2 -fPIC -D_THREAD_SAFE -Dlinux" "-I/home/testgrid/cl-test-grid/work-dir/agent/quicklisp/dists/quicklisp/software/cffi_0.13.0/" "-o" "/home/testgrid/cl-test-grid/work-dir/agent/test-runs/20140830065935-ecl-13.5.1-unknown-linux-i686-lisp-to-c/fasl/ql/dists/quicklisp/software/cl-gss-20140826-git/src/gss-grovel" "/home/testgrid/cl-test-grid/work-dir/agent/test-runs/20140830065935-ecl-13.5.1-unknown-linux-i686-lisp-to-c/fasl/ql/dists/quicklisp/software/cl-gss-20140826-git/src/gss-grovel.c" Output was: <see above>
sbcl-1.1.11-linux-x86
(LOAD lfarm-gss FAIL) ffi-grovel, CFFI-GROVEL:GROVEL-ERROR : External process exited with code 1. Command was: "cc" "-m32" "-I/home/testgrid/cl-test-grid/work-dir/agent/quicklisp/dists/quicklisp/software/cffi_0.13.0/" "-o" "/home/testgrid/cl-test-grid/work-dir/agent/test-runs/20140916033343-sbcl-1.1.11-linux-x86/fasl/ql/dists/quicklisp/software/cl-gss-20140914-git/src/gss-grovel" "/home/testgrid/cl-test-grid/work-dir/agent/test-runs/20140916033343-sbcl-1.1.11-linux-x86/fasl/ql/dists/quicklisp/software/cl-gss-20140914-git/src/gss-grovel.c" Output was: /home/testgrid/cl-test-grid/work-dir/agent/test-runs/20140916033343-sbcl-1.1.11-linux-x86/fasl/ql/dists/quicklisp/software/cl-gss-20140914-git/src/gss-grovel.c:6:27: fatal error: gssapi/gssapi.h: No such file or directory compilation terminated.
(LOAD lfarm-gss FAIL) ffi-grovel, CFFI-GROVEL:GROVEL-ERROR : External process exited with code 1. Command was: "cc" "-m32" "-I/home/testgrid/cl-test-grid/work-dir/agent/quicklisp/dists/quicklisp/software/cffi_0.13.0/" "-o" "/home/testgrid/cl-test-grid/work-dir/agent/test-runs/20140828045115-sbcl-1.1.11-linux-x86/fasl/ql/dists/quicklisp/software/cl-gss-20140826-git/src/gss-grovel" "/home/testgrid/cl-test-grid/work-dir/agent/test-runs/20140828045115-sbcl-1.1.11-linux-x86/fasl/ql/dists/quicklisp/software/cl-gss-20140826-git/src/gss-grovel.c" Output was: /home/testgrid/cl-test-grid/work-dir/agent/test-runs/20140828045115-sbcl-1.1.11-linux-x86/fasl/ql/dists/quicklisp/software/cl-gss-20140826-git/src/gss-grovel.c:6:27: fatal error: gssapi/gssapi.h: No such file or directory compilation terminated.
sbcl-1.1.16-linux-x86
(LOAD lfarm-gss FAIL) ffi-grovel, CFFI-GROVEL:GROVEL-ERROR : External process exited with code 1. Command was: "cc" "-m32" "-I/home/testgrid/cl-test-grid/work-dir/agent/quicklisp/dists/quicklisp/software/cffi_0.13.0/" "-o" "/home/testgrid/cl-test-grid/work-dir/agent/test-runs/20140915202623-sbcl-1.1.16-linux-x86/fasl/ql/dists/quicklisp/software/cl-gss-20140914-git/src/gss-grovel" "/home/testgrid/cl-test-grid/work-dir/agent/test-runs/20140915202623-sbcl-1.1.16-linux-x86/fasl/ql/dists/quicklisp/software/cl-gss-20140914-git/src/gss-grovel.c" Output was: /home/testgrid/cl-test-grid/work-dir/agent/test-runs/20140915202623-sbcl-1.1.16-linux-x86/fasl/ql/dists/quicklisp/software/cl-gss-20140914-git/src/gss-grovel.c:6:27: fatal error: gssapi/gssapi.h: No such file or directory compilation terminated.
(LOAD lfarm-gss FAIL) ffi-grovel, CFFI-GROVEL:GROVEL-ERROR : External process exited with code 1. Command was: "cc" "-m32" "-I/home/testgrid/cl-test-grid/work-dir/agent/quicklisp/dists/quicklisp/software/cffi_0.13.0/" "-o" "/home/testgrid/cl-test-grid/work-dir/agent/test-runs/20140827205823-sbcl-1.1.16-linux-x86/fasl/ql/dists/quicklisp/software/cl-gss-20140826-git/src/gss-grovel" "/home/testgrid/cl-test-grid/work-dir/agent/test-runs/20140827205823-sbcl-1.1.16-linux-x86/fasl/ql/dists/quicklisp/software/cl-gss-20140826-git/src/gss-grovel.c" Output was: /home/testgrid/cl-test-grid/work-dir/agent/test-runs/20140827205823-sbcl-1.1.16-linux-x86/fasl/ql/dists/quicklisp/software/cl-gss-20140826-git/src/gss-grovel.c:6:27: fatal error: gssapi/gssapi.h: No such file or directory compilation terminated.
sbcl-1.2.0.debian-linux-x64
sbcl-1.2.3-linux-x64
(LOAD lfarm-gss FAIL) ffi-grovel, CFFI-GROVEL:GROVEL-ERROR : External process exited with code 1. Command was: "cc" "-m64" "-I/home/hijarian/systems/cl-test-grid/work-dir/agent/quicklisp/dists/quicklisp/software/cffi_0.13.0/" "-o" "/home/hijarian/systems/cl-test-grid/work-dir/agent/test-runs/20140915163602-sbcl-1.2.3-linux-x64/fasl/ql/dists/quicklisp/software/cl-gss-20140914-git/src/gss-grovel" "/home/hijarian/systems/cl-test-grid/work-dir/agent/test-runs/20140915163602-sbcl-1.2.3-linux-x64/fasl/ql/dists/quicklisp/software/cl-gss-20140914-git/src/gss-grovel.c" Output was: /home/hijarian/systems/cl-test-grid/work-dir/agent/test-runs/20140915163602-sbcl-1.2.3-linux-x64/fasl/ql/dists/quicklisp/software/cl-gss-20140914-git/src/gss-grovel.c:6:27: fatal error: gssapi/gssapi.h: Нет такого файла или каталога compilation terminated.
(LOAD lfarm-gss FAIL) ffi-grovel, CFFI-GROVEL:GROVEL-ERROR : External process exited with code 1. Command was: "cc" "-m64" "-I/home/hijarian/systems/cl-test-grid/work-dir/agent/quicklisp/dists/quicklisp/software/cffi_0.13.0/" "-o" "/home/hijarian/systems/cl-test-grid/work-dir/agent/test-runs/20140908100955-sbcl-1.2.3-linux-x64/fasl/ql/dists/quicklisp/software/cl-gss-20140826-git/src/gss-grovel" "/home/hijarian/systems/cl-test-grid/work-dir/agent/test-runs/20140908100955-sbcl-1.2.3-linux-x64/fasl/ql/dists/quicklisp/software/cl-gss-20140826-git/src/gss-grovel.c" Output was: /home/hijarian/systems/cl-test-grid/work-dir/agent/test-runs/20140908100955-sbcl-1.2.3-linux-x64/fasl/ql/dists/quicklisp/software/cl-gss-20140826-git/src/gss-grovel.c:6:27: fatal error: gssapi/gssapi.h: Нет такого файла или каталога compilation terminated.

Breakdown by testcases: for every failed testcase the lisp implmentations it fails on

The library does not have a testsuite adapter for CL Test Grid.

To reports overview

Generated at: 2014-09-27 20:10:00 GMT.