common-lisp-stat results collected by cl-test-grid

Results on the last two Quicklisp distributions

 quicklisp 2015-01-13quicklisp 2014-12-17
abcl-1.2.1-fasl42-linux-x86
(LOAD cls FAIL) ASDF/FIND-SYSTEM:LOAD-SYSTEM-DEFINITION-ERROR : Error while trying to load definition for system gsll from pathname /home/testgrid/cl-test-grid/work-dir/agent/quicklisp/dists/quicklisp/software/gsll-20140211-git/gsll.asd: External process exited with code 1. Command was: "cc" "-m32" "-I/home/testgrid/cl-test-grid/work-dir/agent/quicklisp/dists/quicklisp/software/cffi_0.14.0/" "-o" "/home/testgrid/cl-test-grid/work-dir/agent/test-runs/20150118045741-abcl-1.2.1-fasl42-linux-x86/fasl/ql/dists/quicklisp/software/cffi_0.14.0/libffi/libffi-unix" "/home/testgrid/cl-test-grid/work-dir/agent/test-runs/20150118045741-abcl-1.2.1-fasl42-linux-x86/fasl/ql/dists/quicklisp/software/cffi_0.14.0/libffi/libffi-unix.c" Output was: /home/testgrid/cl-test-grid/work-dir/agent/test-runs/20150118045741-abcl-1.2.1-fasl42-linux-x86/fasl/ql/dists/quicklisp/software/cffi_0.14.0/libffi/libffi-unix.c:7:17: fatal error: ffi.h: No such file or directory compilation terminated.
(LOAD cls FAIL) ASDF/FIND-SYSTEM:LOAD-SYSTEM-DEFINITION-ERROR : Error while trying to load definition for system gsll from pathname /home/testgrid/cl-test-grid/work-dir/agent/quicklisp/dists/quicklisp/software/gsll-20140211-git/gsll.asd: External process exited with code 1. Command was: "cc" "-m32" "-I/home/testgrid/cl-test-grid/work-dir/agent/quicklisp/dists/quicklisp/software/cffi_0.14.0/" "-o" "/home/testgrid/cl-test-grid/work-dir/agent/test-runs/20141223090506-abcl-1.2.1-fasl42-linux-x86/fasl/ql/dists/quicklisp/software/cffi_0.14.0/libffi/libffi-unix" "/home/testgrid/cl-test-grid/work-dir/agent/test-runs/20141223090506-abcl-1.2.1-fasl42-linux-x86/fasl/ql/dists/quicklisp/software/cffi_0.14.0/libffi/libffi-unix.c" Output was: /home/testgrid/cl-test-grid/work-dir/agent/test-runs/20141223090506-abcl-1.2.1-fasl42-linux-x86/fasl/ql/dists/quicklisp/software/cffi_0.14.0/libffi/libffi-unix.c:7:17: fatal error: ffi.h: No such file or directory compilation terminated.
abcl-1.2.1-fasl42-macosx-x64
(LOAD cls FAIL) ffi, ASDF/FIND-SYSTEM:LOAD-SYSTEM-DEFINITION-ERROR : Error while trying to load definition for system gsll from pathname /Users/pnathan/cl-test-grid/work-dir/agent/quicklisp/dists/quicklisp/software/gsll-20140211-git/gsll.asd: Error while trying to load definition for system cffi-libffi from pathname /Users/pnathan/cl-test-grid/work-dir/agent/quicklisp/dists/quicklisp/software/cffi_0.14.0/cffi-libffi.asd: Don't know how to COMMON-LISP:REQUIRE JNA.
abcl-1.3.0-fasl42-linux-x86
(LOAD cls FAIL) ASDF/FIND-SYSTEM:LOAD-SYSTEM-DEFINITION-ERROR : Error while trying to load definition for system gsll from pathname /home/testgrid/cl-test-grid/work-dir/agent/quicklisp/dists/quicklisp/software/gsll-20140211-git/gsll.asd: External process exited with code 1. Command was: "cc" "-m32" "-I/home/testgrid/cl-test-grid/work-dir/agent/quicklisp/dists/quicklisp/software/cffi_0.14.0/" "-o" "/home/testgrid/cl-test-grid/work-dir/agent/test-runs/20150117165542-abcl-1.3.0-fasl42-linux-x86/fasl/ql/dists/quicklisp/software/cffi_0.14.0/libffi/libffi-unix" "/home/testgrid/cl-test-grid/work-dir/agent/test-runs/20150117165542-abcl-1.3.0-fasl42-linux-x86/fasl/ql/dists/quicklisp/software/cffi_0.14.0/libffi/libffi-unix.c" Output was: /home/testgrid/cl-test-grid/work-dir/agent/test-runs/20150117165542-abcl-1.3.0-fasl42-linux-x86/fasl/ql/dists/quicklisp/software/cffi_0.14.0/libffi/libffi-unix.c:7:17: fatal error: ffi.h: No such file or directory compilation terminated.
(LOAD cls FAIL) ASDF/FIND-SYSTEM:LOAD-SYSTEM-DEFINITION-ERROR : Error while trying to load definition for system gsll from pathname /home/testgrid/cl-test-grid/work-dir/agent/quicklisp/dists/quicklisp/software/gsll-20140211-git/gsll.asd: External process exited with code 1. Command was: "cc" "-m32" "-I/home/testgrid/cl-test-grid/work-dir/agent/quicklisp/dists/quicklisp/software/cffi_0.14.0/" "-o" "/home/testgrid/cl-test-grid/work-dir/agent/test-runs/20141222205246-abcl-1.3.0-fasl42-linux-x86/fasl/ql/dists/quicklisp/software/cffi_0.14.0/libffi/libffi-unix" "/home/testgrid/cl-test-grid/work-dir/agent/test-runs/20141222205246-abcl-1.3.0-fasl42-linux-x86/fasl/ql/dists/quicklisp/software/cffi_0.14.0/libffi/libffi-unix.c" Output was: /home/testgrid/cl-test-grid/work-dir/agent/test-runs/20141222205246-abcl-1.3.0-fasl42-linux-x86/fasl/ql/dists/quicklisp/software/cffi_0.14.0/libffi/libffi-unix.c:7:17: fatal error: ffi.h: No such file or directory compilation terminated.
abcl-1.3.1-fasl42-linux-x86
(LOAD cls FAIL) ASDF/FIND-SYSTEM:LOAD-SYSTEM-DEFINITION-ERROR : Error while trying to load definition for system gsll from pathname /home/testgrid/cl-test-grid/work-dir/agent/quicklisp/dists/quicklisp/software/gsll-20140211-git/gsll.asd: External process exited with code 1. Command was: "cc" "-m32" "-I/home/testgrid/cl-test-grid/work-dir/agent/quicklisp/dists/quicklisp/software/cffi_0.14.0/" "-o" "/home/testgrid/cl-test-grid/work-dir/agent/test-runs/20150116083450-abcl-1.3.1-fasl42-linux-x86/fasl/ql/dists/quicklisp/software/cffi_0.14.0/libffi/libffi-unix" "/home/testgrid/cl-test-grid/work-dir/agent/test-runs/20150116083450-abcl-1.3.1-fasl42-linux-x86/fasl/ql/dists/quicklisp/software/cffi_0.14.0/libffi/libffi-unix.c" Output was: /home/testgrid/cl-test-grid/work-dir/agent/test-runs/20150116083450-abcl-1.3.1-fasl42-linux-x86/fasl/ql/dists/quicklisp/software/cffi_0.14.0/libffi/libffi-unix.c:7:17: fatal error: ffi.h: No such file or directory compilation terminated.
(LOAD cls FAIL) ASDF/FIND-SYSTEM:LOAD-SYSTEM-DEFINITION-ERROR : Error while trying to load definition for system gsll from pathname /home/testgrid/cl-test-grid/work-dir/agent/quicklisp/dists/quicklisp/software/gsll-20140211-git/gsll.asd: External process exited with code 1. Command was: "cc" "-m32" "-I/home/testgrid/cl-test-grid/work-dir/agent/quicklisp/dists/quicklisp/software/cffi_0.14.0/" "-o" "/home/testgrid/cl-test-grid/work-dir/agent/test-runs/20141222064341-abcl-1.3.1-fasl42-linux-x86/fasl/ql/dists/quicklisp/software/cffi_0.14.0/libffi/libffi-unix" "/home/testgrid/cl-test-grid/work-dir/agent/test-runs/20141222064341-abcl-1.3.1-fasl42-linux-x86/fasl/ql/dists/quicklisp/software/cffi_0.14.0/libffi/libffi-unix.c" Output was: /home/testgrid/cl-test-grid/work-dir/agent/test-runs/20141222064341-abcl-1.3.1-fasl42-linux-x86/fasl/ql/dists/quicklisp/software/cffi_0.14.0/libffi/libffi-unix.c:7:17: fatal error: ffi.h: No such file or directory compilation terminated.
ccl-1.10-r16196-f96-linux-x64
(LOAD cls FAIL) ffi, CFFI:LOAD-FOREIGN-LIBRARY-ERROR : Unable to load foreign library (LIBBLAS.SO-10610). Error opening shared library libblas.so : libblas.so: cannot open shared object file: No such file or directory.
(LOAD cls FAIL) ASDF/FIND-SYSTEM:LOAD-SYSTEM-DEFINITION-ERROR : Error while trying to load definition for system gsll from pathname /home/hijarian/systems/cl-test-grid/work-dir/agent/quicklisp/dists/quicklisp/software/gsll-20140211-git/gsll.asd: External process exited with code 1. Command was: "cc" "-m64" "-I/home/hijarian/systems/cl-test-grid/work-dir/agent/quicklisp/dists/quicklisp/software/cffi_0.14.0/" "-o" "/home/hijarian/systems/cl-test-grid/work-dir/agent/test-runs/20141218093601-ccl-1.10-r16196-f96-linux-x64/fasl/ql/dists/quicklisp/software/cffi_0.14.0/libffi/libffi-unix" "/home/hijarian/systems/cl-test-grid/work-dir/agent/test-runs/20141218093601-ccl-1.10-r16196-f96-linux-x64/fasl/ql/dists/quicklisp/software/cffi_0.14.0/libffi/libffi-unix.c" Output was: /home/hijarian/systems/cl-test-grid/work-dir/agent/test-runs/20141218093601-ccl-1.10-r16196-f96-linux-x64/fasl/ql/dists/quicklisp/software/cffi_0.14.0/libffi/libffi-unix.c:7:17: fatal error: ffi.h: Нет такого файла или каталога #include <ffi.h> ^ compilation terminated.
ccl-1.10-r16196-f96-linux-x86
(LOAD cls FAIL) ASDF/FIND-SYSTEM:LOAD-SYSTEM-DEFINITION-ERROR : Error while trying to load definition for system gsll from pathname /home/testgrid/cl-test-grid/work-dir/agent/quicklisp/dists/quicklisp/software/gsll-20140211-git/gsll.asd: External process exited with code 1. Command was: "cc" "-m32" "-I/home/testgrid/cl-test-grid/work-dir/agent/quicklisp/dists/quicklisp/software/cffi_0.14.0/" "-o" "/home/testgrid/cl-test-grid/work-dir/agent/test-runs/20150115181501-ccl-1.10-r16196-f96-linux-x86/fasl/ql/dists/quicklisp/software/cffi_0.14.0/libffi/libffi-unix" "/home/testgrid/cl-test-grid/work-dir/agent/test-runs/20150115181501-ccl-1.10-r16196-f96-linux-x86/fasl/ql/dists/quicklisp/software/cffi_0.14.0/libffi/libffi-unix.c" Output was: /home/testgrid/cl-test-grid/work-dir/agent/test-runs/20150115181501-ccl-1.10-r16196-f96-linux-x86/fasl/ql/dists/quicklisp/software/cffi_0.14.0/libffi/libffi-unix.c:7:17: fatal error: ffi.h: No such file or directory compilation terminated.
(LOAD cls FAIL) ASDF/FIND-SYSTEM:LOAD-SYSTEM-DEFINITION-ERROR : Error while trying to load definition for system gsll from pathname /home/testgrid/cl-test-grid/work-dir/agent/quicklisp/dists/quicklisp/software/gsll-20140211-git/gsll.asd: External process exited with code 1. Command was: "cc" "-m32" "-I/home/testgrid/cl-test-grid/work-dir/agent/quicklisp/dists/quicklisp/software/cffi_0.14.0/" "-o" "/home/testgrid/cl-test-grid/work-dir/agent/test-runs/20141220165914-ccl-1.10-r16196-f96-linux-x86/fasl/ql/dists/quicklisp/software/cffi_0.14.0/libffi/libffi-unix" "/home/testgrid/cl-test-grid/work-dir/agent/test-runs/20141220165914-ccl-1.10-r16196-f96-linux-x86/fasl/ql/dists/quicklisp/software/cffi_0.14.0/libffi/libffi-unix.c" Output was: /home/testgrid/cl-test-grid/work-dir/agent/test-runs/20141220165914-ccl-1.10-r16196-f96-linux-x86/fasl/ql/dists/quicklisp/software/cffi_0.14.0/libffi/libffi-unix.c:7:17: fatal error: ffi.h: No such file or directory compilation terminated.
ccl-1.8-r15286m-f95-linux-x86
(LOAD cls FAIL) ASDF:LOAD-SYSTEM-DEFINITION-ERROR : Error while trying to load definition for system antik from pathname /home/testgrid/cl-test-grid/work-dir/agent/quicklisp/dists/quicklisp/software/antik-20140211-git/antik.asd: Error while trying to load definition for system static-vectors from pathname /home/testgrid/cl-test-grid/work-dir/agent/quicklisp/dists/quicklisp/software/static-vectors-1.6/static-vectors.asd: You need ASDF >= 2.32 to load this system correctly.
(LOAD cls FAIL) ASDF:LOAD-SYSTEM-DEFINITION-ERROR : Error while trying to load definition for system antik from pathname /home/testgrid/cl-test-grid/work-dir/agent/quicklisp/dists/quicklisp/software/antik-20140211-git/antik.asd: Error while trying to load definition for system static-vectors from pathname /home/testgrid/cl-test-grid/work-dir/agent/quicklisp/dists/quicklisp/software/static-vectors-1.6/static-vectors.asd: You need ASDF >= 2.32 to load this system correctly.
ccl-1.9-r15756-f96-linux-x86
(LOAD cls FAIL) ASDF/FIND-SYSTEM:LOAD-SYSTEM-DEFINITION-ERROR : Error while trying to load definition for system gsll from pathname /home/testgrid/cl-test-grid/work-dir/agent/quicklisp/dists/quicklisp/software/gsll-20140211-git/gsll.asd: External process exited with code 1. Command was: "cc" "-m32" "-I/home/testgrid/cl-test-grid/work-dir/agent/quicklisp/dists/quicklisp/software/cffi_0.14.0/" "-o" "/home/testgrid/cl-test-grid/work-dir/agent/test-runs/20150116223726-ccl-1.9-r15756-f96-linux-x86/fasl/ql/dists/quicklisp/software/cffi_0.14.0/libffi/libffi-unix" "/home/testgrid/cl-test-grid/work-dir/agent/test-runs/20150116223726-ccl-1.9-r15756-f96-linux-x86/fasl/ql/dists/quicklisp/software/cffi_0.14.0/libffi/libffi-unix.c" Output was: /home/testgrid/cl-test-grid/work-dir/agent/test-runs/20150116223726-ccl-1.9-r15756-f96-linux-x86/fasl/ql/dists/quicklisp/software/cffi_0.14.0/libffi/libffi-unix.c:7:17: fatal error: ffi.h: No such file or directory compilation terminated.
(LOAD cls FAIL) ASDF/FIND-SYSTEM:LOAD-SYSTEM-DEFINITION-ERROR : Error while trying to load definition for system gsll from pathname /home/testgrid/cl-test-grid/work-dir/agent/quicklisp/dists/quicklisp/software/gsll-20140211-git/gsll.asd: External process exited with code 1. Command was: "cc" "-m32" "-I/home/testgrid/cl-test-grid/work-dir/agent/quicklisp/dists/quicklisp/software/cffi_0.14.0/" "-o" "/home/testgrid/cl-test-grid/work-dir/agent/test-runs/20141220132933-ccl-1.9-r15756-f96-linux-x86/fasl/ql/dists/quicklisp/software/cffi_0.14.0/libffi/libffi-unix" "/home/testgrid/cl-test-grid/work-dir/agent/test-runs/20141220132933-ccl-1.9-r15756-f96-linux-x86/fasl/ql/dists/quicklisp/software/cffi_0.14.0/libffi/libffi-unix.c" Output was: /home/testgrid/cl-test-grid/work-dir/agent/test-runs/20141220132933-ccl-1.9-r15756-f96-linux-x86/fasl/ql/dists/quicklisp/software/cffi_0.14.0/libffi/libffi-unix.c:7:17: fatal error: ffi.h: No such file or directory compilation terminated.
clisp-2.49-unix-x64
(LOAD cls FAIL) SYSTEM::SIMPLE-PACKAGE-ERROR : EXPORT(COMMON-LISP:TIME): #<PACKAGE COMMON-LISP> заблокирован
(LOAD cls FAIL) ASDF:LOAD-SYSTEM-DEFINITION-ERROR : Error while trying to load definition for system gsll from pathname /home/hijarian/systems/cl-test-grid/work-dir/agent/quicklisp/dists/quicklisp/software/gsll-20140211-git/gsll.asd: External process exited with code 1. Command was: "cc" "-m64" "-I/home/hijarian/systems/cl-test-grid/work-dir/agent/quicklisp/dists/quicklisp/software/cffi_0.14.0/" "-o" "/home/hijarian/systems/cl-test-grid/work-dir/agent/test-runs/20141218073936-clisp-2.49-unix-x64/fasl/ql/dists/quicklisp/software/cffi_0.14.0/libffi/libffi-unix" "/home/hijarian/systems/cl-test-grid/work-dir/agent/test-runs/20141218073936-clisp-2.49-unix-x64/fasl/ql/dists/quicklisp/software/cffi_0.14.0/libffi/libffi-unix.c" Output was: <see above>
clisp-2.49-unix-x86
(LOAD cls FAIL) ASDF:LOAD-SYSTEM-DEFINITION-ERROR : Error while trying to load definition for system gsll from pathname /home/testgrid/cl-test-grid/work-dir/agent/quicklisp/dists/quicklisp/software/gsll-20140211-git/gsll.asd: External process exited with code 1. Command was: "cc" "-m32" "-I/home/testgrid/cl-test-grid/work-dir/agent/quicklisp/dists/quicklisp/software/cffi_0.14.0/" "-o" "/home/testgrid/cl-test-grid/work-dir/agent/test-runs/20150115234651-clisp-2.49-unix-x86/fasl/ql/dists/quicklisp/software/cffi_0.14.0/libffi/libffi-unix" "/home/testgrid/cl-test-grid/work-dir/agent/test-runs/20150115234651-clisp-2.49-unix-x86/fasl/ql/dists/quicklisp/software/cffi_0.14.0/libffi/libffi-unix.c" Output was: <see above>
(LOAD cls FAIL) ASDF:LOAD-SYSTEM-DEFINITION-ERROR : Error while trying to load definition for system gsll from pathname /home/testgrid/cl-test-grid/work-dir/agent/quicklisp/dists/quicklisp/software/gsll-20140211-git/gsll.asd: External process exited with code 1. Command was: "cc" "-m32" "-I/home/testgrid/cl-test-grid/work-dir/agent/quicklisp/dists/quicklisp/software/cffi_0.14.0/" "-o" "/home/testgrid/cl-test-grid/work-dir/agent/test-runs/20141221222621-clisp-2.49-unix-x86/fasl/ql/dists/quicklisp/software/cffi_0.14.0/libffi/libffi-unix" "/home/testgrid/cl-test-grid/work-dir/agent/test-runs/20141221222621-clisp-2.49-unix-x86/fasl/ql/dists/quicklisp/software/cffi_0.14.0/libffi/libffi-unix.c" Output was: <see above>
cmu-snapshot-2013-04__20d_unicode_-linux-x86
(LOAD cls FAIL) ASDF/FIND-SYSTEM:LOAD-SYSTEM-DEFINITION-ERROR : Error while trying to load definition for system gsll from pathname /home/testgrid/cl-test-grid/work-dir/agent/quicklisp/dists/quicklisp/software/gsll-20140211-git/gsll.asd: Error in function CFFI-GROVEL:GROVEL-ERROR: External process exited with code 1. Command was: "cc" "-m32" "-I/home/testgrid/cl-test-grid/work-dir/agent/quicklisp/dists/quicklisp/software/cffi_0.14.0/" "-o" "/home/testgrid/cl-test-grid/work-dir/agent/test-runs/20150117141357-cmu-snapshot-2013-04__20d_unicode_-linux-x86/fasl/ql/dists/quicklisp/software/cffi_0.14.0/libffi/libffi-unix" "/home/testgrid/cl-test-grid/work-dir/agent/test-runs/20150117141357-cmu-snapshot-2013-04__20d_unicode_-linux-x86/fasl/ql/dists/quicklisp/software/cffi_0.14.0/libffi/libffi-unix.c" Output was: /home/testgrid/cl-test-grid/work-dir/agent/test-runs/20150117141357-cmu-snapshot-2013-04__20d_unicode_-linux-x86/fasl/ql/dists/quicklisp/software/cffi_0.14.0/libffi/libffi-unix.c:7:17: fatal error: ffi.h: No such file or directory compilation terminated.
(LOAD cls FAIL) ASDF/FIND-SYSTEM:LOAD-SYSTEM-DEFINITION-ERROR : Error while trying to load definition for system gsll from pathname /home/testgrid/cl-test-grid/work-dir/agent/quicklisp/dists/quicklisp/software/gsll-20140211-git/gsll.asd: Error in function CFFI-GROVEL:GROVEL-ERROR: External process exited with code 1. Command was: "cc" "-m32" "-I/home/testgrid/cl-test-grid/work-dir/agent/quicklisp/dists/quicklisp/software/cffi_0.14.0/" "-o" "/home/testgrid/cl-test-grid/work-dir/agent/test-runs/20141221120518-cmu-snapshot-2013-04__20d_unicode_-linux-x86/fasl/ql/dists/quicklisp/software/cffi_0.14.0/libffi/libffi-unix" "/home/testgrid/cl-test-grid/work-dir/agent/test-runs/20141221120518-cmu-snapshot-2013-04__20d_unicode_-linux-x86/fasl/ql/dists/quicklisp/software/cffi_0.14.0/libffi/libffi-unix.c" Output was: /home/testgrid/cl-test-grid/work-dir/agent/test-runs/20141221120518-cmu-snapshot-2013-04__20d_unicode_-linux-x86/fasl/ql/dists/quicklisp/software/cffi_0.14.0/libffi/libffi-unix.c:7:17: fatal error: ffi.h: No such file or directory compilation terminated.
cmu-snapshot-2014-01__20e_unicode_-linux-x86
(LOAD cls FAIL) ASDF/FIND-SYSTEM:LOAD-SYSTEM-DEFINITION-ERROR : Error while trying to load definition for system gsll from pathname /home/testgrid/cl-test-grid/work-dir/agent/quicklisp/dists/quicklisp/software/gsll-20140211-git/gsll.asd: Error in function CFFI-GROVEL:GROVEL-ERROR: External process exited with code 1. Command was: "cc" "-m32" "-I/home/testgrid/cl-test-grid/work-dir/agent/quicklisp/dists/quicklisp/software/cffi_0.14.0/" "-o" "/home/testgrid/cl-test-grid/work-dir/agent/test-runs/20150117114544-cmu-snapshot-2014-01__20e_unicode_-linux-x86/fasl/ql/dists/quicklisp/software/cffi_0.14.0/libffi/libffi-unix" "/home/testgrid/cl-test-grid/work-dir/agent/test-runs/20150117114544-cmu-snapshot-2014-01__20e_unicode_-linux-x86/fasl/ql/dists/quicklisp/software/cffi_0.14.0/libffi/libffi-unix.c" Output was: /home/testgrid/cl-test-grid/work-dir/agent/test-runs/20150117114544-cmu-snapshot-2014-01__20e_unicode_-linux-x86/fasl/ql/dists/quicklisp/software/cffi_0.14.0/libffi/libffi-unix.c:7:17: fatal error: ffi.h: No such file or directory compilation terminated.
(LOAD cls FAIL) ASDF/FIND-SYSTEM:LOAD-SYSTEM-DEFINITION-ERROR : Error while trying to load definition for system gsll from pathname /home/testgrid/cl-test-grid/work-dir/agent/quicklisp/dists/quicklisp/software/gsll-20140211-git/gsll.asd: Error in function CFFI-GROVEL:GROVEL-ERROR: External process exited with code 1. Command was: "cc" "-m32" "-I/home/testgrid/cl-test-grid/work-dir/agent/quicklisp/dists/quicklisp/software/cffi_0.14.0/" "-o" "/home/testgrid/cl-test-grid/work-dir/agent/test-runs/20141221145826-cmu-snapshot-2014-01__20e_unicode_-linux-x86/fasl/ql/dists/quicklisp/software/cffi_0.14.0/libffi/libffi-unix" "/home/testgrid/cl-test-grid/work-dir/agent/test-runs/20141221145826-cmu-snapshot-2014-01__20e_unicode_-linux-x86/fasl/ql/dists/quicklisp/software/cffi_0.14.0/libffi/libffi-unix.c" Output was: /home/testgrid/cl-test-grid/work-dir/agent/test-runs/20141221145826-cmu-snapshot-2014-01__20e_unicode_-linux-x86/fasl/ql/dists/quicklisp/software/cffi_0.14.0/libffi/libffi-unix.c:7:17: fatal error: ffi.h: No such file or directory compilation terminated.
cmu-snapshot-2014-05-dirty__20e_unicode_-linux-x86
(LOAD cls FAIL) ASDF/FIND-SYSTEM:LOAD-SYSTEM-DEFINITION-ERROR : Error while trying to load definition for system gsll from pathname /home/testgrid/cl-test-grid/work-dir/agent/quicklisp/dists/quicklisp/software/gsll-20140211-git/gsll.asd: Error in function CFFI-GROVEL:GROVEL-ERROR: External process exited with code 1. Command was: "cc" "-m32" "-I/home/testgrid/cl-test-grid/work-dir/agent/quicklisp/dists/quicklisp/software/cffi_0.14.0/" "-o" "/home/testgrid/cl-test-grid/work-dir/agent/test-runs/20150117091608-cmu-snapshot-2014-05-dirty__20e_unicode_-linux-x86/fasl/ql/dists/quicklisp/software/cffi_0.14.0/libffi/libffi-unix" "/home/testgrid/cl-test-grid/work-dir/agent/test-runs/20150117091608-cmu-snapshot-2014-05-dirty__20e_unicode_-linux-x86/fasl/ql/dists/quicklisp/software/cffi_0.14.0/libffi/libffi-unix.c" Output was: /home/testgrid/cl-test-grid/work-dir/agent/test-runs/20150117091608-cmu-snapshot-2014-05-dirty__20e_unicode_-linux-x86/fasl/ql/dists/quicklisp/software/cffi_0.14.0/libffi/libffi-unix.c:7:17: fatal error: ffi.h: No such file or directory compilation terminated.
(LOAD cls FAIL) ASDF/FIND-SYSTEM:LOAD-SYSTEM-DEFINITION-ERROR : Error while trying to load definition for system gsll from pathname /home/testgrid/cl-test-grid/work-dir/agent/quicklisp/dists/quicklisp/software/gsll-20140211-git/gsll.asd: Error in function CFFI-GROVEL:GROVEL-ERROR: External process exited with code 1. Command was: "cc" "-m32" "-I/home/testgrid/cl-test-grid/work-dir/agent/quicklisp/dists/quicklisp/software/cffi_0.14.0/" "-o" "/home/testgrid/cl-test-grid/work-dir/agent/test-runs/20141221173050-cmu-snapshot-2014-05-dirty__20e_unicode_-linux-x86/fasl/ql/dists/quicklisp/software/cffi_0.14.0/libffi/libffi-unix" "/home/testgrid/cl-test-grid/work-dir/agent/test-runs/20141221173050-cmu-snapshot-2014-05-dirty__20e_unicode_-linux-x86/fasl/ql/dists/quicklisp/software/cffi_0.14.0/libffi/libffi-unix.c" Output was: /home/testgrid/cl-test-grid/work-dir/agent/test-runs/20141221173050-cmu-snapshot-2014-05-dirty__20e_unicode_-linux-x86/fasl/ql/dists/quicklisp/software/cffi_0.14.0/libffi/libffi-unix.c:7:17: fatal error: ffi.h: No such file or directory compilation terminated.
cmu-snapshot-2014-12___20f_unicode_-linux-x86
(LOAD cls FAIL) ASDF/FIND-SYSTEM:LOAD-SYSTEM-DEFINITION-ERROR : Error while trying to load definition for system gsll from pathname /home/testgrid/cl-test-grid/work-dir/agent/quicklisp/dists/quicklisp/software/gsll-20140211-git/gsll.asd: Error in function CFFI-GROVEL:GROVEL-ERROR: External process exited with code 1. Command was: "cc" "-m32" "-I/home/testgrid/cl-test-grid/work-dir/agent/quicklisp/dists/quicklisp/software/cffi_0.14.0/" "-o" "/home/testgrid/cl-test-grid/work-dir/agent/test-runs/20150115212044-cmu-snapshot-2014-12___20f_unicode_-linux-x86/fasl/ql/dists/quicklisp/software/cffi_0.14.0/libffi/libffi-unix" "/home/testgrid/cl-test-grid/work-dir/agent/test-runs/20150115212044-cmu-snapshot-2014-12___20f_unicode_-linux-x86/fasl/ql/dists/quicklisp/software/cffi_0.14.0/libffi/libffi-unix.c" Output was: /home/testgrid/cl-test-grid/work-dir/agent/test-runs/20150115212044-cmu-snapshot-2014-12___20f_unicode_-linux-x86/fasl/ql/dists/quicklisp/software/cffi_0.14.0/libffi/libffi-unix.c:7:17: fatal error: ffi.h: No such file or directory compilation terminated.
(LOAD cls FAIL) ASDF/FIND-SYSTEM:LOAD-SYSTEM-DEFINITION-ERROR : Error while trying to load definition for system gsll from pathname /home/testgrid/cl-test-grid/work-dir/agent/quicklisp/dists/quicklisp/software/gsll-20140211-git/gsll.asd: Error in function CFFI-GROVEL:GROVEL-ERROR: External process exited with code 1. Command was: "cc" "-m32" "-I/home/testgrid/cl-test-grid/work-dir/agent/quicklisp/dists/quicklisp/software/cffi_0.14.0/" "-o" "/home/testgrid/cl-test-grid/work-dir/agent/test-runs/20141221200151-cmu-snapshot-2014-12___20f_unicode_-linux-x86/fasl/ql/dists/quicklisp/software/cffi_0.14.0/libffi/libffi-unix" "/home/testgrid/cl-test-grid/work-dir/agent/test-runs/20141221200151-cmu-snapshot-2014-12___20f_unicode_-linux-x86/fasl/ql/dists/quicklisp/software/cffi_0.14.0/libffi/libffi-unix.c" Output was: /home/testgrid/cl-test-grid/work-dir/agent/test-runs/20141221200151-cmu-snapshot-2014-12___20f_unicode_-linux-x86/fasl/ql/dists/quicklisp/software/cffi_0.14.0/libffi/libffi-unix.c:7:17: fatal error: ffi.h: No such file or directory compilation terminated.
ecl-13.5.1-76a84246-linux-x64-bytecode
(LOAD cls FAIL) ASDF/FIND-SYSTEM:LOAD-SYSTEM-DEFINITION-ERROR : Error while trying to load definition for system antik from pathname /home/hijarian/systems/cl-test-grid/work-dir/agent/quicklisp/dists/quicklisp/software/antik-20140211-git/antik.asd: Error while trying to load definition for system static-vectors from pathname /home/hijarian/systems/cl-test-grid/work-dir/agent/quicklisp/dists/quicklisp/software/static-vectors-1.6/static-vectors.asd: The variable C::*CC-FLAGS* is unbound.
ecl-13.5.1-76a84246-linux-x64-lisp-to-c
(LOAD cls FAIL) UIOP/LISP-BUILD:COMPILE-FILE-ERROR : COMPILE-FILE-ERROR while compiling #<cl-source-file "org.middleangle.cl-blapack" "load-blapack-libs">
(LOAD cls FAIL) ASDF/FIND-SYSTEM:LOAD-SYSTEM-DEFINITION-ERROR : Error while trying to load definition for system gsll from pathname /home/hijarian/systems/cl-test-grid/work-dir/agent/quicklisp/dists/quicklisp/software/gsll-20140211-git/gsll.asd: External process exited with code 1. Command was: "cc" "-m64" " -D_GNU_SOURCE -D_FILE_OFFSET_BITS=64 -g -O2 -fPIC -D_THREAD_SAFE -Dlinux" "-I/home/hijarian/systems/cl-test-grid/work-dir/agent/quicklisp/dists/quicklisp/software/cffi_0.14.0/" "-o" "/home/hijarian/systems/cl-test-grid/work-dir/agent/test-runs/20141218135157-ecl-13.5.1-76a84246-linux-x64-lisp-to-c/fasl/ql/dists/quicklisp/software/cffi_0.14.0/libffi/libffi-unix" "/home/hijarian/systems/cl-test-grid/work-dir/agent/test-runs/20141218135157-ecl-13.5.1-76a84246-linux-x64-lisp-to-c/fasl/ql/dists/quicklisp/software/cffi_0.14.0/libffi/libffi-unix.c" Output was: <see above>
ecl-13.5.1-unknown-linux-i686-bytecode
(LOAD cls FAIL) ASDF/FIND-SYSTEM:LOAD-SYSTEM-DEFINITION-ERROR : Error while trying to load definition for system antik from pathname /home/testgrid/cl-test-grid/work-dir/agent/quicklisp/dists/quicklisp/software/antik-20140211-git/antik.asd: Error while trying to load definition for system static-vectors from pathname /home/testgrid/cl-test-grid/work-dir/agent/quicklisp/dists/quicklisp/software/static-vectors-1.6/static-vectors.asd: The variable C::*CC-FLAGS* is unbound.
(LOAD cls FAIL) ASDF/FIND-SYSTEM:LOAD-SYSTEM-DEFINITION-ERROR : Error while trying to load definition for system antik from pathname /home/testgrid/cl-test-grid/work-dir/agent/quicklisp/dists/quicklisp/software/antik-20140211-git/antik.asd: Error while trying to load definition for system static-vectors from pathname /home/testgrid/cl-test-grid/work-dir/agent/quicklisp/dists/quicklisp/software/static-vectors-1.6/static-vectors.asd: The variable C::*CC-FLAGS* is unbound.
ecl-13.5.1-unknown-linux-i686-lisp-to-c
(LOAD cls FAIL) ASDF/FIND-SYSTEM:LOAD-SYSTEM-DEFINITION-ERROR : Error while trying to load definition for system gsll from pathname /home/testgrid/cl-test-grid/work-dir/agent/quicklisp/dists/quicklisp/software/gsll-20140211-git/gsll.asd: External process exited with code 1. Command was: "cc" "-m32" " -D_GNU_SOURCE -D_FILE_OFFSET_BITS=64 -g -O2 -fPIC -D_GNU_SOURCE -D_FILE_OFFSET_BITS=64 -g -O2 -fPIC -D_THREAD_SAFE -Dlinux" "-I/home/testgrid/cl-test-grid/work-dir/agent/quicklisp/dists/quicklisp/software/cffi_0.14.0/" "-o" "/home/testgrid/cl-test-grid/work-dir/agent/test-runs/20150116052515-ecl-13.5.1-unknown-linux-i686-lisp-to-c/fasl/ql/dists/quicklisp/software/cffi_0.14.0/libffi/libffi-unix" "/home/testgrid/cl-test-grid/work-dir/agent/test-runs/20150116052515-ecl-13.5.1-unknown-linux-i686-lisp-to-c/fasl/ql/dists/quicklisp/software/cffi_0.14.0/libffi/libffi-unix.c" Output was: <see above>
(LOAD cls FAIL) ASDF/FIND-SYSTEM:LOAD-SYSTEM-DEFINITION-ERROR : Error while trying to load definition for system gsll from pathname /home/testgrid/cl-test-grid/work-dir/agent/quicklisp/dists/quicklisp/software/gsll-20140211-git/gsll.asd: External process exited with code 1. Command was: "cc" "-m32" " -D_GNU_SOURCE -D_FILE_OFFSET_BITS=64 -g -O2 -fPIC -D_GNU_SOURCE -D_FILE_OFFSET_BITS=64 -g -O2 -fPIC -D_THREAD_SAFE -Dlinux" "-I/home/testgrid/cl-test-grid/work-dir/agent/quicklisp/dists/quicklisp/software/cffi_0.14.0/" "-o" "/home/testgrid/cl-test-grid/work-dir/agent/test-runs/20141222033526-ecl-13.5.1-unknown-linux-i686-lisp-to-c/fasl/ql/dists/quicklisp/software/cffi_0.14.0/libffi/libffi-unix" "/home/testgrid/cl-test-grid/work-dir/agent/test-runs/20141222033526-ecl-13.5.1-unknown-linux-i686-lisp-to-c/fasl/ql/dists/quicklisp/software/cffi_0.14.0/libffi/libffi-unix.c" Output was: <see above>
sbcl-1.0.58-linux-x86
(LOAD cls FAIL) ASDF:LOAD-SYSTEM-DEFINITION-ERROR : Error while trying to load definition for system antik from pathname /home/testgrid/cl-test-grid/work-dir/agent/quicklisp/dists/quicklisp/software/antik-20140211-git/antik.asd: Error while trying to load definition for system static-vectors from pathname /home/testgrid/cl-test-grid/work-dir/agent/quicklisp/dists/quicklisp/software/static-vectors-1.6/static-vectors.asd: READ error during COMPILE-FILE: You need ASDF >= 2.32 to load this system correctly. (in form starting at line: 1, column: 0, file-position: 0)
(LOAD cls FAIL) ASDF:LOAD-SYSTEM-DEFINITION-ERROR : Error while trying to load definition for system antik from pathname /home/testgrid/cl-test-grid/work-dir/agent/quicklisp/dists/quicklisp/software/antik-20140211-git/antik.asd: Error while trying to load definition for system static-vectors from pathname /home/testgrid/cl-test-grid/work-dir/agent/quicklisp/dists/quicklisp/software/static-vectors-1.6/static-vectors.asd: READ error during COMPILE-FILE: You need ASDF >= 2.32 to load this system correctly. (in form starting at line: 1, column: 0, file-position: 0)
sbcl-1.1.11-linux-x86
(LOAD cls FAIL) ASDF/FIND-SYSTEM:LOAD-SYSTEM-DEFINITION-ERROR : Error while trying to load definition for system gsll from pathname /home/testgrid/cl-test-grid/work-dir/agent/quicklisp/dists/quicklisp/software/gsll-20140211-git/gsll.asd: External process exited with code 1. Command was: "cc" "-m32" "-I/home/testgrid/cl-test-grid/work-dir/agent/quicklisp/dists/quicklisp/software/cffi_0.14.0/" "-o" "/home/testgrid/cl-test-grid/work-dir/agent/test-runs/20150117032705-sbcl-1.1.11-linux-x86/fasl/ql/dists/quicklisp/software/cffi_0.14.0/libffi/libffi-unix" "/home/testgrid/cl-test-grid/work-dir/agent/test-runs/20150117032705-sbcl-1.1.11-linux-x86/fasl/ql/dists/quicklisp/software/cffi_0.14.0/libffi/libffi-unix.c" Output was: /home/testgrid/cl-test-grid/work-dir/agent/test-runs/20150117032705-sbcl-1.1.11-linux-x86/fasl/ql/dists/quicklisp/software/cffi_0.14.0/libffi/libffi-unix.c:7:17: fatal error: ffi.h: No such file or directory compilation terminated.
(LOAD cls FAIL) ASDF/FIND-SYSTEM:LOAD-SYSTEM-DEFINITION-ERROR : Error while trying to load definition for system gsll from pathname /home/testgrid/cl-test-grid/work-dir/agent/quicklisp/dists/quicklisp/software/gsll-20140211-git/gsll.asd: External process exited with code 1. Command was: "cc" "-m32" "-I/home/testgrid/cl-test-grid/work-dir/agent/quicklisp/dists/quicklisp/software/cffi_0.14.0/" "-o" "/home/testgrid/cl-test-grid/work-dir/agent/test-runs/20141221012939-sbcl-1.1.11-linux-x86/fasl/ql/dists/quicklisp/software/cffi_0.14.0/libffi/libffi-unix" "/home/testgrid/cl-test-grid/work-dir/agent/test-runs/20141221012939-sbcl-1.1.11-linux-x86/fasl/ql/dists/quicklisp/software/cffi_0.14.0/libffi/libffi-unix.c" Output was: /home/testgrid/cl-test-grid/work-dir/agent/test-runs/20141221012939-sbcl-1.1.11-linux-x86/fasl/ql/dists/quicklisp/software/cffi_0.14.0/libffi/libffi-unix.c:7:17: fatal error: ffi.h: No such file or directory compilation terminated.
sbcl-1.1.16-linux-x86
(LOAD cls FAIL) ASDF/FIND-SYSTEM:LOAD-SYSTEM-DEFINITION-ERROR : Error while trying to load definition for system gsll from pathname /home/testgrid/cl-test-grid/work-dir/agent/quicklisp/dists/quicklisp/software/gsll-20140211-git/gsll.asd: External process exited with code 1. Command was: "cc" "-m32" "-I/home/testgrid/cl-test-grid/work-dir/agent/quicklisp/dists/quicklisp/software/cffi_0.14.0/" "-o" "/home/testgrid/cl-test-grid/work-dir/agent/test-runs/20150117014143-sbcl-1.1.16-linux-x86/fasl/ql/dists/quicklisp/software/cffi_0.14.0/libffi/libffi-unix" "/home/testgrid/cl-test-grid/work-dir/agent/test-runs/20150117014143-sbcl-1.1.16-linux-x86/fasl/ql/dists/quicklisp/software/cffi_0.14.0/libffi/libffi-unix.c" Output was: /home/testgrid/cl-test-grid/work-dir/agent/test-runs/20150117014143-sbcl-1.1.16-linux-x86/fasl/ql/dists/quicklisp/software/cffi_0.14.0/libffi/libffi-unix.c:7:17: fatal error: ffi.h: No such file or directory compilation terminated.
(LOAD cls FAIL) ASDF/FIND-SYSTEM:LOAD-SYSTEM-DEFINITION-ERROR : Error while trying to load definition for system gsll from pathname /home/testgrid/cl-test-grid/work-dir/agent/quicklisp/dists/quicklisp/software/gsll-20140211-git/gsll.asd: External process exited with code 1. Command was: "cc" "-m32" "-I/home/testgrid/cl-test-grid/work-dir/agent/quicklisp/dists/quicklisp/software/cffi_0.14.0/" "-o" "/home/testgrid/cl-test-grid/work-dir/agent/test-runs/20141220221806-sbcl-1.1.16-linux-x86/fasl/ql/dists/quicklisp/software/cffi_0.14.0/libffi/libffi-unix" "/home/testgrid/cl-test-grid/work-dir/agent/test-runs/20141220221806-sbcl-1.1.16-linux-x86/fasl/ql/dists/quicklisp/software/cffi_0.14.0/libffi/libffi-unix.c" Output was: /home/testgrid/cl-test-grid/work-dir/agent/test-runs/20141220221806-sbcl-1.1.16-linux-x86/fasl/ql/dists/quicklisp/software/cffi_0.14.0/libffi/libffi-unix.c:7:17: fatal error: ffi.h: No such file or directory compilation terminated.
sbcl-1.2.3-linux-x64
(LOAD cls FAIL) ffi, CFFI:LOAD-FOREIGN-LIBRARY-ERROR : Unable to load foreign library (LIBBLAS.SO-1). Error opening shared object "libblas.so": libblas.so: невозможно открыть разделяемый объектный файл: Нет такого файла или каталога.
(LOAD cls FAIL) ASDF/FIND-SYSTEM:LOAD-SYSTEM-DEFINITION-ERROR : Error while trying to load definition for system gsll from pathname /home/hijarian/systems/cl-test-grid/work-dir/agent/quicklisp/dists/quicklisp/software/gsll-20140211-git/gsll.asd: External process exited with code 1. Command was: "cc" "-m64" "-I/home/hijarian/systems/cl-test-grid/work-dir/agent/quicklisp/dists/quicklisp/software/cffi_0.14.0/" "-o" "/home/hijarian/systems/cl-test-grid/work-dir/agent/test-runs/20141218115532-sbcl-1.2.3-linux-x64/fasl/ql/dists/quicklisp/software/cffi_0.14.0/libffi/libffi-unix" "/home/hijarian/systems/cl-test-grid/work-dir/agent/test-runs/20141218115532-sbcl-1.2.3-linux-x64/fasl/ql/dists/quicklisp/software/cffi_0.14.0/libffi/libffi-unix.c" Output was: /home/hijarian/systems/cl-test-grid/work-dir/agent/test-runs/20141218115532-sbcl-1.2.3-linux-x64/fasl/ql/dists/quicklisp/software/cffi_0.14.0/libffi/libffi-unix.c:7:17: fatal error: ffi.h: Нет такого файла или каталога #include <ffi.h> ^ compilation terminated.
sbcl-1.2.6-linux-x86
(LOAD cls FAIL) ASDF/FIND-SYSTEM:LOAD-SYSTEM-DEFINITION-ERROR : Error while trying to load definition for system gsll from pathname /home/testgrid/cl-test-grid/work-dir/agent/quicklisp/dists/quicklisp/software/gsll-20140211-git/gsll.asd: External process exited with code 1. Command was: "cc" "-m32" "-I/home/testgrid/cl-test-grid/work-dir/agent/quicklisp/dists/quicklisp/software/cffi_0.14.0/" "-o" "/home/testgrid/cl-test-grid/work-dir/agent/test-runs/20150115162623-sbcl-1.2.6-linux-x86/fasl/ql/dists/quicklisp/software/cffi_0.14.0/libffi/libffi-unix" "/home/testgrid/cl-test-grid/work-dir/agent/test-runs/20150115162623-sbcl-1.2.6-linux-x86/fasl/ql/dists/quicklisp/software/cffi_0.14.0/libffi/libffi-unix.c" Output was: /home/testgrid/cl-test-grid/work-dir/agent/test-runs/20150115162623-sbcl-1.2.6-linux-x86/fasl/ql/dists/quicklisp/software/cffi_0.14.0/libffi/libffi-unix.c:7:17: fatal error: ffi.h: No such file or directory compilation terminated.
(LOAD cls FAIL) ASDF/FIND-SYSTEM:LOAD-SYSTEM-DEFINITION-ERROR : Error while trying to load definition for system gsll from pathname /home/testgrid/cl-test-grid/work-dir/agent/quicklisp/dists/quicklisp/software/gsll-20140211-git/gsll.asd: External process exited with code 1. Command was: "cc" "-m32" "-I/home/testgrid/cl-test-grid/work-dir/agent/quicklisp/dists/quicklisp/software/cffi_0.14.0/" "-o" "/home/testgrid/cl-test-grid/work-dir/agent/test-runs/20141220114217-sbcl-1.2.6-linux-x86/fasl/ql/dists/quicklisp/software/cffi_0.14.0/libffi/libffi-unix" "/home/testgrid/cl-test-grid/work-dir/agent/test-runs/20141220114217-sbcl-1.2.6-linux-x86/fasl/ql/dists/quicklisp/software/cffi_0.14.0/libffi/libffi-unix.c" Output was: /home/testgrid/cl-test-grid/work-dir/agent/test-runs/20141220114217-sbcl-1.2.6-linux-x86/fasl/ql/dists/quicklisp/software/cffi_0.14.0/libffi/libffi-unix.c:7:17: fatal error: ffi.h: No such file or directory compilation terminated.

Breakdown by testcases: for every failed testcase the lisp implmentations it fails on

The library does not have a testsuite adapter for CL Test Grid.

To reports overview

Generated at: 2015-01-19 17:33:46 GMT.