cl-proc results collected by cl-test-grid

Results on the last two Quicklisp distributions

 quicklisp 2014-11-06
abcl-1.2.1-fasl42-linux-x86
(LOAD proc FAIL) ffi-grovel, CFFI-GROVEL:GROVEL-ERROR : External process exited with code 1. Command was: "cc" "-m32" "-I/home/testgrid/cl-test-grid/work-dir/agent/quicklisp/dists/quicklisp/software/cffi_0.14.0/" "-o" "/home/testgrid/cl-test-grid/work-dir/agent/test-runs/20141117131245-abcl-1.2.1-fasl42-linux-x86/fasl/ql/dists/quicklisp/software/cl-proc-20101207-darcs/src/grovel-linux" "/home/testgrid/cl-test-grid/work-dir/agent/test-runs/20141117131245-abcl-1.2.1-fasl42-linux-x86/fasl/ql/dists/quicklisp/software/cl-proc-20101207-darcs/src/grovel-linux.c" Output was: /home/testgrid/cl-test-grid/work-dir/agent/test-runs/20141117131245-abcl-1.2.1-fasl42-linux-x86/fasl/ql/dists/quicklisp/software/cl-proc-20101207-darcs/src/grovel-linux.c:9:26: fatal error: proc/sysinfo.h: No such file or directory compilation terminated.
abcl-1.2.1-fasl42-macosx-x64
(LOAD proc FAIL) ffi, ASDF/FIND-SYSTEM:LOAD-SYSTEM-DEFINITION-ERROR : Error while trying to load definition for system proc from pathname /Users/pnathan/cl-test-grid/work-dir/agent/quicklisp/dists/quicklisp/software/cl-proc-20101207-darcs/src/proc.asd: Don't know how to COMMON-LISP:REQUIRE JNA.
abcl-1.3.0-fasl42-linux-x86
(LOAD proc FAIL) ffi-grovel, CFFI-GROVEL:GROVEL-ERROR : External process exited with code 1. Command was: "cc" "-m32" "-I/home/testgrid/cl-test-grid/work-dir/agent/quicklisp/dists/quicklisp/software/cffi_0.14.0/" "-o" "/home/testgrid/cl-test-grid/work-dir/agent/test-runs/20141117012126-abcl-1.3.0-fasl42-linux-x86/fasl/ql/dists/quicklisp/software/cl-proc-20101207-darcs/src/grovel-linux" "/home/testgrid/cl-test-grid/work-dir/agent/test-runs/20141117012126-abcl-1.3.0-fasl42-linux-x86/fasl/ql/dists/quicklisp/software/cl-proc-20101207-darcs/src/grovel-linux.c" Output was: /home/testgrid/cl-test-grid/work-dir/agent/test-runs/20141117012126-abcl-1.3.0-fasl42-linux-x86/fasl/ql/dists/quicklisp/software/cl-proc-20101207-darcs/src/grovel-linux.c:9:26: fatal error: proc/sysinfo.h: No such file or directory compilation terminated.
abcl-1.3.1-fasl42-linux-x86
(LOAD proc FAIL) ffi-grovel, CFFI-GROVEL:GROVEL-ERROR : External process exited with code 1. Command was: "cc" "-m32" "-I/home/testgrid/cl-test-grid/work-dir/agent/quicklisp/dists/quicklisp/software/cffi_0.14.0/" "-o" "/home/testgrid/cl-test-grid/work-dir/agent/test-runs/20141116112208-abcl-1.3.1-fasl42-linux-x86/fasl/ql/dists/quicklisp/software/cl-proc-20101207-darcs/src/grovel-linux" "/home/testgrid/cl-test-grid/work-dir/agent/test-runs/20141116112208-abcl-1.3.1-fasl42-linux-x86/fasl/ql/dists/quicklisp/software/cl-proc-20101207-darcs/src/grovel-linux.c" Output was: /home/testgrid/cl-test-grid/work-dir/agent/test-runs/20141116112208-abcl-1.3.1-fasl42-linux-x86/fasl/ql/dists/quicklisp/software/cl-proc-20101207-darcs/src/grovel-linux.c:9:26: fatal error: proc/sysinfo.h: No such file or directory compilation terminated.
ccl-1.10-r16196-f96-linux-x64
(LOAD proc FAIL) ffi-grovel, CFFI-GROVEL:GROVEL-ERROR : External process exited with code 1. Command was: "cc" "-m64" "-I/home/hijarian/systems/cl-test-grid/work-dir/agent/quicklisp/dists/quicklisp/software/cffi_0.14.0/" "-o" "/home/hijarian/systems/cl-test-grid/work-dir/agent/test-runs/20141119112401-ccl-1.10-r16196-f96-linux-x64/fasl/ql/dists/quicklisp/software/cl-proc-20101207-darcs/src/grovel-linux" "/home/hijarian/systems/cl-test-grid/work-dir/agent/test-runs/20141119112401-ccl-1.10-r16196-f96-linux-x64/fasl/ql/dists/quicklisp/software/cl-proc-20101207-darcs/src/grovel-linux.c" Output was: /home/hijarian/systems/cl-test-grid/work-dir/agent/test-runs/20141119112401-ccl-1.10-r16196-f96-linux-x64/fasl/ql/dists/quicklisp/software/cl-proc-20101207-darcs/src/grovel-linux.c:9:26: fatal error: proc/sysinfo.h: Нет такого файла или каталога #include <proc/sysinfo.h> ^ compilation terminated.
ccl-1.8-r15286m-f95-linux-x86
(LOAD proc FAIL) ffi-grovel, CFFI-GROVEL:GROVEL-ERROR : External process exited with code 1. Command was: "cc" "-m32" "-I/home/testgrid/cl-test-grid/work-dir/agent/quicklisp/dists/quicklisp/software/cffi_0.14.0/" "-o" "/home/testgrid/cl-test-grid/work-dir/agent/test-runs/20141115164752-ccl-1.8-r15286m-f95-linux-x86/fasl/ql/dists/quicklisp/software/cl-proc-20101207-darcs/src/grovel-linux" "/home/testgrid/cl-test-grid/work-dir/agent/test-runs/20141115164752-ccl-1.8-r15286m-f95-linux-x86/fasl/ql/dists/quicklisp/software/cl-proc-20101207-darcs/src/grovel-linux.c" Output was: /home/testgrid/cl-test-grid/work-dir/agent/test-runs/20141115164752-ccl-1.8-r15286m-f95-linux-x86/fasl/ql/dists/quicklisp/software/cl-proc-20101207-darcs/src/grovel-linux.c:9:26: fatal error: proc/sysinfo.h: No such file or directory compilation terminated.
ccl-1.9-r15756-f96-linux-x86
(LOAD proc FAIL) ffi-grovel, CFFI-GROVEL:GROVEL-ERROR : External process exited with code 1. Command was: "cc" "-m32" "-I/home/testgrid/cl-test-grid/work-dir/agent/quicklisp/dists/quicklisp/software/cffi_0.14.0/" "-o" "/home/testgrid/cl-test-grid/work-dir/agent/test-runs/20141115074638-ccl-1.9-r15756-f96-linux-x86/fasl/ql/dists/quicklisp/software/cl-proc-20101207-darcs/src/grovel-linux" "/home/testgrid/cl-test-grid/work-dir/agent/test-runs/20141115074638-ccl-1.9-r15756-f96-linux-x86/fasl/ql/dists/quicklisp/software/cl-proc-20101207-darcs/src/grovel-linux.c" Output was: /home/testgrid/cl-test-grid/work-dir/agent/test-runs/20141115074638-ccl-1.9-r15756-f96-linux-x86/fasl/ql/dists/quicklisp/software/cl-proc-20101207-darcs/src/grovel-linux.c:9:26: fatal error: proc/sysinfo.h: No such file or directory compilation terminated.
ccl-1.9-r15758-f96-macosx-x86
(LOAD proc FAIL) ffi-grovel, CFFI-GROVEL:GROVEL-ERROR : External process exited with code 1. Command was: "cc" "-m32" "-I" "/opt/local/include/" "-I/Users/pnathan/cl-test-grid/work-dir/agent/quicklisp/dists/quicklisp/software/cffi_0.14.0/" "-o" "/Users/pnathan/cl-test-grid/work-dir/agent/test-runs/20141128034202-ccl-1.9-r15758-f96-macosx-x86/fasl/ql/dists/quicklisp/software/cl-proc-20101207-darcs/src/grovel-bsd" "/Users/pnathan/cl-test-grid/work-dir/agent/test-runs/20141128034202-ccl-1.9-r15758-f96-macosx-x86/fasl/ql/dists/quicklisp/software/cl-proc-20101207-darcs/src/grovel-bsd.c" Output was: /Users/pnathan/cl-test-grid/work-dir/agent/test-runs/20141128034202-ccl-1.9-r15758-f96-macosx-x86/fasl/ql/dists/quicklisp/software/cl-proc-20101207-darcs/src/grovel-bsd.c:9:26: error: sys/priority.h: No such file or directory /Users/pnathan/cl-test-grid/work-dir/agent/test-runs/20141128034202-ccl-1.9-r15758-f96-macosx-x86/fasl/ql/dists/quicklisp/software/cl-proc-20101207-darcs/src/grovel-bsd.c: In function ‘main’: /Users/pnathan/cl-test-grid/work-dir/agent/test-runs/20141128034202-ccl-1.9-r15758-f96-macosx-x86/fasl/ql/dists/quicklisp/software/cl-proc-20101207-darcs/src/grovel-bsd.c:60: warning: format ‘%i’ expects type ‘int’, but argument 3 has type ‘long unsigned int’ /Users/pnathan/cl-test-grid/work-dir/agent/test-runs/20141128034202-ccl-1.9-r15758-f96-macosx-x86/fasl/ql/dists/quicklisp/software/cl-proc-20101207-darcs/src/grovel-bsd.c:76: error: invalid application of ‘sizeof’ to incomplete type ‘struct priority’ /Users/pnathan/cl-test-grid/work-dir/agent/test-runs/20141128034202-ccl-1.9-r15758-f96-macosx-x86/fasl/ql/dists/quicklisp/software/cl-proc-20101207-darcs/src/grovel-bsd.c:76: warning: format ‘%i’ expects type ‘int’, but argument 3 has type ‘long unsigned int’ /Users/pnathan/cl-test-grid/work-dir/agent/test-runs/20141128034202-ccl-1.9-r15758-f96-macosx-x86/fasl/ql/dists/quicklisp/software/cl-proc-20101207-darcs/src/grovel-bsd.c:81: error: dereferencing pointer to incomplete type /Users/pnathan/cl-test-grid/work-dir/agent/test-runs/20141128034202-ccl-1.9-r15758-f96-macosx-x86/fasl/ql/dists/quicklisp/software/cl-proc-20101207-darcs/src/grovel-bsd.c:92: warning: format ‘%i’ expects type ‘int’, but argument 3 has type ‘long unsigned int’ /Users/pnathan/cl-test-grid/work-dir/agent/test-runs/20141128034202-ccl-1.9-r15758-f96-macosx-x86/fasl/ql/dists/quicklisp/software/cl-proc-20101207-darcs/src/grovel-bsd.c:97: error: ‘struct kinfo_proc’ has no member named ‘ki_pid’ /Users/pnathan/cl-test-grid/work-dir/agent/test-runs/20141128034202-ccl-1.9-r15758-f96-macosx-x86/fasl/ql/dists/quicklisp/software/cl-proc-20101207-darcs/src/grovel-bsd.c:102: error: ‘struct kinfo_proc’ has no member named ‘ki_ppid’ /Users/pnathan/cl-test-grid/work-dir/agent/test-runs/20141128034202-ccl-1.9-r15758-f96-macosx-x86/fasl/ql/dists/quicklisp/software/cl-proc-20101207-darcs/src/grovel-bsd.c:107: error: ‘struct kinfo_proc’ has no member named ‘ki_stat’ /Users/pnathan/cl-test-grid/work-dir/agent/test-runs/20141128034202-ccl-1.9-r15758-f96-macosx-x86/fasl/ql/dists/quicklisp/software/cl-proc-20101207-darcs/src/grovel-bsd.c:112: error: ‘struct kinfo_proc’ has no member named ‘ki_nice’ /Users/pnathan/cl-test-grid/work-dir/agent/test-runs/20141128034202-ccl-1.9-r15758-f96-macosx-x86/fasl/ql/dists/quicklisp/software/cl-proc-20101207-darcs/src/grovel-bsd.c:117: error: ‘struct kinfo_proc’ has no member named ‘ki_start’ /Users/pnathan/cl-test-grid/work-dir/agent/test-runs/20141128034202-ccl-1.9-r15758-f96-macosx-x86/fasl/ql/dists/quicklisp/software/cl-proc-20101207-darcs/src/grovel-bsd.c:122: error: ‘struct kinfo_proc’ has no member named ‘ki_pri’
clisp-2.49-unix-i386
(LOAD proc FAIL) ffi, ASDF:LOAD-SYSTEM-DEFINITION-ERROR : Error while trying to load definition for system proc from pathname /Users/pnathan/cl-test-grid/work-dir/agent/quicklisp/dists/quicklisp/software/cl-proc-20101207-darcs/src/proc.asd: CFFI requires CLISP compiled with dynamic FFI support.
clisp-2.49-unix-x64
(LOAD proc FAIL) ffi-grovel, CFFI-GROVEL:GROVEL-ERROR : External process exited with code 1. Command was: "cc" "-m64" "-I/home/hijarian/systems/cl-test-grid/work-dir/agent/quicklisp/dists/quicklisp/software/cffi_0.14.0/" "-o" "/home/hijarian/systems/cl-test-grid/work-dir/agent/test-runs/20141119082304-clisp-2.49-unix-x64/fasl/ql/dists/quicklisp/software/cl-proc-20101207-darcs/src/grovel-linux" "/home/hijarian/systems/cl-test-grid/work-dir/agent/test-runs/20141119082304-clisp-2.49-unix-x64/fasl/ql/dists/quicklisp/software/cl-proc-20101207-darcs/src/grovel-linux.c" Output was: <see above>
clisp-2.49-unix-x86
(LOAD proc FAIL) ffi-grovel, CFFI-GROVEL:GROVEL-ERROR : External process exited with code 1. Command was: "cc" "-m32" "-I/home/testgrid/cl-test-grid/work-dir/agent/quicklisp/dists/quicklisp/software/cffi_0.14.0/" "-o" "/home/testgrid/cl-test-grid/work-dir/agent/test-runs/20141116021855-clisp-2.49-unix-x86/fasl/ql/dists/quicklisp/software/cl-proc-20101207-darcs/src/grovel-linux" "/home/testgrid/cl-test-grid/work-dir/agent/test-runs/20141116021855-clisp-2.49-unix-x86/fasl/ql/dists/quicklisp/software/cl-proc-20101207-darcs/src/grovel-linux.c" Output was: <see above>
cmu-snapshot-2013-04__20d_unicode_-linux-x86
(LOAD proc FAIL) ffi-grovel, CFFI-GROVEL:GROVEL-ERROR : Error in function CFFI-GROVEL:GROVEL-ERROR: External process exited with code 1. Command was: "cc" "-m32" "-I/home/testgrid/cl-test-grid/work-dir/agent/quicklisp/dists/quicklisp/software/cffi_0.14.0/" "-o" "/home/testgrid/cl-test-grid/work-dir/agent/test-runs/20141115185927-cmu-snapshot-2013-04__20d_unicode_-linux-x86/fasl/ql/dists/quicklisp/software/cl-proc-20101207-darcs/src/grovel-linux" "/home/testgrid/cl-test-grid/work-dir/agent/test-runs/20141115185927-cmu-snapshot-2013-04__20d_unicode_-linux-x86/fasl/ql/dists/quicklisp/software/cl-proc-20101207-darcs/src/grovel-linux.c" Output was: /home/testgrid/cl-test-grid/work-dir/agent/test-runs/20141115185927-cmu-snapshot-2013-04__20d_unicode_-linux-x86/fasl/ql/dists/quicklisp/software/cl-proc-20101207-darcs/src/grovel-linux.c:9:26: fatal error: proc/sysinfo.h: No such file or directory compilation terminated.
cmu-snapshot-2014-01__20e_unicode_-linux-x86
(LOAD proc FAIL) ffi-grovel, CFFI-GROVEL:GROVEL-ERROR : Error in function CFFI-GROVEL:GROVEL-ERROR: External process exited with code 1. Command was: "cc" "-m32" "-I/home/testgrid/cl-test-grid/work-dir/agent/quicklisp/dists/quicklisp/software/cffi_0.14.0/" "-o" "/home/testgrid/cl-test-grid/work-dir/agent/test-runs/20141115212908-cmu-snapshot-2014-01__20e_unicode_-linux-x86/fasl/ql/dists/quicklisp/software/cl-proc-20101207-darcs/src/grovel-linux" "/home/testgrid/cl-test-grid/work-dir/agent/test-runs/20141115212908-cmu-snapshot-2014-01__20e_unicode_-linux-x86/fasl/ql/dists/quicklisp/software/cl-proc-20101207-darcs/src/grovel-linux.c" Output was: /home/testgrid/cl-test-grid/work-dir/agent/test-runs/20141115212908-cmu-snapshot-2014-01__20e_unicode_-linux-x86/fasl/ql/dists/quicklisp/software/cl-proc-20101207-darcs/src/grovel-linux.c:9:26: fatal error: proc/sysinfo.h: No such file or directory compilation terminated.
cmu-snapshot-2014-05-dirty__20e_unicode_-linux-x86
(LOAD proc FAIL) ffi-grovel, CFFI-GROVEL:GROVEL-ERROR : Error in function CFFI-GROVEL:GROVEL-ERROR: External process exited with code 1. Command was: "cc" "-m32" "-I/home/testgrid/cl-test-grid/work-dir/agent/quicklisp/dists/quicklisp/software/cffi_0.14.0/" "-o" "/home/testgrid/cl-test-grid/work-dir/agent/test-runs/20141115235548-cmu-snapshot-2014-05-dirty__20e_unicode_-linux-x86/fasl/ql/dists/quicklisp/software/cl-proc-20101207-darcs/src/grovel-linux" "/home/testgrid/cl-test-grid/work-dir/agent/test-runs/20141115235548-cmu-snapshot-2014-05-dirty__20e_unicode_-linux-x86/fasl/ql/dists/quicklisp/software/cl-proc-20101207-darcs/src/grovel-linux.c" Output was: /home/testgrid/cl-test-grid/work-dir/agent/test-runs/20141115235548-cmu-snapshot-2014-05-dirty__20e_unicode_-linux-x86/fasl/ql/dists/quicklisp/software/cl-proc-20101207-darcs/src/grovel-linux.c:9:26: fatal error: proc/sysinfo.h: No such file or directory compilation terminated.
ecl-13.5.1-76a84246-linux-x64-bytecode
(LOAD proc FAIL) ASDF/FIND-SYSTEM:LOAD-SYSTEM-DEFINITION-ERROR : Error while trying to load definition for system proc from pathname /home/hijarian/systems/cl-test-grid/work-dir/agent/quicklisp/dists/quicklisp/software/cl-proc-20101207-darcs/src/proc.asd: The variable C::*CC-FLAGS* is unbound.
ecl-13.5.1-76a84246-linux-x64-lisp-to-c
(LOAD proc FAIL) ffi-grovel, CFFI-GROVEL:GROVEL-ERROR : External process exited with code 1. Command was: "cc" "-m64" " -D_GNU_SOURCE -D_FILE_OFFSET_BITS=64 -g -O2 -fPIC -D_THREAD_SAFE -Dlinux" "-I/home/hijarian/systems/cl-test-grid/work-dir/agent/quicklisp/dists/quicklisp/software/cffi_0.14.0/" "-o" "/home/hijarian/systems/cl-test-grid/work-dir/agent/test-runs/20141119155044-ecl-13.5.1-76a84246-linux-x64-lisp-to-c/fasl/ql/dists/quicklisp/software/cl-proc-20101207-darcs/src/grovel-linux" "/home/hijarian/systems/cl-test-grid/work-dir/agent/test-runs/20141119155044-ecl-13.5.1-76a84246-linux-x64-lisp-to-c/fasl/ql/dists/quicklisp/software/cl-proc-20101207-darcs/src/grovel-linux.c" Output was: <see above>
ecl-13.5.1-unknown-linux-i686-bytecode
(LOAD proc FAIL) ASDF/FIND-SYSTEM:LOAD-SYSTEM-DEFINITION-ERROR : Error while trying to load definition for system proc from pathname /home/testgrid/cl-test-grid/work-dir/agent/quicklisp/dists/quicklisp/software/cl-proc-20101207-darcs/src/proc.asd: The variable C::*CC-FLAGS* is unbound.
ecl-13.5.1-unknown-linux-i686-lisp-to-c
(LOAD proc FAIL) ffi-grovel, CFFI-GROVEL:GROVEL-ERROR : External process exited with code 1. Command was: "cc" "-m32" " -D_GNU_SOURCE -D_FILE_OFFSET_BITS=64 -g -O2 -fPIC -D_GNU_SOURCE -D_FILE_OFFSET_BITS=64 -g -O2 -fPIC -D_THREAD_SAFE -Dlinux" "-I/home/testgrid/cl-test-grid/work-dir/agent/quicklisp/dists/quicklisp/software/cffi_0.14.0/" "-o" "/home/testgrid/cl-test-grid/work-dir/agent/test-runs/20141116081731-ecl-13.5.1-unknown-linux-i686-lisp-to-c/fasl/ql/dists/quicklisp/software/cl-proc-20101207-darcs/src/grovel-linux" "/home/testgrid/cl-test-grid/work-dir/agent/test-runs/20141116081731-ecl-13.5.1-unknown-linux-i686-lisp-to-c/fasl/ql/dists/quicklisp/software/cl-proc-20101207-darcs/src/grovel-linux.c" Output was: <see above>
sbcl-1.0.58-linux-x86
(LOAD proc FAIL) ffi-grovel, CFFI-GROVEL:GROVEL-ERROR : External process exited with code 1. Command was: "cc" "-m32" "-I/home/testgrid/cl-test-grid/work-dir/agent/quicklisp/dists/quicklisp/software/cffi_0.14.0/" "-o" "/home/testgrid/cl-test-grid/work-dir/agent/test-runs/20141115150426-sbcl-1.0.58-linux-x86/fasl/ql/dists/quicklisp/software/cl-proc-20101207-darcs/src/grovel-linux" "/home/testgrid/cl-test-grid/work-dir/agent/test-runs/20141115150426-sbcl-1.0.58-linux-x86/fasl/ql/dists/quicklisp/software/cl-proc-20101207-darcs/src/grovel-linux.c" Output was: /home/testgrid/cl-test-grid/work-dir/agent/test-runs/20141115150426-sbcl-1.0.58-linux-x86/fasl/ql/dists/quicklisp/software/cl-proc-20101207-darcs/src/grovel-linux.c:9:26: fatal error: proc/sysinfo.h: No such file or directory compilation terminated.
sbcl-1.1.11-linux-x86
(LOAD proc FAIL) ffi-grovel, CFFI-GROVEL:GROVEL-ERROR : External process exited with code 1. Command was: "cc" "-m32" "-I/home/testgrid/cl-test-grid/work-dir/agent/quicklisp/dists/quicklisp/software/cffi_0.14.0/" "-o" "/home/testgrid/cl-test-grid/work-dir/agent/test-runs/20141115131427-sbcl-1.1.11-linux-x86/fasl/ql/dists/quicklisp/software/cl-proc-20101207-darcs/src/grovel-linux" "/home/testgrid/cl-test-grid/work-dir/agent/test-runs/20141115131427-sbcl-1.1.11-linux-x86/fasl/ql/dists/quicklisp/software/cl-proc-20101207-darcs/src/grovel-linux.c" Output was: /home/testgrid/cl-test-grid/work-dir/agent/test-runs/20141115131427-sbcl-1.1.11-linux-x86/fasl/ql/dists/quicklisp/software/cl-proc-20101207-darcs/src/grovel-linux.c:9:26: fatal error: proc/sysinfo.h: No such file or directory compilation terminated.
sbcl-1.1.16-linux-x86
(LOAD proc FAIL) ffi-grovel, CFFI-GROVEL:GROVEL-ERROR : External process exited with code 1. Command was: "cc" "-m32" "-I/home/testgrid/cl-test-grid/work-dir/agent/quicklisp/dists/quicklisp/software/cffi_0.14.0/" "-o" "/home/testgrid/cl-test-grid/work-dir/agent/test-runs/20141115055137-sbcl-1.1.16-linux-x86/fasl/ql/dists/quicklisp/software/cl-proc-20101207-darcs/src/grovel-linux" "/home/testgrid/cl-test-grid/work-dir/agent/test-runs/20141115055137-sbcl-1.1.16-linux-x86/fasl/ql/dists/quicklisp/software/cl-proc-20101207-darcs/src/grovel-linux.c" Output was: /home/testgrid/cl-test-grid/work-dir/agent/test-runs/20141115055137-sbcl-1.1.16-linux-x86/fasl/ql/dists/quicklisp/software/cl-proc-20101207-darcs/src/grovel-linux.c:9:26: fatal error: proc/sysinfo.h: No such file or directory compilation terminated.
sbcl-1.2.3-linux-x64
(LOAD proc FAIL) ffi-grovel, CFFI-GROVEL:GROVEL-ERROR : External process exited with code 1. Command was: "cc" "-m64" "-I/home/hijarian/systems/cl-test-grid/work-dir/agent/quicklisp/dists/quicklisp/software/cffi_0.14.0/" "-o" "/home/hijarian/systems/cl-test-grid/work-dir/agent/test-runs/20141119133959-sbcl-1.2.3-linux-x64/fasl/ql/dists/quicklisp/software/cl-proc-20101207-darcs/src/grovel-linux" "/home/hijarian/systems/cl-test-grid/work-dir/agent/test-runs/20141119133959-sbcl-1.2.3-linux-x64/fasl/ql/dists/quicklisp/software/cl-proc-20101207-darcs/src/grovel-linux.c" Output was: /home/hijarian/systems/cl-test-grid/work-dir/agent/test-runs/20141119133959-sbcl-1.2.3-linux-x64/fasl/ql/dists/quicklisp/software/cl-proc-20101207-darcs/src/grovel-linux.c:9:26: fatal error: proc/sysinfo.h: Нет такого файла или каталога #include <proc/sysinfo.h> ^ compilation terminated.

Breakdown by testcases: for every failed testcase the lisp implmentations it fails on

The library does not have a testsuite adapter for CL Test Grid.

To reports overview

Generated at: 2014-12-18 19:21:26 GMT.