cl-popen results collected by cl-test-grid

Results on the last two Quicklisp distributions

 quicklisp 2014-12-17quicklisp 2014-11-06
abcl-1.2.1-fasl42-linux-x86
abcl-1.2.1-fasl42-macosx-x64
(LOAD cl-popen FAIL) ffi, ASDF/FIND-SYSTEM:LOAD-SYSTEM-DEFINITION-ERROR : Error while trying to load definition for system iolib from pathname /Users/pnathan/cl-test-grid/work-dir/agent/quicklisp/dists/quicklisp/software/iolib-20140826-git/iolib.asd: Don't know how to COMMON-LISP:REQUIRE JNA.
abcl-1.3.0-fasl42-linux-x86
abcl-1.3.1-fasl42-linux-x86
ccl-1.10-r16196-f96-linux-x64
(LOAD cl-popen FAIL) COMMON-LISP:SIMPLE-ERROR : External process exited with code 1. Command was: "g++" "-m64" "-Wno-write-strings" "-I/home/hijarian/systems/cl-test-grid/work-dir/agent/quicklisp/dists/quicklisp/software/iolib-20141217-git/src/grovel/" "-o" "/home/hijarian/systems/cl-test-grid/work-dir/agent/test-runs/20141218093601-ccl-1.10-r16196-f96-linux-x64/fasl/ql/dists/quicklisp/software/iolib-20141217-git/src/syscalls/ffi-types-unix" "/home/hijarian/systems/cl-test-grid/work-dir/agent/test-runs/20141218093601-ccl-1.10-r16196-f96-linux-x64/fasl/ql/dists/quicklisp/software/iolib-20141217-git/src/syscalls/ffi-types-unix.c" Output was: /home/hijarian/systems/cl-test-grid/work-dir/agent/test-runs/20141218093601-ccl-1.10-r16196-f96-linux-x64/fasl/ql/dists/quicklisp/software/iolib-20141217-git/src/syscalls/ffi-types-unix.c:14:17: fatal error: lfp.h: Нет такого файла или каталога #include <lfp.h> ^ compilation terminated.
(LOAD cl-popen FAIL) COMMON-LISP:SIMPLE-ERROR : External process exited with code 1. Command was: "g++" "-m64" "-Wno-write-strings" "-I/home/hijarian/systems/cl-test-grid/work-dir/agent/quicklisp/dists/quicklisp/software/iolib-20140826-git/src/grovel/" "-o" "/home/hijarian/systems/cl-test-grid/work-dir/agent/test-runs/20141119112401-ccl-1.10-r16196-f96-linux-x64/fasl/ql/dists/quicklisp/software/iolib-20140826-git/src/syscalls/ffi-types-unix" "/home/hijarian/systems/cl-test-grid/work-dir/agent/test-runs/20141119112401-ccl-1.10-r16196-f96-linux-x64/fasl/ql/dists/quicklisp/software/iolib-20140826-git/src/syscalls/ffi-types-unix.c" Output was: /home/hijarian/systems/cl-test-grid/work-dir/agent/test-runs/20141119112401-ccl-1.10-r16196-f96-linux-x64/fasl/ql/dists/quicklisp/software/iolib-20140826-git/src/syscalls/ffi-types-unix.c:14:17: fatal error: lfp.h: Нет такого файла или каталога #include <lfp.h> ^ compilation terminated.
ccl-1.10-r16196-f96-linux-x86
ccl-1.8-r15286m-f95-linux-x86
(LOAD cl-popen FAIL) ASDF:LOAD-SYSTEM-DEFINITION-ERROR : Error while trying to load definition for system iolib from pathname /home/testgrid/cl-test-grid/work-dir/agent/quicklisp/dists/quicklisp/software/iolib-20141217-git/iolib.asd: You need ASDF >= 2.31.1 to load this system correctly.
(LOAD cl-popen FAIL) ASDF:LOAD-SYSTEM-DEFINITION-ERROR : Error while trying to load definition for system iolib from pathname /home/testgrid/cl-test-grid/work-dir/agent/quicklisp/dists/quicklisp/software/iolib-20140826-git/iolib.asd: You need ASDF >= 2.31.1 to load this system correctly.
ccl-1.9-r15756-f96-linux-x86
ccl-1.9-r15758-f96-macosx-x86
(LOAD cl-popen FAIL) COMMON-LISP:SIMPLE-ERROR : External process exited with code 1. Command was: "g++" "-m32" "-Wno-write-strings" "-I" "/opt/local/include/" "-I/Users/pnathan/cl-test-grid/work-dir/agent/quicklisp/dists/quicklisp/software/iolib-20140826-git/src/grovel/" "-o" "/Users/pnathan/cl-test-grid/work-dir/agent/test-runs/20141128034202-ccl-1.9-r15758-f96-macosx-x86/fasl/ql/dists/quicklisp/software/iolib-20140826-git/src/syscalls/ffi-types-unix" "/Users/pnathan/cl-test-grid/work-dir/agent/test-runs/20141128034202-ccl-1.9-r15758-f96-macosx-x86/fasl/ql/dists/quicklisp/software/iolib-20140826-git/src/syscalls/ffi-types-unix.c" Output was: /Users/pnathan/cl-test-grid/work-dir/agent/test-runs/20141128034202-ccl-1.9-r15758-f96-macosx-x86/fasl/ql/dists/quicklisp/software/iolib-20140826-git/src/syscalls/ffi-types-unix.c:6:17: error: lfp.h: No such file or directory /Users/pnathan/cl-test-grid/work-dir/agent/test-runs/20141128034202-ccl-1.9-r15758-f96-macosx-x86/fasl/ql/dists/quicklisp/software/iolib-20140826-git/src/syscalls/ffi-types-unix.c: In function ‘int main(int, char**)’: /Users/pnathan/cl-test-grid/work-dir/agent/test-runs/20141128034202-ccl-1.9-r15758-f96-macosx-x86/fasl/ql/dists/quicklisp/software/iolib-20140826-git/src/syscalls/ffi-types-unix.c:68: error: ‘ino_t’ was not declared in this scope /Users/pnathan/cl-test-grid/work-dir/agent/test-runs/20141128034202-ccl-1.9-r15758-f96-macosx-x86/fasl/ql/dists/quicklisp/software/iolib-20140826-git/src/syscalls/ffi-types-unix.c:71: error: ‘nlink_t’ was not declared in this scope /Users/pnathan/cl-test-grid/work-dir/agent/test-runs/20141128034202-ccl-1.9-r15758-f96-macosx-x86/fasl/ql/dists/quicklisp/software/iolib-20140826-git/src/syscalls/ffi-types-unix.c:74: error: ‘blksize_t’ was not declared in this scope /Users/pnathan/cl-test-grid/work-dir/agent/test-runs/20141128034202-ccl-1.9-r15758-f96-macosx-x86/fasl/ql/dists/quicklisp/software/iolib-20140826-git/src/syscalls/ffi-types-unix.c:77: error: ‘blkcnt_t’ was not declared in this scope /Users/pnathan/cl-test-grid/work-dir/agent/test-runs/20141128034202-ccl-1.9-r15758-f96-macosx-x86/fasl/ql/dists/quicklisp/software/iolib-20140826-git/src/syscalls/ffi-types-unix.c:89: error: ‘clockid_t’ was not declared in this scope /Users/pnathan/cl-test-grid/work-dir/agent/test-runs/20141128034202-ccl-1.9-r15758-f96-macosx-x86/fasl/ql/dists/quicklisp/software/iolib-20140826-git/src/syscalls/ffi-types-unix.c:93: error: ‘E2BIG’ was not declared in this scope /Users/pnathan/cl-test-grid/work-dir/agent/test-runs/20141128034202-ccl-1.9-r15758-f96-macosx-x86/fasl/ql/dists/quicklisp/software/iolib-20140826-git/src/syscalls/ffi-types-unix.c:94: error: ‘EACCES’ was not declared in this scope /Users/pnathan/cl-test-grid/work-dir/agent/test-runs/20141128034202-ccl-1.9-r15758-f96-macosx-x86/fasl/ql/dists/quicklisp/software/iolib-20140826-git/src/syscalls/ffi-types-unix.c:95: error: ‘EADDRINUSE’ was not declared in this scope /Users/pnathan/cl-test-grid/work-dir/agent/test-runs/20141128034202-ccl-1.9-r15758-f96-macosx-x86/fasl/ql/dists/quicklisp/software/iolib-20140826-git/src/syscalls/ffi-types-unix.c:96: error: ‘EADDRNOTAVAIL’ was not declared in this scope /Users/pnathan/cl-test-grid/work-dir/agent/test-runs/20141128034202-ccl-1.9-r15758-f96-macosx-x86/fasl/ql/dists/quicklisp/software/iolib-20140826-git/src/syscalls/ffi-types-unix.c:97: error: ‘EAFNOSUPPORT’ was not declared in this scope /Users/pnathan/cl-test-grid/work-dir/agent/test-runs/20141128034202-ccl-1.9-r15758-f96-macosx-x86/fasl/ql/dists/quicklisp/software/iolib-20140826-git/src/syscalls/ffi-types-unix.c:98: error: ‘EALREADY’ was not declared in this scope /Users/pnathan/cl-test-grid/work-dir/agent/test-runs/20141128034202-ccl-1.9-r15758-f96-macosx-x86/fasl/ql/dists/quicklisp/software/iolib-20140826-git/src/syscalls/ffi-types-unix.c:99: error: ‘EBADF’ was not declared in this scope /Users/pnathan/cl-test-grid/work-dir/agent/test-runs/20141128034202-ccl-1.9-r15758-f96-macosx-x86/fasl/ql/dists/quicklisp/software/iolib-20140826-git/src/syscalls/ffi-types-unix.c:100: error: ‘EBADMSG’ was not declared in this scope /Users/pnathan/cl-test-grid/work-dir/agent/test-runs/20141128034202-ccl-1.9-r15758-f96-macosx-x86/fasl/ql/dists/quicklisp/software/iolib-20140826-git/src/syscalls/ffi-types-unix.c:101: error: ‘EBUSY’ was not declared in this scope /Users/pnathan/cl-test-grid/work-dir/agent/test-runs/20141128034202-ccl-1.9-r15758-f96-macosx-x86/fasl/ql/dists/quicklisp/software/iolib-20140826-git/src/syscalls/ffi-types-unix.c:102: error: ‘ECANCELED’ was not declared in this scope /Users/pnathan/cl-test-grid/work-dir/agent/test-runs/20141128034202-ccl-1.9-r15758-f96-macosx-x86/fasl/ql/dists/quicklisp/software/iolib-20140826-git/src/syscalls/ffi-types-unix.c:103: error: ‘ECHILD’ was not declared in this scope /Users/pnathan/cl-test-grid/work-dir/agent/test-runs/20141128034202-ccl-1.9-r15758-f96-macosx-x86/fasl/ql/dists/quicklisp/software/iolib-20140826-git/src/syscalls/ffi-types-unix.c:104: error: ‘ECONNABORTED’ was not declared in this scope /Users/pnathan/cl-test-grid/work-dir/agent/test-runs/20141128034202-ccl-1.9-r15758-f96-macosx-x86/fasl/ql/dists/quicklisp/software/iolib-20140826-git/src/syscalls/ffi-types-unix.c:105: error: ‘ECONNREFUSED’ was not declared in this scope /Users/pnathan/cl-test-grid/work-dir/agent/test-runs/20141128034202-ccl-1.9-r15758-f96-macosx-x86/fasl/ql/dists/quicklisp/software/iolib-20140826-git/src/syscalls/ffi-types-unix.c:106: error: ‘ECONNRESET’ was not declared in this scope /Users/pnathan/cl-test-grid/work-dir/agent/test-runs/20141128034202-ccl-1.9-r15758-f96-macosx-x86/fasl/ql/dists/quicklisp/software/iolib-20140826-git/src/syscalls/ffi-types-unix.c:107: error: ‘EDEADLK’ was not declared in this scope /Users/pnathan/cl-test-grid/work-dir/agent/test-runs/20141128034202-ccl-1.9-r15758-f96-macosx-x86/fasl/ql/dists/quicklisp/software/iolib-20140826-git/src/syscalls/ffi-types-unix.c:108: error: ‘EDESTADDRREQ’ was not declared in this scope /Users/pnathan/cl-test-grid/work-dir/agent/test-runs/20141128034202-ccl-1.9-r15758-f96-macosx-x86/fasl/ql/dists/quicklisp/software/iolib-20140826-git/src/syscalls/ffi-types-unix.c:109: error: ‘EDOM’ was not declared in this scope /Users/pnathan/cl-test-grid/work-dir/agent/test-runs/20141128034202-ccl-1.9-r15758-f96-macosx-x86/fasl/ql/dists/quicklisp/software/iolib-20140826-git/src/syscalls/ffi-types-unix.c:110: error: ‘EDQUOT’ was not declared in this scope /Users/pnathan/cl-test-grid/work-dir/agent/test-runs/20141128034202-ccl-1.9-r15758-f96-macosx-x86/fasl/ql/dists/quicklisp/software/iolib-20140826-git/src/syscalls/ffi-types-unix.c:111: error: ‘EEXIST’ was not declared in this scope /Users/pnathan/cl-test-grid/work-dir/agent/test-runs/20141128034202-ccl-1.9-r15758-f96-macosx-x86/fasl/ql/dists/quicklisp/software/iolib-20140826-git/src/syscalls/ffi-types-unix.c:112: error: ‘EFAULT’ was not declared in this scope /Users/pnathan/cl-test-grid/work-dir/agent/test-runs/20141128034202-ccl-1.9-r15758-f96-macosx-x86/fasl/ql/dists/quicklisp/software/iolib-20140826-git/src/syscalls/ffi-types-unix.c:113: error: ‘EFBIG’ was not declared in this scope /Users/pnathan/cl-test-grid/work-dir/agent/test-runs/20141128034202-ccl-1.9-r15758-f96-macosx-x86/fasl/ql/dists/quicklisp/software/iolib-20140826-git/src/syscalls/ffi-types-unix.c:114: error: ‘EHOSTDOWN’ was not declared in this scope /Users/pnathan/cl-test-grid/work-dir/agent/test-runs/20141128034202-ccl-1.9-r15758-f96-macosx-x86/fasl/ql/dists/quicklisp/software/iolib-20140826-git/src/syscalls/ffi-types-unix.c:115: error: ‘EHOSTUNREACH’ was not declared in this scope /Users/pnathan/cl-test-grid/work-dir/agent/test-runs/20141128034202-ccl-1.9-r15758-f96-macosx-x86/fasl/ql/dists/quicklisp/software/iolib-20140826-git/src/syscalls/ffi-types-unix.c:116: error: ‘EIDRM’ was not declared in this scope /Users/pnathan/cl-test-grid/work-dir/agent/test-runs/20141128034202-ccl-1.9-r15758-f96-macosx-x86/fasl/ql/dists/quicklisp/software/iolib-20140826-git/src/syscalls/ffi-types-unix.c:117: error: ‘EILSEQ’ was not declared in this scope /Users/pnathan/cl-test-grid/work-dir/agent/test-runs/20141128034202-ccl-1.9-r15758-f96-macosx-x86/fasl/ql/dists/quicklisp/software/iolib-20140826-git/src/syscalls/ffi-types-unix.c:118: error: ‘EINPROGRESS’ was not declared in this scope /Users/pnathan/cl-test-grid/work-dir/agent/test-runs/20141128034202-ccl-1.9-r15758-f96-macosx-x86/fasl/ql/dists/quicklisp/software/iolib-20140826-git/src/syscalls/ffi-types-unix.c:119: error: ‘EINTR’ was not declared in this scope /Users/pnathan/cl-test-grid/work-dir/agent/test-runs/20141128034202-ccl-1.9-r15758-f96-macosx-x86/fasl/ql/dists/quicklisp/software/iolib-20140826-git/src/syscalls/ffi-types-unix.c:120: error: ‘EINVAL’ was not declared in this scope /Users/pnathan/cl-test-grid/work-dir/agent/test-runs/20141128034202-ccl-1.9-r15758-f96-macosx-x86/fasl/ql/dists/quicklisp/software/iolib-20140826-git/src/syscalls/ffi-types-unix.c:121: error: ‘EIO’ was not declared in this scope /Users/pnathan/cl-test-grid/work-dir/agent/test-runs/20141128034202-ccl-1.9-r15758-f96-macosx-x86/fasl/ql/dists/quicklisp/software/iolib-20140826-git/src/syscalls/ffi-types-unix.c:122: error: ‘EISCONN’ was not declared in this scope /Users/pnathan/cl-test-grid/work-dir/agent/test-runs/20141128034202-ccl-1.9-r15758-f96-macosx-x86/fasl/ql/dists/quicklisp/software/iolib-20140826-git/src/syscalls/ffi-types-unix.c:123: error: ‘EISDIR’ was not declared in this scope /Users/pnathan/cl-test-grid/work-dir/agent/test-runs/20141128034202-ccl-1.9-r15758-f96-macosx-x86/fasl/ql/dists/quicklisp/software/iolib-20140826-git/src/syscalls/ffi-types-unix.c:124: error: ‘ELOOP’ was not declared in this scope /Users/pnathan/cl-test-grid/work-dir/agent/test-runs/20141128034202-ccl-1.9-r15758-f96-macosx-x86/fasl/ql/dists/quicklisp/software/iolib-20140826-git/src/syscalls/ffi-types-unix.c:125: error: ‘EMFILE’ was not declared in this scope /Users/pnathan/cl-test-grid/work-dir/agent/test-runs/20141128034202-ccl-1.9-r15758-f96-macosx-x86/fasl/ql/dists/quicklisp/software/iolib-20140826-git/src/syscalls/ffi-types-unix.c:126: error: ‘EMLINK’ was not declared in this scope /Users/pnathan/cl-test-grid/work-dir/agent/test-runs/20141128034202-ccl-1.9-r15758-f96-macosx-x86/fasl/ql/dists/quicklisp/software/iolib-20140826-git/src/syscalls/ffi-types-unix.c:127: error: ‘EMSGSIZE’ was not declared in this scope /Users/pnathan/cl-test-grid/work-dir/agent/test-runs/20141128034202-ccl-1.9-r15758-f96-macosx-x86/fasl/ql/dists/quicklisp/software/iolib-20140826-git/src/syscalls/ffi-types-unix.c:128: error: ‘EMULTIHOP’ was not declared in this scope /Users/pnathan/cl-test-grid/work-dir/agent/test-runs/20141128034202-ccl-1.9-r15758-f96-macosx-x86/fasl/ql/dists/quicklisp/software/iolib-20140826-git/src/syscalls/ffi-types-unix.c:129: error: ‘ENAMETOOLONG’ was not declared in this scope /Users/pnathan/cl-test-grid/work-dir/agent/test-runs/20141128034202-ccl-1.9-r15758-f96-macosx-x86/fasl/ql/dists/quicklisp/software/iolib-20140826-git/src/syscalls/ffi-types-unix.c:130: error: ‘ENETDOWN’ was not declared in this scope /Users/pnathan/cl-test-grid/work-dir/agent/test-runs/20141128034202-ccl-1.9-r15758-f96-macosx-x86/fasl/ql/dists/quicklisp/software/iolib-20140826-git/src/syscalls/ffi-types-unix.c:131: error: ‘ENETRESET’ was not declared in this scope /Users/pnathan/cl-test-grid/work-dir/agent/test-runs/20141128034202-ccl-1.9-r15758-f96-macosx-x86/fasl/ql/dists/quicklisp/software/iolib-20140826-git/src/syscalls/ffi-types-unix.c:132: error: ‘ENETUNREACH’ was not declared in this scope /Users/pnathan/cl-test-grid/work-dir/agent/test-runs/20141128034202-ccl-1.9-r15758-f96-macosx-x86/fasl/ql/dists/quicklisp/software/iolib-20140826-git/src/syscalls/ffi-types-unix.c:133: error: ‘ENFILE’ was not declared in this scope /Users/pnathan/cl-test-grid/work-dir/agent/test-runs/20141128034202-ccl-1.9-r15758-f96-macosx-x86/fasl/ql/dists/quicklisp/software/iolib-20140826-git/src/syscalls/ffi-types-unix.c:134: error: ‘ENOBUFS’ was not declared in this scope /Users/pnathan/cl-test-grid/work-dir/agent/test-runs/20141128034202-ccl-1.9-r15758-f96-macosx-x86/fasl/ql/dists/quicklisp/software/iolib-20140826-git/src/syscalls/ffi-types-unix.c:138: error: ‘ENODEV’ was not declared in this scope /Users/pnathan/cl-test-grid/work-dir/agent/test-runs/20141128034202-ccl-1.9-r15758-f96-macosx-x86/fasl/ql/dists/quicklisp/software/iolib-20140826-git/src/syscalls/ffi-types-unix.c:139: error: ‘ENOENT’ was not declared in this scope /Users/pnathan/cl-test-grid/work-dir/agent/test-runs/20141128034202-ccl-1.9-r15758-f96-macosx-x86/fasl/ql/dists/quicklisp/software/iolib-20140826-git/src/syscalls/ffi-types-unix.c:140: error: ‘ENOEXEC’ was not declared in this scope /Users/pnathan/cl-test-grid/work-dir/agent/test-runs/20141128034202-ccl-1.9-r15758-f96-macosx-x86/fasl/ql/dists/quicklisp/software/iolib-20140826-git/src/syscalls/ffi-types-unix.c:141: error: ‘ENOLCK’ was not declared in this scope /Users/pnathan/cl-test-grid/work-dir/agent/test-runs/20141128034202-ccl-1.9-r15758-f96-macosx-x86/fasl/ql/dists/quicklisp/software/iolib-20140826-git/src/syscalls/ffi-types-unix.c:142: error: ‘ENOLINK’ was not declared in this scope /Users/pnathan/cl-test-grid/work-dir/agent/test-runs/20141128034202-ccl-1.9-r15758-f96-macosx-x86/fasl/ql/dists/quicklisp/software/iolib-20140826-git/src/syscalls/ffi-types-unix.c:143: error: ‘ENOMEM’ was not declared in this scope /Users/pnathan/cl-test-grid/work-dir/agent/test-runs/20141128034202-ccl-1.9-r15758-f96-macosx-x86/fasl/ql/dists/quicklisp/software/iolib-20140826-git/src/syscalls/ffi-types-unix.c:144: error: ‘ENOMSG’ was not declared in this scope /Users/pnathan/cl-test-grid/work-dir/agent/test-runs/20141128034202-ccl-1.9-r15758-f96-macosx-x86/fasl/ql/dists/quicklisp/software/iolib-20140826-git/src/syscalls/ffi-types-unix.c:148: error: ‘ENOPROTOOPT’ was not declared in this scope /Users/pnathan/cl-test-grid/work-dir/agent/test-runs/20141128034202-ccl-1.9-r15758-f96-macosx-x86/fasl/ql/dists/quicklisp/software/iolib-20140826-git/src/syscalls/ffi-types-unix.c:149: error: ‘ENOSPC’ was not declared in this scope /Users/pnathan/cl-test-grid/work-dir/agent/test-runs/20141128034202-ccl-1.9-r15758-f96-macosx-x86/fasl/ql/dists/quicklisp/software/iolib-20140826-git/src/syscalls/ffi-types-unix.c:156: error: ‘ENOSYS’ was not declared in this scope /Users/pnathan/cl-test-grid/work-dir/agent/test-runs/20141128034202-ccl-1.9-r15758-f96-macosx-x86/fasl/ql/dists/quicklisp/software/iolib-20140826-git/src/syscalls/ffi-types-unix.c:157: error: ‘ENOTCONN’ was not declared in this scope /Users/pnathan/cl-test-grid/work-dir/agent/test-runs/20141128034202-ccl-1.9-r15758-f96-macosx-x86/fasl/ql/dists/quicklisp/software/iolib-20140826-git/src/syscalls/ffi-types-unix.c:158: error: ‘ENOTDIR’ was not declared in this scope /Users/pnathan/cl-test-grid/work-dir/agent/test-runs/20141128034202-ccl-1.9-r15758-f96-macosx-x86/fasl/ql/dists/quicklisp/software/iolib-20140826-git/src/syscalls/ffi-types-unix.c:159: error: ‘ENOTEMPTY’ was not declared in this scope /Users/pnathan/cl-test-grid/work-dir/agent/test-runs/20141128034202-ccl-1.9-r15758-f96-macosx-x86/fasl/ql/dists/quicklisp/software/iolib-20140826-git/src/syscalls/ffi-types-unix.c:160: error: ‘ENOTSOCK’ was not declared in this scope /Users/pnathan/cl-test-grid/work-dir/agent/test-runs/20141128034202-ccl-1.9-r15758-f96-macosx-x86/fasl/ql/dists/quicklisp/software/iolib-20140826-git/src/syscalls/ffi-types-unix.c:161: error: ‘ENOTSUP’ was not declared in this scope /Users/pnathan/cl-test-grid/work-dir/agent/test-runs/20141128034202-ccl-1.9-r15758-f96-macosx-x86/fasl/ql/dists/quicklisp/software/iolib-20140826-git/src/syscalls/ffi-types-unix.c:162: error: ‘ENOTTY’ was not declared in this scope /Users/pnathan/cl-test-grid/work-dir/agent/test-runs/20141128034202-ccl-1.9-r15758-f96-macosx-x86/fasl/ql/dists/quicklisp/software/iolib-20140826-git/src/syscalls/ffi-types-unix.c:163: error: ‘ENXIO’ was not declared in this scope /Users/pnathan/cl-test-grid/work-dir/agent/test-runs/20141128034202-ccl-1.9-r15758-f96-macosx-x86/fasl/ql/dists/quicklisp/software/iolib-20140826-git/src/syscalls/ffi-types-unix.c:164: error: ‘EOPNOTSUPP’ was not declared in this scope /Users/pnathan/cl-test-grid/work-dir/agent/test-runs/20141128034202-ccl-1.9-r15758-f96-macosx-x86/fasl/ql/dists/quicklisp/software/iolib-20140826-git/src/syscalls/ffi-types-unix.c:165: error: ‘EOVERFLOW’ was not declared in this scope /Users/pnathan/cl-test-grid/work-dir/agent/test-runs/20141128034202-ccl-1.9-r15758-f96-macosx-x86/fasl/ql/dists/quicklisp/software/iolib-20140826-git/src/syscalls/ffi-types-unix.c:166: error: ‘EPERM’ was not declared in this scope /Users/pnathan/cl-test-grid/work-dir/agent/test-runs/20141128034202-ccl-1.9-r15758-f96-macosx-x86/fasl/ql/dists/quicklisp/software/iolib-20140826-git/src/syscalls/ffi-types-unix.c:167: error: ‘EPIPE’ was not declared in this scope /Users/pnathan/cl-test-grid/work-dir/agent/test-runs/20141128034202-ccl-1.9-r15758-f96-macosx-x86/fasl/ql/dists/quicklisp/software/iolib-20140826-git/src/syscalls/ffi-types-unix.c:168: error: ‘EPROTO’ was not declared in this scope /Users/pnathan/cl-test-grid/work-dir/agent/test-runs/20141128034202-ccl-1.9-r15758-f96-macosx-x86/fasl/ql/dists/quicklisp/software/iolib-20140826-git/src/syscalls/ffi-types-unix.c:169: error: ‘EPROTONOSUPPORT’ was not declared in this scope /Users/pnathan/cl-test-grid/work-dir/agent/test-runs/20141128034202-ccl-1.9-r15758-f96-macosx-x86/fasl/ql/dists/quicklisp/software/iolib-20140826-git/src/syscalls/ffi-types-unix.c:170: error: ‘EPROTOTYPE’ was not declared in this scope /Users/pnathan/cl-test-grid/work-dir/agent/test-runs/20141128034202-ccl-1.9-r15758-f96-macosx-x86/fasl/ql/dists/quicklisp/software/iolib-20140826-git/src/syscalls/ffi-types-unix.c:171: error: ‘ERANGE’ was not declared in this scope /Users/pnathan/cl-test-grid/work-dir/agent/test-runs/20141128034202-ccl-1.9-r15758-f96-macosx-x86/fasl/ql/dists/quicklisp/software/iolib-20140826-git/src/syscalls/ffi-types-unix.c:172: error: ‘EROFS’ was not declared in this scope /Users/pnathan/cl-test-grid/work-dir/agent/test-runs/20141128034202-ccl-1.9-r15758-f96-macosx-x86/fasl/ql/dists/quicklisp/software/iolib-20140826-git/src/syscalls/ffi-types-unix.c:173: error: ‘ESHUTDOWN’ was not declared in this scope /Users/pnathan/cl-test-grid/work-dir/agent/test-runs/20141128034202-ccl-1.9-r15758-f96-macosx-x86/fasl/ql/dists/quicklisp/software/iolib-20140826-git/src/syscalls/ffi-types-unix.c:174: error: ‘ESPIPE’ was not declared in this scope /Users/pnathan/cl-test-grid/work-dir/agent/test-runs/20141128034202-ccl-1.9-r15758-f96-macosx-x86/fasl/ql/dists/quicklisp/software/iolib-20140826-git/src/syscalls/ffi-types-unix.c:175: error: ‘ESRCH’ was not declared in this scope /Users/pnathan/cl-test-grid/work-dir/agent/test-runs/20141128034202-ccl-1.9-r15758-f96-macosx-x86/fasl/ql/dists/quicklisp/software/iolib-20140826-git/src/syscalls/ffi-types-unix.c:176: error: ‘ESTALE’ was not declared in this scope /Users/pnathan/cl-test-grid/work-dir/agent/test-runs/20141128034202-ccl-1.9-r15758-f96-macosx-x86/fasl/ql/dists/quicklisp/software/iolib-20140826-git/src/syscalls/ffi-types-unix.c:180: error: ‘ETIMEDOUT’ was not declared in this scope /Users/pnathan/cl-test-grid/work-dir/agent/test-runs/20141128034202-ccl-1.9-r15758-f96-macosx-x86/fasl/ql/dists/quicklisp/software/iolib-20140826-git/src/syscalls/ffi-types-unix.c:181: error: ‘ETXTBSY’ was not declared in this scope /Users/pnathan/cl-test-grid/work-dir/agent/test-runs/20141128034202-ccl-1.9-r15758-f96-macosx-x86/fasl/ql/dists/quicklisp/software/iolib-20140826-git/src/syscalls/ffi-types-unix.c:182: error: ‘EWOULDBLOCK’ was not declared in this scope /Users/pnathan/cl-test-grid/work-dir/agent/test-runs/20141128034202-ccl-1.9-r15758-f96-macosx-x86/fasl/ql/dists/quicklisp/software/iolib-20140826-git/src/syscalls/ffi-types-unix.c:183: error: ‘EXDEV’ was not declared in this scope /Users/pnathan/cl-test-grid/work-dir/agent/test-runs/20141128034202-ccl-1.9-r15758-f96-macosx-x86/fasl/ql/dists/quicklisp/software/iolib-20140826-git/src/syscalls/ffi-types-unix.c:184: error: ‘EBUG’ was not declared in this scope /Users/pnathan/cl-test-grid/work-dir/agent/test-runs/20141128034202-ccl-1.9-r15758-f96-macosx-x86/fasl/ql/dists/quicklisp/software/iolib-20140826-git/src/syscalls/ffi-types-unix.c:1021: error: invalid application of ‘sizeof’ to incomplete type ‘stat’ /Users/pnathan/cl-test-grid/work-dir/agent/test-runs/20141128034202-ccl-1.9-r15758-f96-macosx-x86/fasl/ql/dists/quicklisp/software/iolib-20140826-git/src/syscalls/ffi-types-unix.c:1022: error: invalid use of incomplete type ‘struct stat’ /Users/pnathan/cl-test-grid/work-dir/agent/test-runs/20141128034202-ccl-1.9-r15758-f96-macosx-x86/fasl/ql/dists/quicklisp/software/iolib-20140826-git/src/syscalls/ffi-types-unix.c:1021: error: forward declaration of ‘struct stat’ /Users/pnathan/cl-test-grid/work-dir/agent/test-runs/20141128034202-ccl-1.9-r15758-f96-macosx-x86/fasl/ql/dists/quicklisp/software/iolib-20140826-git/src/syscalls/ffi-types-unix.c:1023: error: invalid use of incomplete type ‘struct stat’ /Users/pnathan/cl-test-grid/work-dir/agent/test-runs/20141128034202-ccl-1.9-r15758-f96-macosx-x86/fasl/ql/dists/quicklisp/software/iolib-20140826-git/src/syscalls/ffi-types-unix.c:1021: error: forward declaration of ‘struct stat’ /Users/pnathan/cl-test-grid/work-dir/agent/test-runs/20141128034202-ccl-1.9-r15758-f96-macosx-x86/fasl/ql/dists/quicklisp/software/iolib-20140826-git/src/syscalls/ffi-types-unix.c:1024: error: invalid use of incomplete type ‘struct stat’ /Users/pnathan/cl-test-grid/work-dir/agent/test-runs/20141128034202-ccl-1.9-r15758-f96-macosx-x86/fasl/ql/dists/quicklisp/software/iolib-20140826-git/src/syscalls/ffi-types-unix.c:1021: error: forward declaration of ‘struct stat’ /Users/pnathan/cl-test-grid/work-dir/agent/test-runs/20141128034202-ccl-1.9-r15758-f96-macosx-x86/fasl/ql/dists/quicklisp/software/iolib-20140826-git/src/syscalls/ffi-types-unix.c:1025: error: invalid use of incomplete type ‘struct stat’ /Users/pnathan/cl-test-grid/work-dir/agent/test-runs/20141128034202-ccl-1.9-r15758-f96-macosx-x86/fasl/ql/dists/quicklisp/software/iolib-20140826-git/src/syscalls/ffi-types-unix.c:1021: error: forward declaration of ‘struct stat’ /Users/pnathan/cl-test-grid/work-dir/agent/test-runs/20141128034202-ccl-1.9-r15758-f96-macosx-x86/fasl/ql/dists/quicklisp/software/iolib-20140826-git/src/syscalls/ffi-types-unix.c:1026: error: invalid use of incomplete type ‘struct stat’ /Users/pnathan/cl-test-grid/work-dir/agent/test-runs/20141128034202-ccl-1.9-r15758-f96-macosx-x86/fasl/ql/dists/quicklisp/software/iolib-20140826-git/src/syscalls/ffi-types-unix.c:1021: error: forward declaration of ‘struct stat’ /Users/pnathan/cl-test-grid/work-dir/agent/test-runs/20141128034202-ccl-1.9-r15758-f96-macosx-x86/fasl/ql/dists/quicklisp/software/iolib-20140826-git/src/syscalls/ffi-types-unix.c:1027: error: invalid use of incomplete type ‘struct stat’ /Users/pnathan/cl-test-grid/work-dir/agent/test-runs/20141128034202-ccl-1.9-r15758-f96-macosx-x86/fasl/ql/dists/quicklisp/software/iolib-20140826-git/src/syscalls/ffi-types-unix.c:1021: error: forward declaration of ‘struct stat’ /Users/pnathan/cl-test-grid/work-dir/agent/test-runs/20141128034202-ccl-1.9-r15758-f96-macosx-x86/fasl/ql/dists/quicklisp/software/iolib-20140826-git/src/syscalls/ffi-types-unix.c:1028: error: invalid use of incomplete type ‘struct stat’ /Users/pnathan/cl-test-grid/work-dir/agent/test-runs/20141128034202-ccl-1.9-r15758-f96-macosx-x86/fasl/ql/dists/quicklisp/software/iolib-20140826-git/src/syscalls/ffi-types-unix.c:1021: error: forward declaration of ‘struct stat’ /Users/pnathan/cl-test-grid/work-dir/agent/test-runs/20141128034202-ccl-1.9-r15758-f96-macosx-x86/fasl/ql/dists/quicklisp/software/iolib-20140826-git/src/syscalls/ffi-types-unix.c:1029: error: invalid use of incomplete type ‘struct stat’ /Users/pnathan/cl-test-grid/work-dir/agent/test-runs/20141128034202-ccl-1.9-r15758-f96-macosx-x86/fasl/ql/dists/quicklisp/software/iolib-20140826-git/src/syscalls/ffi-types-unix.c:1021: error: forward declaration of ‘struct stat’ /Users/pnathan/cl-test-grid/work-dir/agent/test-runs/20141128034202-ccl-1.9-r15758-f96-macosx-x86/fasl/ql/dists/quicklisp/software/iolib-20140826-git/src/syscalls/ffi-types-unix.c:1030: error: invalid use of incomplete type ‘struct stat’ /Users/pnathan/cl-test-grid/work-dir/agent/test-runs/20141128034202-ccl-1.9-r15758-f96-macosx-x86/fasl/ql/dists/quicklisp/software/iolib-20140826-git/src/syscalls/ffi-types-unix.c:1021: error: forward declaration of ‘struct stat’ /Users/pnathan/cl-test-grid/work-dir/agent/test-runs/20141128034202-ccl-1.9-r15758-f96-macosx-x86/fasl/ql/dists/quicklisp/software/iolib-20140826-git/src/syscalls/ffi-types-unix.c:1031: error: invalid use of incomplete type ‘struct stat’ /Users/pnathan/cl-test-grid/work-dir/agent/test-runs/20141128034202-ccl-1.9-r15758-f96-macosx-x86/fasl/ql/dists/quicklisp/software/iolib-20140826-git/src/syscalls/ffi-types-unix.c:1021: error: forward declaration of ‘struct stat’ /Users/pnathan/cl-test-grid/work-dir/agent/test-runs/20141128034202-ccl-1.9-r15758-f96-macosx-x86/fasl/ql/dists/quicklisp/software/iolib-20140826-git/src/syscalls/ffi-types-unix.c:1032: error: invalid use of incomplete type ‘struct stat’ /Users/pnathan/cl-test-grid/work-dir/agent/test-runs/20141128034202-ccl-1.9-r15758-f96-macosx-x86/fasl/ql/dists/quicklisp/software/iolib-20140826-git/src/syscalls/ffi-types-unix.c:1021: error: forward declaration of ‘struct stat’ /Users/pnathan/cl-test-grid/work-dir/agent/test-runs/20141128034202-ccl-1.9-r15758-f96-macosx-x86/fasl/ql/dists/quicklisp/software/iolib-20140826-git/src/syscalls/ffi-types-unix.c:1033: error: invalid use of incomplete type ‘struct stat’ /Users/pnathan/cl-test-grid/work-dir/agent/test-runs/20141128034202-ccl-1.9-r15758-f96-macosx-x86/fasl/ql/dists/quicklisp/software/iolib-20140826-git/src/syscalls/ffi-types-unix.c:1021: error: forward declaration of ‘struct stat’ /Users/pnathan/cl-test-grid/work-dir/agent/test-runs/20141128034202-ccl-1.9-r15758-f96-macosx-x86/fasl/ql/dists/quicklisp/software/iolib-20140826-git/src/syscalls/ffi-types-unix.c:1034: error: invalid use of incomplete type ‘struct stat’ /Users/pnathan/cl-test-grid/work-dir/agent/test-runs/20141128034202-ccl-1.9-r15758-f96-macosx-x86/fasl/ql/dists/quicklisp/software/iolib-20140826-git/src/syscalls/ffi-types-unix.c:1021: error: forward declaration of ‘struct stat’ /Users/pnathan/cl-test-grid/work-dir/agent/test-runs/20141128034202-ccl-1.9-r15758-f96-macosx-x86/fasl/ql/dists/quicklisp/software/iolib-20140826-git/src/syscalls/ffi-types-unix.c:1037: error: invalid application of ‘sizeof’ to incomplete type ‘stat’ /Users/pnathan/cl-test-grid/work-dir/agent/test-runs/20141128034202-ccl-1.9-r15758-f96-macosx-x86/fasl/ql/dists/quicklisp/software/iolib-20140826-git/src/syscalls/ffi-types-unix.c:1775: error: invalid application of ‘sizeof’ to incomplete type ‘dirent’ /Users/pnathan/cl-test-grid/work-dir/agent/test-runs/20141128034202-ccl-1.9-r15758-f96-macosx-x86/fasl/ql/dists/quicklisp/software/iolib-20140826-git/src/syscalls/ffi-types-unix.c:1776: error: invalid use of incomplete type ‘struct dirent’ /Users/pnathan/cl-test-grid/work-dir/agent/test-runs/20141128034202-ccl-1.9-r15758-f96-macosx-x86/fasl/ql/dists/quicklisp/software/iolib-20140826-git/src/syscalls/ffi-types-unix.c:1775: error: forward declaration of ‘struct dirent’ /Users/pnathan/cl-test-grid/work-dir/agent/test-runs/20141128034202-ccl-1.9-r15758-f96-macosx-x86/fasl/ql/dists/quicklisp/software/iolib-20140826-git/src/syscalls/ffi-types-unix.c:1777: error: invalid use of incomplete type ‘struct dirent’ /Users/pnathan/cl-test-grid/work-dir/agent/test-runs/20141128034202-ccl-1.9-r15758-f96-macosx-x86/fasl/ql/dists/quicklisp/software/iolib-20140826-git/src/syscalls/ffi-types-unix.c:1775: error: forward declaration of ‘struct dirent’ /Users/pnathan/cl-test-grid/work-dir/agent/test-runs/20141128034202-ccl-1.9-r15758-f96-macosx-x86/fasl/ql/dists/quicklisp/software/iolib-20140826-git/src/syscalls/ffi-types-unix.c:1778: error: invalid use of incomplete type ‘struct dirent’ /Users/pnathan/cl-test-grid/work-dir/agent/test-runs/20141128034202-ccl-1.9-r15758-f96-macosx-x86/fasl/ql/dists/quicklisp/software/iolib-20140826-git/src/syscalls/ffi-types-unix.c:1775: error: forward declaration of ‘struct dirent’ /Users/pnathan/cl-test-grid/work-dir/agent/test-runs/20141128034202-ccl-1.9-r15758-f96-macosx-x86/fasl/ql/dists/quicklisp/software/iolib-20140826-git/src/syscalls/ffi-types-unix.c:1778: error: invalid use of incomplete type ‘struct dirent’ /Users/pnathan/cl-test-grid/work-dir/agent/test-runs/20141128034202-ccl-1.9-r15758-f96-macosx-x86/fasl/ql/dists/quicklisp/software/iolib-20140826-git/src/syscalls/ffi-types-unix.c:1775: error: forward declaration of ‘struct dirent’ /Users/pnathan/cl-test-grid/work-dir/agent/test-runs/20141128034202-ccl-1.9-r15758-f96-macosx-x86/fasl/ql/dists/quicklisp/software/iolib-20140826-git/src/syscalls/ffi-types-unix.c:1778: error: invalid use of incomplete type ‘struct dirent’ /Users/pnathan/cl-test-grid/work-dir/agent/test-runs/20141128034202-ccl-1.9-r15758-f96-macosx-x86/fasl/ql/dists/quicklisp/software/iolib-20140826-git/src/syscalls/ffi-types-unix.c:1775: error: forward declaration of ‘struct dirent’ /Users/pnathan/cl-test-grid/work-dir/agent/test-runs/20141128034202-ccl-1.9-r15758-f96-macosx-x86/fasl/ql/dists/quicklisp/software/iolib-20140826-git/src/syscalls/ffi-types-unix.c:1781: error: invalid application of ‘sizeof’ to incomplete type ‘dirent’
clisp-2.49-unix-i386
(LOAD cl-popen FAIL) ASDF:LOAD-SYSTEM-DEFINITION-ERROR : Error while trying to load definition for system iolib from pathname /Users/pnathan/cl-test-grid/work-dir/agent/quicklisp/dists/quicklisp/software/iolib-20140826-git/iolib.asd: You need ASDF >= 2.31.1 to load this system correctly.
clisp-2.49-unix-x64
(LOAD cl-popen FAIL) ASDF:LOAD-SYSTEM-DEFINITION-ERROR : Error while trying to load definition for system iolib from pathname /home/hijarian/systems/cl-test-grid/work-dir/agent/quicklisp/dists/quicklisp/software/iolib-20141217-git/iolib.asd: You need ASDF >= 2.31.1 to load this system correctly.
(LOAD cl-popen FAIL) ASDF:LOAD-SYSTEM-DEFINITION-ERROR : Error while trying to load definition for system iolib from pathname /home/hijarian/systems/cl-test-grid/work-dir/agent/quicklisp/dists/quicklisp/software/iolib-20140826-git/iolib.asd: You need ASDF >= 2.31.1 to load this system correctly.
clisp-2.49-unix-x86
(LOAD cl-popen FAIL) ASDF:LOAD-SYSTEM-DEFINITION-ERROR : Error while trying to load definition for system iolib from pathname /home/testgrid/cl-test-grid/work-dir/agent/quicklisp/dists/quicklisp/software/iolib-20141217-git/iolib.asd: You need ASDF >= 2.31.1 to load this system correctly.
(LOAD cl-popen FAIL) ASDF:LOAD-SYSTEM-DEFINITION-ERROR : Error while trying to load definition for system iolib from pathname /home/testgrid/cl-test-grid/work-dir/agent/quicklisp/dists/quicklisp/software/iolib-20140826-git/iolib.asd: You need ASDF >= 2.31.1 to load this system correctly.
cmu-snapshot-2013-04__20d_unicode_-linux-x86
cmu-snapshot-2014-01__20e_unicode_-linux-x86
cmu-snapshot-2014-05-dirty__20e_unicode_-linux-x86
cmu-snapshot-2014-12___20f_unicode_-linux-x86
ecl-13.5.1-76a84246-linux-x64-bytecode
(LOAD cl-popen FAIL) ASDF/FIND-SYSTEM:LOAD-SYSTEM-DEFINITION-ERROR : Error while trying to load definition for system iolib from pathname /home/hijarian/systems/cl-test-grid/work-dir/agent/quicklisp/dists/quicklisp/software/iolib-20140826-git/iolib.asd: The variable C::*CC-FLAGS* is unbound.
ecl-13.5.1-76a84246-linux-x64-lisp-to-c
(LOAD cl-popen FAIL) COMMON-LISP:SIMPLE-ERROR : External process exited with code 1. Command was: "g++" "-m64" "-Wno-write-strings" " -D_GNU_SOURCE -D_FILE_OFFSET_BITS=64 -g -O2 -fPIC -D_THREAD_SAFE -Dlinux" "-I/home/hijarian/systems/cl-test-grid/work-dir/agent/quicklisp/dists/quicklisp/software/iolib-20141217-git/src/grovel/" "-o" "/home/hijarian/systems/cl-test-grid/work-dir/agent/test-runs/20141218135157-ecl-13.5.1-76a84246-linux-x64-lisp-to-c/fasl/ql/dists/quicklisp/software/iolib-20141217-git/src/syscalls/ffi-types-unix" "/home/hijarian/systems/cl-test-grid/work-dir/agent/test-runs/20141218135157-ecl-13.5.1-76a84246-linux-x64-lisp-to-c/fasl/ql/dists/quicklisp/software/iolib-20141217-git/src/syscalls/ffi-types-unix.c" Output was: <see above>
(LOAD cl-popen FAIL) COMMON-LISP:SIMPLE-ERROR : External process exited with code 1. Command was: "g++" "-m64" "-Wno-write-strings" " -D_GNU_SOURCE -D_FILE_OFFSET_BITS=64 -g -O2 -fPIC -D_THREAD_SAFE -Dlinux" "-I/home/hijarian/systems/cl-test-grid/work-dir/agent/quicklisp/dists/quicklisp/software/iolib-20140826-git/src/grovel/" "-o" "/home/hijarian/systems/cl-test-grid/work-dir/agent/test-runs/20141119155044-ecl-13.5.1-76a84246-linux-x64-lisp-to-c/fasl/ql/dists/quicklisp/software/iolib-20140826-git/src/syscalls/ffi-types-unix" "/home/hijarian/systems/cl-test-grid/work-dir/agent/test-runs/20141119155044-ecl-13.5.1-76a84246-linux-x64-lisp-to-c/fasl/ql/dists/quicklisp/software/iolib-20140826-git/src/syscalls/ffi-types-unix.c" Output was: <see above>
ecl-13.5.1-unknown-linux-i686-bytecode
(LOAD cl-popen FAIL) ASDF/FIND-SYSTEM:LOAD-SYSTEM-DEFINITION-ERROR : Error while trying to load definition for system iolib from pathname /home/testgrid/cl-test-grid/work-dir/agent/quicklisp/dists/quicklisp/software/iolib-20141217-git/iolib.asd: The variable C::*CC-FLAGS* is unbound.
(LOAD cl-popen FAIL) ASDF/FIND-SYSTEM:LOAD-SYSTEM-DEFINITION-ERROR : Error while trying to load definition for system iolib from pathname /home/testgrid/cl-test-grid/work-dir/agent/quicklisp/dists/quicklisp/software/iolib-20140826-git/iolib.asd: The variable C::*CC-FLAGS* is unbound.
ecl-13.5.1-unknown-linux-i686-lisp-to-c
(LOAD cl-popen FAIL) COMMON-LISP:SIMPLE-ERROR : %CLOSE-FOREIGN-LIBRARY unimplemented.
sbcl-1.0.58-linux-x86
(LOAD cl-popen FAIL) ASDF:LOAD-SYSTEM-DEFINITION-ERROR : Error while trying to load definition for system iolib from pathname /home/testgrid/cl-test-grid/work-dir/agent/quicklisp/dists/quicklisp/software/iolib-20141217-git/iolib.asd: You need ASDF >= 2.31.1 to load this system correctly.
(LOAD cl-popen FAIL) ASDF:LOAD-SYSTEM-DEFINITION-ERROR : Error while trying to load definition for system iolib from pathname /home/testgrid/cl-test-grid/work-dir/agent/quicklisp/dists/quicklisp/software/iolib-20140826-git/iolib.asd: You need ASDF >= 2.31.1 to load this system correctly.
sbcl-1.1.11-linux-x86
sbcl-1.1.16-linux-x86
sbcl-1.2.3-linux-x64
(LOAD cl-popen FAIL) COMMON-LISP:SIMPLE-ERROR : External process exited with code 1. Command was: "g++" "-m64" "-Wno-write-strings" "-I/home/hijarian/systems/cl-test-grid/work-dir/agent/quicklisp/dists/quicklisp/software/iolib-20141217-git/src/grovel/" "-o" "/home/hijarian/systems/cl-test-grid/work-dir/agent/test-runs/20141218115532-sbcl-1.2.3-linux-x64/fasl/ql/dists/quicklisp/software/iolib-20141217-git/src/syscalls/ffi-types-unix" "/home/hijarian/systems/cl-test-grid/work-dir/agent/test-runs/20141218115532-sbcl-1.2.3-linux-x64/fasl/ql/dists/quicklisp/software/iolib-20141217-git/src/syscalls/ffi-types-unix.c" Output was: /home/hijarian/systems/cl-test-grid/work-dir/agent/test-runs/20141218115532-sbcl-1.2.3-linux-x64/fasl/ql/dists/quicklisp/software/iolib-20141217-git/src/syscalls/ffi-types-unix.c:14:17: fatal error: lfp.h: Нет такого файла или каталога #include <lfp.h> ^ compilation terminated.
(LOAD cl-popen FAIL) COMMON-LISP:SIMPLE-ERROR : External process exited with code 1. Command was: "g++" "-m64" "-Wno-write-strings" "-I/home/hijarian/systems/cl-test-grid/work-dir/agent/quicklisp/dists/quicklisp/software/iolib-20140826-git/src/grovel/" "-o" "/home/hijarian/systems/cl-test-grid/work-dir/agent/test-runs/20141119133959-sbcl-1.2.3-linux-x64/fasl/ql/dists/quicklisp/software/iolib-20140826-git/src/syscalls/ffi-types-unix" "/home/hijarian/systems/cl-test-grid/work-dir/agent/test-runs/20141119133959-sbcl-1.2.3-linux-x64/fasl/ql/dists/quicklisp/software/iolib-20140826-git/src/syscalls/ffi-types-unix.c" Output was: /home/hijarian/systems/cl-test-grid/work-dir/agent/test-runs/20141119133959-sbcl-1.2.3-linux-x64/fasl/ql/dists/quicklisp/software/iolib-20140826-git/src/syscalls/ffi-types-unix.c:14:17: fatal error: lfp.h: Нет такого файла или каталога #include <lfp.h> ^ compilation terminated.
sbcl-1.2.6-linux-x86

Breakdown by testcases: for every failed testcase the lisp implmentations it fails on

The library does not have a testsuite adapter for CL Test Grid.

To reports overview

Generated at: 2014-12-22 05:21:19 GMT.