cl-png results collected by cl-test-grid

Results on the last two Quicklisp distributions

 quicklisp 2014-09-14quicklisp 2014-08-26
abcl-1.2.0-fasl42-linux-x86
(LOAD png-test FAIL) ffi-grovel, CFFI-GROVEL:GROVEL-ERROR : External process exited with code 1. Command was: "cc" "-m32" "-I/opt/local/include" "-I/home/testgrid/cl-test-grid/work-dir/agent/quicklisp/dists/quicklisp/software/cffi_0.13.0/" "-o" "/home/testgrid/cl-test-grid/work-dir/agent/test-runs/20140918225720-abcl-1.2.0-fasl42-linux-x86/fasl/ql/dists/quicklisp/software/cl-png-0.6/grovel" "/home/testgrid/cl-test-grid/work-dir/agent/test-runs/20140918225720-abcl-1.2.0-fasl42-linux-x86/fasl/ql/dists/quicklisp/software/cl-png-0.6/grovel.c" Output was: /home/testgrid/cl-test-grid/work-dir/agent/test-runs/20140918225720-abcl-1.2.0-fasl42-linux-x86/fasl/ql/dists/quicklisp/software/cl-png-0.6/grovel.c:6:17: fatal error: png.h: No such file or directory compilation terminated.
(LOAD png FAIL) ffi-grovel, CFFI-GROVEL:GROVEL-ERROR : External process exited with code 1. Command was: "cc" "-m32" "-I/opt/local/include" "-I/home/testgrid/cl-test-grid/work-dir/agent/quicklisp/dists/quicklisp/software/cffi_0.13.0/" "-o" "/home/testgrid/cl-test-grid/work-dir/agent/test-runs/20140918225720-abcl-1.2.0-fasl42-linux-x86/fasl/ql/dists/quicklisp/software/cl-png-0.6/grovel" "/home/testgrid/cl-test-grid/work-dir/agent/test-runs/20140918225720-abcl-1.2.0-fasl42-linux-x86/fasl/ql/dists/quicklisp/software/cl-png-0.6/grovel.c" Output was: /home/testgrid/cl-test-grid/work-dir/agent/test-runs/20140918225720-abcl-1.2.0-fasl42-linux-x86/fasl/ql/dists/quicklisp/software/cl-png-0.6/grovel.c:6:17: fatal error: png.h: No such file or directory compilation terminated.
(LOAD png-test FAIL) ffi-grovel, CFFI-GROVEL:GROVEL-ERROR : External process exited with code 1. Command was: "cc" "-m32" "-I/opt/local/include" "-I/home/testgrid/cl-test-grid/work-dir/agent/quicklisp/dists/quicklisp/software/cffi_0.13.0/" "-o" "/home/testgrid/cl-test-grid/work-dir/agent/test-runs/20140831233725-abcl-1.2.0-fasl42-linux-x86/fasl/ql/dists/quicklisp/software/cl-png-0.6/grovel" "/home/testgrid/cl-test-grid/work-dir/agent/test-runs/20140831233725-abcl-1.2.0-fasl42-linux-x86/fasl/ql/dists/quicklisp/software/cl-png-0.6/grovel.c" Output was: /home/testgrid/cl-test-grid/work-dir/agent/test-runs/20140831233725-abcl-1.2.0-fasl42-linux-x86/fasl/ql/dists/quicklisp/software/cl-png-0.6/grovel.c:6:17: fatal error: png.h: No such file or directory compilation terminated.
(LOAD png FAIL) ffi-grovel, CFFI-GROVEL:GROVEL-ERROR : External process exited with code 1. Command was: "cc" "-m32" "-I/opt/local/include" "-I/home/testgrid/cl-test-grid/work-dir/agent/quicklisp/dists/quicklisp/software/cffi_0.13.0/" "-o" "/home/testgrid/cl-test-grid/work-dir/agent/test-runs/20140831233725-abcl-1.2.0-fasl42-linux-x86/fasl/ql/dists/quicklisp/software/cl-png-0.6/grovel" "/home/testgrid/cl-test-grid/work-dir/agent/test-runs/20140831233725-abcl-1.2.0-fasl42-linux-x86/fasl/ql/dists/quicklisp/software/cl-png-0.6/grovel.c" Output was: /home/testgrid/cl-test-grid/work-dir/agent/test-runs/20140831233725-abcl-1.2.0-fasl42-linux-x86/fasl/ql/dists/quicklisp/software/cl-png-0.6/grovel.c:6:17: fatal error: png.h: No such file or directory compilation terminated.
abcl-1.2.1-fasl42-linux-x86
(LOAD png-test FAIL) ffi-grovel, CFFI-GROVEL:GROVEL-ERROR : External process exited with code 1. Command was: "cc" "-m32" "-I/opt/local/include" "-I/home/testgrid/cl-test-grid/work-dir/agent/quicklisp/dists/quicklisp/software/cffi_0.13.0/" "-o" "/home/testgrid/cl-test-grid/work-dir/agent/test-runs/20140918095625-abcl-1.2.1-fasl42-linux-x86/fasl/ql/dists/quicklisp/software/cl-png-0.6/grovel" "/home/testgrid/cl-test-grid/work-dir/agent/test-runs/20140918095625-abcl-1.2.1-fasl42-linux-x86/fasl/ql/dists/quicklisp/software/cl-png-0.6/grovel.c" Output was: /home/testgrid/cl-test-grid/work-dir/agent/test-runs/20140918095625-abcl-1.2.1-fasl42-linux-x86/fasl/ql/dists/quicklisp/software/cl-png-0.6/grovel.c:6:17: fatal error: png.h: No such file or directory compilation terminated.
(LOAD png FAIL) ffi-grovel, CFFI-GROVEL:GROVEL-ERROR : External process exited with code 1. Command was: "cc" "-m32" "-I/opt/local/include" "-I/home/testgrid/cl-test-grid/work-dir/agent/quicklisp/dists/quicklisp/software/cffi_0.13.0/" "-o" "/home/testgrid/cl-test-grid/work-dir/agent/test-runs/20140918095625-abcl-1.2.1-fasl42-linux-x86/fasl/ql/dists/quicklisp/software/cl-png-0.6/grovel" "/home/testgrid/cl-test-grid/work-dir/agent/test-runs/20140918095625-abcl-1.2.1-fasl42-linux-x86/fasl/ql/dists/quicklisp/software/cl-png-0.6/grovel.c" Output was: /home/testgrid/cl-test-grid/work-dir/agent/test-runs/20140918095625-abcl-1.2.1-fasl42-linux-x86/fasl/ql/dists/quicklisp/software/cl-png-0.6/grovel.c:6:17: fatal error: png.h: No such file or directory compilation terminated.
(LOAD png-test FAIL) ffi-grovel, CFFI-GROVEL:GROVEL-ERROR : External process exited with code 1. Command was: "cc" "-m32" "-I/opt/local/include" "-I/home/testgrid/cl-test-grid/work-dir/agent/quicklisp/dists/quicklisp/software/cffi_0.13.0/" "-o" "/home/testgrid/cl-test-grid/work-dir/agent/test-runs/20140831100849-abcl-1.2.1-fasl42-linux-x86/fasl/ql/dists/quicklisp/software/cl-png-0.6/grovel" "/home/testgrid/cl-test-grid/work-dir/agent/test-runs/20140831100849-abcl-1.2.1-fasl42-linux-x86/fasl/ql/dists/quicklisp/software/cl-png-0.6/grovel.c" Output was: /home/testgrid/cl-test-grid/work-dir/agent/test-runs/20140831100849-abcl-1.2.1-fasl42-linux-x86/fasl/ql/dists/quicklisp/software/cl-png-0.6/grovel.c:6:17: fatal error: png.h: No such file or directory compilation terminated.
(LOAD png FAIL) ffi-grovel, CFFI-GROVEL:GROVEL-ERROR : External process exited with code 1. Command was: "cc" "-m32" "-I/opt/local/include" "-I/home/testgrid/cl-test-grid/work-dir/agent/quicklisp/dists/quicklisp/software/cffi_0.13.0/" "-o" "/home/testgrid/cl-test-grid/work-dir/agent/test-runs/20140831100849-abcl-1.2.1-fasl42-linux-x86/fasl/ql/dists/quicklisp/software/cl-png-0.6/grovel" "/home/testgrid/cl-test-grid/work-dir/agent/test-runs/20140831100849-abcl-1.2.1-fasl42-linux-x86/fasl/ql/dists/quicklisp/software/cl-png-0.6/grovel.c" Output was: /home/testgrid/cl-test-grid/work-dir/agent/test-runs/20140831100849-abcl-1.2.1-fasl42-linux-x86/fasl/ql/dists/quicklisp/software/cl-png-0.6/grovel.c:6:17: fatal error: png.h: No such file or directory compilation terminated.
abcl-1.2.1-fasl42-macosx-x64
(LOAD png-test FAIL) ffi, ASDF/FIND-SYSTEM:LOAD-SYSTEM-DEFINITION-ERROR : Error while trying to load definition for system png from pathname /Users/pnathan/cl-test-grid/work-dir/agent/quicklisp/dists/quicklisp/software/cl-png-0.6/png.asd: Don't know how to REQUIRE JNA.
(LOAD png FAIL) ffi, ASDF/FIND-SYSTEM:LOAD-SYSTEM-DEFINITION-ERROR : Error while trying to load definition for system png from pathname /Users/pnathan/cl-test-grid/work-dir/agent/quicklisp/dists/quicklisp/software/cl-png-0.6/png.asd: Don't know how to REQUIRE JNA.
(LOAD png-test FAIL) ffi, ASDF/FIND-SYSTEM:LOAD-SYSTEM-DEFINITION-ERROR : Error while trying to load definition for system png from pathname /Users/pnathan/cl-test-grid/work-dir/agent/quicklisp/dists/quicklisp/software/cl-png-0.6/png.asd: Don't know how to REQUIRE JNA.
(LOAD png FAIL) ffi, ASDF/FIND-SYSTEM:LOAD-SYSTEM-DEFINITION-ERROR : Error while trying to load definition for system png from pathname /Users/pnathan/cl-test-grid/work-dir/agent/quicklisp/dists/quicklisp/software/cl-png-0.6/png.asd: Don't know how to REQUIRE JNA.
abcl-1.3.0-fasl42-linux-x86
(LOAD png-test FAIL) ffi-grovel, CFFI-GROVEL:GROVEL-ERROR : External process exited with code 1. Command was: "cc" "-m32" "-I/opt/local/include" "-I/home/testgrid/cl-test-grid/work-dir/agent/quicklisp/dists/quicklisp/software/cffi_0.13.0/" "-o" "/home/testgrid/cl-test-grid/work-dir/agent/test-runs/20140917222030-abcl-1.3.0-fasl42-linux-x86/fasl/ql/dists/quicklisp/software/cl-png-0.6/grovel" "/home/testgrid/cl-test-grid/work-dir/agent/test-runs/20140917222030-abcl-1.3.0-fasl42-linux-x86/fasl/ql/dists/quicklisp/software/cl-png-0.6/grovel.c" Output was: /home/testgrid/cl-test-grid/work-dir/agent/test-runs/20140917222030-abcl-1.3.0-fasl42-linux-x86/fasl/ql/dists/quicklisp/software/cl-png-0.6/grovel.c:6:17: fatal error: png.h: No such file or directory compilation terminated.
(LOAD png FAIL) ffi-grovel, CFFI-GROVEL:GROVEL-ERROR : External process exited with code 1. Command was: "cc" "-m32" "-I/opt/local/include" "-I/home/testgrid/cl-test-grid/work-dir/agent/quicklisp/dists/quicklisp/software/cffi_0.13.0/" "-o" "/home/testgrid/cl-test-grid/work-dir/agent/test-runs/20140917222030-abcl-1.3.0-fasl42-linux-x86/fasl/ql/dists/quicklisp/software/cl-png-0.6/grovel" "/home/testgrid/cl-test-grid/work-dir/agent/test-runs/20140917222030-abcl-1.3.0-fasl42-linux-x86/fasl/ql/dists/quicklisp/software/cl-png-0.6/grovel.c" Output was: /home/testgrid/cl-test-grid/work-dir/agent/test-runs/20140917222030-abcl-1.3.0-fasl42-linux-x86/fasl/ql/dists/quicklisp/software/cl-png-0.6/grovel.c:6:17: fatal error: png.h: No such file or directory compilation terminated.
(LOAD png-test FAIL) ffi-grovel, CFFI-GROVEL:GROVEL-ERROR : External process exited with code 1. Command was: "cc" "-m32" "-I/opt/local/include" "-I/home/testgrid/cl-test-grid/work-dir/agent/quicklisp/dists/quicklisp/software/cffi_0.13.0/" "-o" "/home/testgrid/cl-test-grid/work-dir/agent/test-runs/20140830223246-abcl-1.3.0-fasl42-linux-x86/fasl/ql/dists/quicklisp/software/cl-png-0.6/grovel" "/home/testgrid/cl-test-grid/work-dir/agent/test-runs/20140830223246-abcl-1.3.0-fasl42-linux-x86/fasl/ql/dists/quicklisp/software/cl-png-0.6/grovel.c" Output was: /home/testgrid/cl-test-grid/work-dir/agent/test-runs/20140830223246-abcl-1.3.0-fasl42-linux-x86/fasl/ql/dists/quicklisp/software/cl-png-0.6/grovel.c:6:17: fatal error: png.h: No such file or directory compilation terminated.
(LOAD png FAIL) ffi-grovel, CFFI-GROVEL:GROVEL-ERROR : External process exited with code 1. Command was: "cc" "-m32" "-I/opt/local/include" "-I/home/testgrid/cl-test-grid/work-dir/agent/quicklisp/dists/quicklisp/software/cffi_0.13.0/" "-o" "/home/testgrid/cl-test-grid/work-dir/agent/test-runs/20140830223246-abcl-1.3.0-fasl42-linux-x86/fasl/ql/dists/quicklisp/software/cl-png-0.6/grovel" "/home/testgrid/cl-test-grid/work-dir/agent/test-runs/20140830223246-abcl-1.3.0-fasl42-linux-x86/fasl/ql/dists/quicklisp/software/cl-png-0.6/grovel.c" Output was: /home/testgrid/cl-test-grid/work-dir/agent/test-runs/20140830223246-abcl-1.3.0-fasl42-linux-x86/fasl/ql/dists/quicklisp/software/cl-png-0.6/grovel.c:6:17: fatal error: png.h: No such file or directory compilation terminated.
abcl-1.3.1-fasl42-linux-x86
(LOAD png-test FAIL) ffi-grovel, CFFI-GROVEL:GROVEL-ERROR : External process exited with code 1. Command was: "cc" "-m32" "-I/opt/local/include" "-I/home/testgrid/cl-test-grid/work-dir/agent/quicklisp/dists/quicklisp/software/cffi_0.13.0/" "-o" "/home/testgrid/cl-test-grid/work-dir/agent/test-runs/20140917091242-abcl-1.3.1-fasl42-linux-x86/fasl/ql/dists/quicklisp/software/cl-png-0.6/grovel" "/home/testgrid/cl-test-grid/work-dir/agent/test-runs/20140917091242-abcl-1.3.1-fasl42-linux-x86/fasl/ql/dists/quicklisp/software/cl-png-0.6/grovel.c" Output was: /home/testgrid/cl-test-grid/work-dir/agent/test-runs/20140917091242-abcl-1.3.1-fasl42-linux-x86/fasl/ql/dists/quicklisp/software/cl-png-0.6/grovel.c:6:17: fatal error: png.h: No such file or directory compilation terminated.
(LOAD png FAIL) ffi-grovel, CFFI-GROVEL:GROVEL-ERROR : External process exited with code 1. Command was: "cc" "-m32" "-I/opt/local/include" "-I/home/testgrid/cl-test-grid/work-dir/agent/quicklisp/dists/quicklisp/software/cffi_0.13.0/" "-o" "/home/testgrid/cl-test-grid/work-dir/agent/test-runs/20140917091242-abcl-1.3.1-fasl42-linux-x86/fasl/ql/dists/quicklisp/software/cl-png-0.6/grovel" "/home/testgrid/cl-test-grid/work-dir/agent/test-runs/20140917091242-abcl-1.3.1-fasl42-linux-x86/fasl/ql/dists/quicklisp/software/cl-png-0.6/grovel.c" Output was: /home/testgrid/cl-test-grid/work-dir/agent/test-runs/20140917091242-abcl-1.3.1-fasl42-linux-x86/fasl/ql/dists/quicklisp/software/cl-png-0.6/grovel.c:6:17: fatal error: png.h: No such file or directory compilation terminated.
(LOAD png-test FAIL) ffi-grovel, CFFI-GROVEL:GROVEL-ERROR : External process exited with code 1. Command was: "cc" "-m32" "-I/opt/local/include" "-I/home/testgrid/cl-test-grid/work-dir/agent/quicklisp/dists/quicklisp/software/cffi_0.13.0/" "-o" "/home/testgrid/cl-test-grid/work-dir/agent/test-runs/20140830094925-abcl-1.3.1-fasl42-linux-x86/fasl/ql/dists/quicklisp/software/cl-png-0.6/grovel" "/home/testgrid/cl-test-grid/work-dir/agent/test-runs/20140830094925-abcl-1.3.1-fasl42-linux-x86/fasl/ql/dists/quicklisp/software/cl-png-0.6/grovel.c" Output was: /home/testgrid/cl-test-grid/work-dir/agent/test-runs/20140830094925-abcl-1.3.1-fasl42-linux-x86/fasl/ql/dists/quicklisp/software/cl-png-0.6/grovel.c:6:17: fatal error: png.h: No such file or directory compilation terminated.
(LOAD png FAIL) ffi-grovel, CFFI-GROVEL:GROVEL-ERROR : External process exited with code 1. Command was: "cc" "-m32" "-I/opt/local/include" "-I/home/testgrid/cl-test-grid/work-dir/agent/quicklisp/dists/quicklisp/software/cffi_0.13.0/" "-o" "/home/testgrid/cl-test-grid/work-dir/agent/test-runs/20140830094925-abcl-1.3.1-fasl42-linux-x86/fasl/ql/dists/quicklisp/software/cl-png-0.6/grovel" "/home/testgrid/cl-test-grid/work-dir/agent/test-runs/20140830094925-abcl-1.3.1-fasl42-linux-x86/fasl/ql/dists/quicklisp/software/cl-png-0.6/grovel.c" Output was: /home/testgrid/cl-test-grid/work-dir/agent/test-runs/20140830094925-abcl-1.3.1-fasl42-linux-x86/fasl/ql/dists/quicklisp/software/cl-png-0.6/grovel.c:6:17: fatal error: png.h: No such file or directory compilation terminated.
ccl-1.10-f96-macosx-x86
(LOAD png-test FAIL) ffi-grovel, CFFI-GROVEL:GROVEL-ERROR : External process exited with code 1. Command was: "cc" "-m32" "-I" "/opt/local/include/" "-I/opt/local/include" "-I/usr/local/src/cl-test-grid/work-dir/agent/quicklisp/dists/quicklisp/software/cffi_0.13.0/" "-o" "/usr/local/src/cl-test-grid/work-dir/agent/test-runs/20140828165601-ccl-1.10-f96-macosx-x86/fasl/ql/dists/quicklisp/software/cl-png-0.6/grovel" "/usr/local/src/cl-test-grid/work-dir/agent/test-runs/20140828165601-ccl-1.10-f96-macosx-x86/fasl/ql/dists/quicklisp/software/cl-png-0.6/grovel.c" Output was: /usr/local/src/cl-test-grid/work-dir/agent/test-runs/20140828165601-ccl-1.10-f96-macosx-x86/fasl/ql/dists/quicklisp/software/cl-png-0.6/grovel.c:6:10: fatal error: 'png.h' file not found #include <png.h> ^ 1 error generated.
(LOAD png FAIL) ffi-grovel, CFFI-GROVEL:GROVEL-ERROR : External process exited with code 1. Command was: "cc" "-m32" "-I" "/opt/local/include/" "-I/opt/local/include" "-I/usr/local/src/cl-test-grid/work-dir/agent/quicklisp/dists/quicklisp/software/cffi_0.13.0/" "-o" "/usr/local/src/cl-test-grid/work-dir/agent/test-runs/20140828165601-ccl-1.10-f96-macosx-x86/fasl/ql/dists/quicklisp/software/cl-png-0.6/grovel" "/usr/local/src/cl-test-grid/work-dir/agent/test-runs/20140828165601-ccl-1.10-f96-macosx-x86/fasl/ql/dists/quicklisp/software/cl-png-0.6/grovel.c" Output was: /usr/local/src/cl-test-grid/work-dir/agent/test-runs/20140828165601-ccl-1.10-f96-macosx-x86/fasl/ql/dists/quicklisp/software/cl-png-0.6/grovel.c:6:10: fatal error: 'png.h' file not found #include <png.h> ^ 1 error generated.
ccl-1.10-rc1-r16192-f96-macosx-x86
(LOAD png-test FAIL) ffi-grovel, CFFI-GROVEL:GROVEL-ERROR : External process exited with code 1. Command was: "cc" "-m32" "-I" "/opt/local/include/" "-I/opt/local/include" "-I/usr/local/src/cl-test-grid/work-dir/agent/quicklisp/dists/quicklisp/software/cffi_0.13.0/" "-o" "/usr/local/src/cl-test-grid/work-dir/agent/test-runs/20140908210239-ccl-1.10-rc1-r16192-f96-macosx-x86/fasl/ql/dists/quicklisp/software/cl-png-0.6/grovel" "/usr/local/src/cl-test-grid/work-dir/agent/test-runs/20140908210239-ccl-1.10-rc1-r16192-f96-macosx-x86/fasl/ql/dists/quicklisp/software/cl-png-0.6/grovel.c" Output was: /usr/local/src/cl-test-grid/work-dir/agent/test-runs/20140908210239-ccl-1.10-rc1-r16192-f96-macosx-x86/fasl/ql/dists/quicklisp/software/cl-png-0.6/grovel.c:6:10: fatal error: 'png.h' file not found #include <png.h> ^ 1 error generated.
(LOAD png FAIL) ffi-grovel, CFFI-GROVEL:GROVEL-ERROR : External process exited with code 1. Command was: "cc" "-m32" "-I" "/opt/local/include/" "-I/opt/local/include" "-I/usr/local/src/cl-test-grid/work-dir/agent/quicklisp/dists/quicklisp/software/cffi_0.13.0/" "-o" "/usr/local/src/cl-test-grid/work-dir/agent/test-runs/20140908210239-ccl-1.10-rc1-r16192-f96-macosx-x86/fasl/ql/dists/quicklisp/software/cl-png-0.6/grovel" "/usr/local/src/cl-test-grid/work-dir/agent/test-runs/20140908210239-ccl-1.10-rc1-r16192-f96-macosx-x86/fasl/ql/dists/quicklisp/software/cl-png-0.6/grovel.c" Output was: /usr/local/src/cl-test-grid/work-dir/agent/test-runs/20140908210239-ccl-1.10-rc1-r16192-f96-macosx-x86/fasl/ql/dists/quicklisp/software/cl-png-0.6/grovel.c:6:10: fatal error: 'png.h' file not found #include <png.h> ^ 1 error generated.
ccl-1.8-r15286m-f95-linux-x86
(LOAD png-test FAIL) ffi-grovel, CFFI-GROVEL:GROVEL-ERROR : External process exited with code 1. Command was: "cc" "-m32" "-I/opt/local/include" "-I/home/testgrid/cl-test-grid/work-dir/agent/quicklisp/dists/quicklisp/software/cffi_0.13.0/" "-o" "/home/testgrid/cl-test-grid/work-dir/agent/test-runs/20140916134836-ccl-1.8-r15286m-f95-linux-x86/fasl/ql/dists/quicklisp/software/cl-png-0.6/grovel" "/home/testgrid/cl-test-grid/work-dir/agent/test-runs/20140916134836-ccl-1.8-r15286m-f95-linux-x86/fasl/ql/dists/quicklisp/software/cl-png-0.6/grovel.c" Output was: /home/testgrid/cl-test-grid/work-dir/agent/test-runs/20140916134836-ccl-1.8-r15286m-f95-linux-x86/fasl/ql/dists/quicklisp/software/cl-png-0.6/grovel.c:6:17: fatal error: png.h: No such file or directory compilation terminated.
(LOAD png FAIL) ffi-grovel, CFFI-GROVEL:GROVEL-ERROR : External process exited with code 1. Command was: "cc" "-m32" "-I/opt/local/include" "-I/home/testgrid/cl-test-grid/work-dir/agent/quicklisp/dists/quicklisp/software/cffi_0.13.0/" "-o" "/home/testgrid/cl-test-grid/work-dir/agent/test-runs/20140916134836-ccl-1.8-r15286m-f95-linux-x86/fasl/ql/dists/quicklisp/software/cl-png-0.6/grovel" "/home/testgrid/cl-test-grid/work-dir/agent/test-runs/20140916134836-ccl-1.8-r15286m-f95-linux-x86/fasl/ql/dists/quicklisp/software/cl-png-0.6/grovel.c" Output was: /home/testgrid/cl-test-grid/work-dir/agent/test-runs/20140916134836-ccl-1.8-r15286m-f95-linux-x86/fasl/ql/dists/quicklisp/software/cl-png-0.6/grovel.c:6:17: fatal error: png.h: No such file or directory compilation terminated.
(LOAD png-test FAIL) ffi-grovel, CFFI-GROVEL:GROVEL-ERROR : External process exited with code 1. Command was: "cc" "-m32" "-I/opt/local/include" "-I/home/testgrid/cl-test-grid/work-dir/agent/quicklisp/dists/quicklisp/software/cffi_0.13.0/" "-o" "/home/testgrid/cl-test-grid/work-dir/agent/test-runs/20140829155837-ccl-1.8-f95-linux-x86/fasl/ql/dists/quicklisp/software/cl-png-0.6/grovel" "/home/testgrid/cl-test-grid/work-dir/agent/test-runs/20140829155837-ccl-1.8-f95-linux-x86/fasl/ql/dists/quicklisp/software/cl-png-0.6/grovel.c" Output was: /home/testgrid/cl-test-grid/work-dir/agent/test-runs/20140829155837-ccl-1.8-f95-linux-x86/fasl/ql/dists/quicklisp/software/cl-png-0.6/grovel.c:6:17: fatal error: png.h: No such file or directory compilation terminated.
(LOAD png FAIL) ffi-grovel, CFFI-GROVEL:GROVEL-ERROR : External process exited with code 1. Command was: "cc" "-m32" "-I/opt/local/include" "-I/home/testgrid/cl-test-grid/work-dir/agent/quicklisp/dists/quicklisp/software/cffi_0.13.0/" "-o" "/home/testgrid/cl-test-grid/work-dir/agent/test-runs/20140829155837-ccl-1.8-f95-linux-x86/fasl/ql/dists/quicklisp/software/cl-png-0.6/grovel" "/home/testgrid/cl-test-grid/work-dir/agent/test-runs/20140829155837-ccl-1.8-f95-linux-x86/fasl/ql/dists/quicklisp/software/cl-png-0.6/grovel.c" Output was: /home/testgrid/cl-test-grid/work-dir/agent/test-runs/20140829155837-ccl-1.8-f95-linux-x86/fasl/ql/dists/quicklisp/software/cl-png-0.6/grovel.c:6:17: fatal error: png.h: No such file or directory compilation terminated.
ccl-1.9-f96-linux-x64
(LOAD png-test FAIL) ffi-grovel, CFFI-GROVEL:GROVEL-ERROR : External process exited with code 1. Command was: "cc" "-m64" "-I/opt/local/include" "-I/home/hijarian/systems/cl-test-grid/work-dir/agent/quicklisp/dists/quicklisp/software/cffi_0.13.0/" "-o" "/home/hijarian/systems/cl-test-grid/work-dir/agent/test-runs/20140915142853-ccl-1.9-f96-linux-x64/fasl/ql/dists/quicklisp/software/cl-png-0.6/grovel" "/home/hijarian/systems/cl-test-grid/work-dir/agent/test-runs/20140915142853-ccl-1.9-f96-linux-x64/fasl/ql/dists/quicklisp/software/cl-png-0.6/grovel.c" Output was: /home/hijarian/systems/cl-test-grid/work-dir/agent/test-runs/20140915142853-ccl-1.9-f96-linux-x64/fasl/ql/dists/quicklisp/software/cl-png-0.6/grovel.c:6:17: fatal error: png.h: Нет такого файла или каталога compilation terminated.
(LOAD png FAIL) ffi-grovel, CFFI-GROVEL:GROVEL-ERROR : External process exited with code 1. Command was: "cc" "-m64" "-I/opt/local/include" "-I/home/hijarian/systems/cl-test-grid/work-dir/agent/quicklisp/dists/quicklisp/software/cffi_0.13.0/" "-o" "/home/hijarian/systems/cl-test-grid/work-dir/agent/test-runs/20140915142853-ccl-1.9-f96-linux-x64/fasl/ql/dists/quicklisp/software/cl-png-0.6/grovel" "/home/hijarian/systems/cl-test-grid/work-dir/agent/test-runs/20140915142853-ccl-1.9-f96-linux-x64/fasl/ql/dists/quicklisp/software/cl-png-0.6/grovel.c" Output was: /home/hijarian/systems/cl-test-grid/work-dir/agent/test-runs/20140915142853-ccl-1.9-f96-linux-x64/fasl/ql/dists/quicklisp/software/cl-png-0.6/grovel.c:6:17: fatal error: png.h: Нет такого файла или каталога compilation terminated.
ccl-1.9-f96-linux-x86
(LOAD png-test FAIL) ffi-grovel, CFFI-GROVEL:GROVEL-ERROR : External process exited with code 1. Command was: "cc" "-m32" "-I/opt/local/include" "-I/home/hijarian/projects/others/cl-test-grid/work-dir/agent/quicklisp/dists/quicklisp/software/cffi_0.13.0/" "-o" "/home/hijarian/projects/others/cl-test-grid/work-dir/agent/test-runs/20140827164806-ccl-1.9-f96-linux-x86/fasl/ql/dists/quicklisp/software/cl-png-0.6/grovel" "/home/hijarian/projects/others/cl-test-grid/work-dir/agent/test-runs/20140827164806-ccl-1.9-f96-linux-x86/fasl/ql/dists/quicklisp/software/cl-png-0.6/grovel.c" Output was: In file included from /usr/include/png.h:536:0, from /home/hijarian/projects/others/cl-test-grid/work-dir/agent/test-runs/20140827164806-ccl-1.9-f96-linux-x86/fasl/ql/dists/quicklisp/software/cl-png-0.6/grovel.c:6: /usr/include/zlib.h:34:19: fatal error: zconf.h: Нет такого файла или каталога #include "zconf.h" ^ compilation terminated.
(LOAD png FAIL) ffi-grovel, CFFI-GROVEL:GROVEL-ERROR : External process exited with code 1. Command was: "cc" "-m32" "-I/opt/local/include" "-I/home/hijarian/projects/others/cl-test-grid/work-dir/agent/quicklisp/dists/quicklisp/software/cffi_0.13.0/" "-o" "/home/hijarian/projects/others/cl-test-grid/work-dir/agent/test-runs/20140827164806-ccl-1.9-f96-linux-x86/fasl/ql/dists/quicklisp/software/cl-png-0.6/grovel" "/home/hijarian/projects/others/cl-test-grid/work-dir/agent/test-runs/20140827164806-ccl-1.9-f96-linux-x86/fasl/ql/dists/quicklisp/software/cl-png-0.6/grovel.c" Output was: In file included from /usr/include/png.h:536:0, from /home/hijarian/projects/others/cl-test-grid/work-dir/agent/test-runs/20140827164806-ccl-1.9-f96-linux-x86/fasl/ql/dists/quicklisp/software/cl-png-0.6/grovel.c:6: /usr/include/zlib.h:34:19: fatal error: zconf.h: Нет такого файла или каталога #include "zconf.h" ^ compilation terminated.
ccl-1.9-r15756-f96-linux-x86
(LOAD png-test FAIL) ffi-grovel, CFFI-GROVEL:GROVEL-ERROR : External process exited with code 1. Command was: "cc" "-m32" "-I/opt/local/include" "-I/home/testgrid/cl-test-grid/work-dir/agent/quicklisp/dists/quicklisp/software/cffi_0.13.0/" "-o" "/home/testgrid/cl-test-grid/work-dir/agent/test-runs/20140915221737-ccl-1.9-r15756-f96-linux-x86/fasl/ql/dists/quicklisp/software/cl-png-0.6/grovel" "/home/testgrid/cl-test-grid/work-dir/agent/test-runs/20140915221737-ccl-1.9-r15756-f96-linux-x86/fasl/ql/dists/quicklisp/software/cl-png-0.6/grovel.c" Output was: /home/testgrid/cl-test-grid/work-dir/agent/test-runs/20140915221737-ccl-1.9-r15756-f96-linux-x86/fasl/ql/dists/quicklisp/software/cl-png-0.6/grovel.c:6:17: fatal error: png.h: No such file or directory compilation terminated.
(LOAD png FAIL) ffi-grovel, CFFI-GROVEL:GROVEL-ERROR : External process exited with code 1. Command was: "cc" "-m32" "-I/opt/local/include" "-I/home/testgrid/cl-test-grid/work-dir/agent/quicklisp/dists/quicklisp/software/cffi_0.13.0/" "-o" "/home/testgrid/cl-test-grid/work-dir/agent/test-runs/20140915221737-ccl-1.9-r15756-f96-linux-x86/fasl/ql/dists/quicklisp/software/cl-png-0.6/grovel" "/home/testgrid/cl-test-grid/work-dir/agent/test-runs/20140915221737-ccl-1.9-r15756-f96-linux-x86/fasl/ql/dists/quicklisp/software/cl-png-0.6/grovel.c" Output was: /home/testgrid/cl-test-grid/work-dir/agent/test-runs/20140915221737-ccl-1.9-r15756-f96-linux-x86/fasl/ql/dists/quicklisp/software/cl-png-0.6/grovel.c:6:17: fatal error: png.h: No such file or directory compilation terminated.
(LOAD png-test FAIL) ffi-grovel, CFFI-GROVEL:GROVEL-ERROR : External process exited with code 1. Command was: "cc" "-m32" "-I/opt/local/include" "-I/home/testgrid/cl-test-grid/work-dir/agent/quicklisp/dists/quicklisp/software/cffi_0.13.0/" "-o" "/home/testgrid/cl-test-grid/work-dir/agent/test-runs/20140827224850-ccl-1.9-f96-linux-x86/fasl/ql/dists/quicklisp/software/cl-png-0.6/grovel" "/home/testgrid/cl-test-grid/work-dir/agent/test-runs/20140827224850-ccl-1.9-f96-linux-x86/fasl/ql/dists/quicklisp/software/cl-png-0.6/grovel.c" Output was: /home/testgrid/cl-test-grid/work-dir/agent/test-runs/20140827224850-ccl-1.9-f96-linux-x86/fasl/ql/dists/quicklisp/software/cl-png-0.6/grovel.c:6:17: fatal error: png.h: No such file or directory compilation terminated.
(LOAD png FAIL) ffi-grovel, CFFI-GROVEL:GROVEL-ERROR : External process exited with code 1. Command was: "cc" "-m32" "-I/opt/local/include" "-I/home/testgrid/cl-test-grid/work-dir/agent/quicklisp/dists/quicklisp/software/cffi_0.13.0/" "-o" "/home/testgrid/cl-test-grid/work-dir/agent/test-runs/20140827224850-ccl-1.9-f96-linux-x86/fasl/ql/dists/quicklisp/software/cl-png-0.6/grovel" "/home/testgrid/cl-test-grid/work-dir/agent/test-runs/20140827224850-ccl-1.9-f96-linux-x86/fasl/ql/dists/quicklisp/software/cl-png-0.6/grovel.c" Output was: /home/testgrid/cl-test-grid/work-dir/agent/test-runs/20140827224850-ccl-1.9-f96-linux-x86/fasl/ql/dists/quicklisp/software/cl-png-0.6/grovel.c:6:17: fatal error: png.h: No such file or directory compilation terminated.
clisp-2.49-unix-i386
(LOAD png-test FAIL) ffi, ASDF:LOAD-SYSTEM-DEFINITION-ERROR : Error while trying to load definition for system png from pathname /Users/pnathan/cl-test-grid/work-dir/agent/quicklisp/dists/quicklisp/software/cl-png-0.6/png.asd: CFFI requires CLISP compiled with dynamic FFI support.
(LOAD png FAIL) ffi, ASDF:LOAD-SYSTEM-DEFINITION-ERROR : Error while trying to load definition for system png from pathname /Users/pnathan/cl-test-grid/work-dir/agent/quicklisp/dists/quicklisp/software/cl-png-0.6/png.asd: CFFI requires CLISP compiled with dynamic FFI support.
clisp-2.49-unix-x64
(LOAD png-test FAIL) ffi-grovel, CFFI-GROVEL:GROVEL-ERROR : External process exited with code 1. Command was: "cc" "-m64" "-I/opt/local/include" "-I/home/hijarian/systems/cl-test-grid/work-dir/agent/quicklisp/dists/quicklisp/software/cffi_0.13.0/" "-o" "/home/hijarian/systems/cl-test-grid/work-dir/agent/test-runs/20140915121117-clisp-2.49-unix-x64/fasl/ql/dists/quicklisp/software/cl-png-0.6/grovel" "/home/hijarian/systems/cl-test-grid/work-dir/agent/test-runs/20140915121117-clisp-2.49-unix-x64/fasl/ql/dists/quicklisp/software/cl-png-0.6/grovel.c" Output was: <see above>
(LOAD png FAIL) ffi-grovel, CFFI-GROVEL:GROVEL-ERROR : External process exited with code 1. Command was: "cc" "-m64" "-I/opt/local/include" "-I/home/hijarian/systems/cl-test-grid/work-dir/agent/quicklisp/dists/quicklisp/software/cffi_0.13.0/" "-o" "/home/hijarian/systems/cl-test-grid/work-dir/agent/test-runs/20140915121117-clisp-2.49-unix-x64/fasl/ql/dists/quicklisp/software/cl-png-0.6/grovel" "/home/hijarian/systems/cl-test-grid/work-dir/agent/test-runs/20140915121117-clisp-2.49-unix-x64/fasl/ql/dists/quicklisp/software/cl-png-0.6/grovel.c" Output was: <see above>
clisp-2.49-unix-x86
(LOAD png-test FAIL) ffi-grovel, CFFI-GROVEL:GROVEL-ERROR : External process exited with code 1. Command was: "cc" "-m32" "-I/opt/local/include" "-I/home/testgrid/cl-test-grid/work-dir/agent/quicklisp/dists/quicklisp/software/cffi_0.13.0/" "-o" "/home/testgrid/cl-test-grid/work-dir/agent/test-runs/20140830012552-clisp-2.49-unix-x86/fasl/ql/dists/quicklisp/software/cl-png-0.6/grovel" "/home/testgrid/cl-test-grid/work-dir/agent/test-runs/20140830012552-clisp-2.49-unix-x86/fasl/ql/dists/quicklisp/software/cl-png-0.6/grovel.c" Output was: <see above>
(LOAD png FAIL) ffi-grovel, CFFI-GROVEL:GROVEL-ERROR : External process exited with code 1. Command was: "cc" "-m32" "-I/opt/local/include" "-I/home/testgrid/cl-test-grid/work-dir/agent/quicklisp/dists/quicklisp/software/cffi_0.13.0/" "-o" "/home/testgrid/cl-test-grid/work-dir/agent/test-runs/20140830012552-clisp-2.49-unix-x86/fasl/ql/dists/quicklisp/software/cl-png-0.6/grovel" "/home/testgrid/cl-test-grid/work-dir/agent/test-runs/20140830012552-clisp-2.49-unix-x86/fasl/ql/dists/quicklisp/software/cl-png-0.6/grovel.c" Output was: <see above>
cmu-snapshot-2013-04__20d_unicode_-linux-x86
(LOAD png-test FAIL) ffi-grovel, CFFI-GROVEL:GROVEL-ERROR : Error in function CFFI-GROVEL:GROVEL-ERROR: External process exited with code 1. Command was: "cc" "-m32" "-I/opt/local/include" "-I/home/testgrid/cl-test-grid/work-dir/agent/quicklisp/dists/quicklisp/software/cffi_0.13.0/" "-o" "/home/testgrid/cl-test-grid/work-dir/agent/test-runs/20140916161726-cmu-snapshot-2013-04__20d_unicode_-linux-x86/fasl/ql/dists/quicklisp/software/cl-png-0.6/grovel" "/home/testgrid/cl-test-grid/work-dir/agent/test-runs/20140916161726-cmu-snapshot-2013-04__20d_unicode_-linux-x86/fasl/ql/dists/quicklisp/software/cl-png-0.6/grovel.c" Output was: /home/testgrid/cl-test-grid/work-dir/agent/test-runs/20140916161726-cmu-snapshot-2013-04__20d_unicode_-linux-x86/fasl/ql/dists/quicklisp/software/cl-png-0.6/grovel.c:6:17: fatal error: png.h: No such file or directory compilation terminated.
(LOAD png FAIL) ffi-grovel, CFFI-GROVEL:GROVEL-ERROR : Error in function CFFI-GROVEL:GROVEL-ERROR: External process exited with code 1. Command was: "cc" "-m32" "-I/opt/local/include" "-I/home/testgrid/cl-test-grid/work-dir/agent/quicklisp/dists/quicklisp/software/cffi_0.13.0/" "-o" "/home/testgrid/cl-test-grid/work-dir/agent/test-runs/20140916161726-cmu-snapshot-2013-04__20d_unicode_-linux-x86/fasl/ql/dists/quicklisp/software/cl-png-0.6/grovel" "/home/testgrid/cl-test-grid/work-dir/agent/test-runs/20140916161726-cmu-snapshot-2013-04__20d_unicode_-linux-x86/fasl/ql/dists/quicklisp/software/cl-png-0.6/grovel.c" Output was: /home/testgrid/cl-test-grid/work-dir/agent/test-runs/20140916161726-cmu-snapshot-2013-04__20d_unicode_-linux-x86/fasl/ql/dists/quicklisp/software/cl-png-0.6/grovel.c:6:17: fatal error: png.h: No such file or directory compilation terminated.
(LOAD png-test FAIL) ffi-grovel, CFFI-GROVEL:GROVEL-ERROR : Error in function CFFI-GROVEL:GROVEL-ERROR: External process exited with code 1. Command was: "cc" "-m32" "-I/opt/local/include" "-I/home/testgrid/cl-test-grid/work-dir/agent/quicklisp/dists/quicklisp/software/cffi_0.13.0/" "-o" "/home/testgrid/cl-test-grid/work-dir/agent/test-runs/20140829182011-cmu-snapshot-2013-04__20d_unicode_-linux-x86/fasl/ql/dists/quicklisp/software/cl-png-0.6/grovel" "/home/testgrid/cl-test-grid/work-dir/agent/test-runs/20140829182011-cmu-snapshot-2013-04__20d_unicode_-linux-x86/fasl/ql/dists/quicklisp/software/cl-png-0.6/grovel.c" Output was: /home/testgrid/cl-test-grid/work-dir/agent/test-runs/20140829182011-cmu-snapshot-2013-04__20d_unicode_-linux-x86/fasl/ql/dists/quicklisp/software/cl-png-0.6/grovel.c:6:17: fatal error: png.h: No such file or directory compilation terminated.
(LOAD png FAIL) ffi-grovel, CFFI-GROVEL:GROVEL-ERROR : Error in function CFFI-GROVEL:GROVEL-ERROR: External process exited with code 1. Command was: "cc" "-m32" "-I/opt/local/include" "-I/home/testgrid/cl-test-grid/work-dir/agent/quicklisp/dists/quicklisp/software/cffi_0.13.0/" "-o" "/home/testgrid/cl-test-grid/work-dir/agent/test-runs/20140829182011-cmu-snapshot-2013-04__20d_unicode_-linux-x86/fasl/ql/dists/quicklisp/software/cl-png-0.6/grovel" "/home/testgrid/cl-test-grid/work-dir/agent/test-runs/20140829182011-cmu-snapshot-2013-04__20d_unicode_-linux-x86/fasl/ql/dists/quicklisp/software/cl-png-0.6/grovel.c" Output was: /home/testgrid/cl-test-grid/work-dir/agent/test-runs/20140829182011-cmu-snapshot-2013-04__20d_unicode_-linux-x86/fasl/ql/dists/quicklisp/software/cl-png-0.6/grovel.c:6:17: fatal error: png.h: No such file or directory compilation terminated.
cmu-snapshot-2014-01__20e_unicode_-linux-x86
(LOAD png-test FAIL) ffi-grovel, CFFI-GROVEL:GROVEL-ERROR : Error in function CFFI-GROVEL:GROVEL-ERROR: External process exited with code 1. Command was: "cc" "-m32" "-I/opt/local/include" "-I/home/testgrid/cl-test-grid/work-dir/agent/quicklisp/dists/quicklisp/software/cffi_0.13.0/" "-o" "/home/testgrid/cl-test-grid/work-dir/agent/test-runs/20140916185335-cmu-snapshot-2014-01__20e_unicode_-linux-x86/fasl/ql/dists/quicklisp/software/cl-png-0.6/grovel" "/home/testgrid/cl-test-grid/work-dir/agent/test-runs/20140916185335-cmu-snapshot-2014-01__20e_unicode_-linux-x86/fasl/ql/dists/quicklisp/software/cl-png-0.6/grovel.c" Output was: /home/testgrid/cl-test-grid/work-dir/agent/test-runs/20140916185335-cmu-snapshot-2014-01__20e_unicode_-linux-x86/fasl/ql/dists/quicklisp/software/cl-png-0.6/grovel.c:6:17: fatal error: png.h: No such file or directory compilation terminated.
(LOAD png FAIL) ffi-grovel, CFFI-GROVEL:GROVEL-ERROR : Error in function CFFI-GROVEL:GROVEL-ERROR: External process exited with code 1. Command was: "cc" "-m32" "-I/opt/local/include" "-I/home/testgrid/cl-test-grid/work-dir/agent/quicklisp/dists/quicklisp/software/cffi_0.13.0/" "-o" "/home/testgrid/cl-test-grid/work-dir/agent/test-runs/20140916185335-cmu-snapshot-2014-01__20e_unicode_-linux-x86/fasl/ql/dists/quicklisp/software/cl-png-0.6/grovel" "/home/testgrid/cl-test-grid/work-dir/agent/test-runs/20140916185335-cmu-snapshot-2014-01__20e_unicode_-linux-x86/fasl/ql/dists/quicklisp/software/cl-png-0.6/grovel.c" Output was: /home/testgrid/cl-test-grid/work-dir/agent/test-runs/20140916185335-cmu-snapshot-2014-01__20e_unicode_-linux-x86/fasl/ql/dists/quicklisp/software/cl-png-0.6/grovel.c:6:17: fatal error: png.h: No such file or directory compilation terminated.
(LOAD png-test FAIL) ffi-grovel, CFFI-GROVEL:GROVEL-ERROR : Error in function CFFI-GROVEL:GROVEL-ERROR: External process exited with code 1. Command was: "cc" "-m32" "-I/opt/local/include" "-I/home/testgrid/cl-test-grid/work-dir/agent/quicklisp/dists/quicklisp/software/cffi_0.13.0/" "-o" "/home/testgrid/cl-test-grid/work-dir/agent/test-runs/20140829204656-cmu-snapshot-2014-01__20e_unicode_-linux-x86/fasl/ql/dists/quicklisp/software/cl-png-0.6/grovel" "/home/testgrid/cl-test-grid/work-dir/agent/test-runs/20140829204656-cmu-snapshot-2014-01__20e_unicode_-linux-x86/fasl/ql/dists/quicklisp/software/cl-png-0.6/grovel.c" Output was: /home/testgrid/cl-test-grid/work-dir/agent/test-runs/20140829204656-cmu-snapshot-2014-01__20e_unicode_-linux-x86/fasl/ql/dists/quicklisp/software/cl-png-0.6/grovel.c:6:17: fatal error: png.h: No such file or directory compilation terminated.
(LOAD png FAIL) ffi-grovel, CFFI-GROVEL:GROVEL-ERROR : Error in function CFFI-GROVEL:GROVEL-ERROR: External process exited with code 1. Command was: "cc" "-m32" "-I/opt/local/include" "-I/home/testgrid/cl-test-grid/work-dir/agent/quicklisp/dists/quicklisp/software/cffi_0.13.0/" "-o" "/home/testgrid/cl-test-grid/work-dir/agent/test-runs/20140829204656-cmu-snapshot-2014-01__20e_unicode_-linux-x86/fasl/ql/dists/quicklisp/software/cl-png-0.6/grovel" "/home/testgrid/cl-test-grid/work-dir/agent/test-runs/20140829204656-cmu-snapshot-2014-01__20e_unicode_-linux-x86/fasl/ql/dists/quicklisp/software/cl-png-0.6/grovel.c" Output was: /home/testgrid/cl-test-grid/work-dir/agent/test-runs/20140829204656-cmu-snapshot-2014-01__20e_unicode_-linux-x86/fasl/ql/dists/quicklisp/software/cl-png-0.6/grovel.c:6:17: fatal error: png.h: No such file or directory compilation terminated.
cmu-snapshot-2014-05-dirty__20e_unicode_-linux-x86
(LOAD png-test FAIL) ffi-grovel, CFFI-GROVEL:GROVEL-ERROR : Error in function CFFI-GROVEL:GROVEL-ERROR: External process exited with code 1. Command was: "cc" "-m32" "-I/opt/local/include" "-I/home/testgrid/cl-test-grid/work-dir/agent/quicklisp/dists/quicklisp/software/cffi_0.13.0/" "-o" "/home/testgrid/cl-test-grid/work-dir/agent/test-runs/20140916212656-cmu-snapshot-2014-05-dirty__20e_unicode_-linux-x86/fasl/ql/dists/quicklisp/software/cl-png-0.6/grovel" "/home/testgrid/cl-test-grid/work-dir/agent/test-runs/20140916212656-cmu-snapshot-2014-05-dirty__20e_unicode_-linux-x86/fasl/ql/dists/quicklisp/software/cl-png-0.6/grovel.c" Output was: /home/testgrid/cl-test-grid/work-dir/agent/test-runs/20140916212656-cmu-snapshot-2014-05-dirty__20e_unicode_-linux-x86/fasl/ql/dists/quicklisp/software/cl-png-0.6/grovel.c:6:17: fatal error: png.h: No such file or directory compilation terminated.
(LOAD png FAIL) ffi-grovel, CFFI-GROVEL:GROVEL-ERROR : Error in function CFFI-GROVEL:GROVEL-ERROR: External process exited with code 1. Command was: "cc" "-m32" "-I/opt/local/include" "-I/home/testgrid/cl-test-grid/work-dir/agent/quicklisp/dists/quicklisp/software/cffi_0.13.0/" "-o" "/home/testgrid/cl-test-grid/work-dir/agent/test-runs/20140916212656-cmu-snapshot-2014-05-dirty__20e_unicode_-linux-x86/fasl/ql/dists/quicklisp/software/cl-png-0.6/grovel" "/home/testgrid/cl-test-grid/work-dir/agent/test-runs/20140916212656-cmu-snapshot-2014-05-dirty__20e_unicode_-linux-x86/fasl/ql/dists/quicklisp/software/cl-png-0.6/grovel.c" Output was: /home/testgrid/cl-test-grid/work-dir/agent/test-runs/20140916212656-cmu-snapshot-2014-05-dirty__20e_unicode_-linux-x86/fasl/ql/dists/quicklisp/software/cl-png-0.6/grovel.c:6:17: fatal error: png.h: No such file or directory compilation terminated.
(LOAD png-test FAIL) ffi-grovel, CFFI-GROVEL:GROVEL-ERROR : Error in function CFFI-GROVEL:GROVEL-ERROR: External process exited with code 1. Command was: "cc" "-m32" "-I/opt/local/include" "-I/home/testgrid/cl-test-grid/work-dir/agent/quicklisp/dists/quicklisp/software/cffi_0.13.0/" "-o" "/home/testgrid/cl-test-grid/work-dir/agent/test-runs/20140829230732-cmu-snapshot-2014-05-dirty__20e_unicode_-linux-x86/fasl/ql/dists/quicklisp/software/cl-png-0.6/grovel" "/home/testgrid/cl-test-grid/work-dir/agent/test-runs/20140829230732-cmu-snapshot-2014-05-dirty__20e_unicode_-linux-x86/fasl/ql/dists/quicklisp/software/cl-png-0.6/grovel.c" Output was: /home/testgrid/cl-test-grid/work-dir/agent/test-runs/20140829230732-cmu-snapshot-2014-05-dirty__20e_unicode_-linux-x86/fasl/ql/dists/quicklisp/software/cl-png-0.6/grovel.c:6:17: fatal error: png.h: No such file or directory compilation terminated.
(LOAD png FAIL) ffi-grovel, CFFI-GROVEL:GROVEL-ERROR : Error in function CFFI-GROVEL:GROVEL-ERROR: External process exited with code 1. Command was: "cc" "-m32" "-I/opt/local/include" "-I/home/testgrid/cl-test-grid/work-dir/agent/quicklisp/dists/quicklisp/software/cffi_0.13.0/" "-o" "/home/testgrid/cl-test-grid/work-dir/agent/test-runs/20140829230732-cmu-snapshot-2014-05-dirty__20e_unicode_-linux-x86/fasl/ql/dists/quicklisp/software/cl-png-0.6/grovel" "/home/testgrid/cl-test-grid/work-dir/agent/test-runs/20140829230732-cmu-snapshot-2014-05-dirty__20e_unicode_-linux-x86/fasl/ql/dists/quicklisp/software/cl-png-0.6/grovel.c" Output was: /home/testgrid/cl-test-grid/work-dir/agent/test-runs/20140829230732-cmu-snapshot-2014-05-dirty__20e_unicode_-linux-x86/fasl/ql/dists/quicklisp/software/cl-png-0.6/grovel.c:6:17: fatal error: png.h: No such file or directory compilation terminated.
ecl-13.5.1-76a84246-linux-x64-bytecode
(LOAD png-test FAIL) ASDF/FIND-SYSTEM:LOAD-SYSTEM-DEFINITION-ERROR : Error while trying to load definition for system png from pathname /home/hijarian/systems/cl-test-grid/work-dir/agent/quicklisp/dists/quicklisp/software/cl-png-0.6/png.asd: The variable C::*CC-FLAGS* is unbound.
(LOAD png FAIL) ASDF/FIND-SYSTEM:LOAD-SYSTEM-DEFINITION-ERROR : Error while trying to load definition for system png from pathname /home/hijarian/systems/cl-test-grid/work-dir/agent/quicklisp/dists/quicklisp/software/cl-png-0.6/png.asd: The variable C::*CC-FLAGS* is unbound.
(LOAD png-test FAIL) ASDF/FIND-SYSTEM:LOAD-SYSTEM-DEFINITION-ERROR : Error while trying to load definition for system png from pathname /home/hijarian/systems/cl-test-grid/work-dir/agent/quicklisp/dists/quicklisp/software/cl-png-0.6/png.asd: The variable C::*CC-FLAGS* is unbound.
(LOAD png FAIL) ASDF/FIND-SYSTEM:LOAD-SYSTEM-DEFINITION-ERROR : Error while trying to load definition for system png from pathname /home/hijarian/systems/cl-test-grid/work-dir/agent/quicklisp/dists/quicklisp/software/cl-png-0.6/png.asd: The variable C::*CC-FLAGS* is unbound.
ecl-13.5.1-76a84246-linux-x64-lisp-to-c
(LOAD png-test FAIL) ffi-grovel, CFFI-GROVEL:GROVEL-ERROR : External process exited with code 1. Command was: "cc" "-m64" " -D_GNU_SOURCE -D_FILE_OFFSET_BITS=64 -g -O2 -fPIC -D_THREAD_SAFE -Dlinux" "-I/opt/local/include" "-I/home/hijarian/systems/cl-test-grid/work-dir/agent/quicklisp/dists/quicklisp/software/cffi_0.13.0/" "-o" "/home/hijarian/systems/cl-test-grid/work-dir/agent/test-runs/20140915180851-ecl-13.5.1-76a84246-linux-x64-lisp-to-c/fasl/ql/dists/quicklisp/software/cl-png-0.6/grovel" "/home/hijarian/systems/cl-test-grid/work-dir/agent/test-runs/20140915180851-ecl-13.5.1-76a84246-linux-x64-lisp-to-c/fasl/ql/dists/quicklisp/software/cl-png-0.6/grovel.c" Output was: <see above>
(LOAD png FAIL) ffi-grovel, CFFI-GROVEL:GROVEL-ERROR : External process exited with code 1. Command was: "cc" "-m64" " -D_GNU_SOURCE -D_FILE_OFFSET_BITS=64 -g -O2 -fPIC -D_THREAD_SAFE -Dlinux" "-I/opt/local/include" "-I/home/hijarian/systems/cl-test-grid/work-dir/agent/quicklisp/dists/quicklisp/software/cffi_0.13.0/" "-o" "/home/hijarian/systems/cl-test-grid/work-dir/agent/test-runs/20140915180851-ecl-13.5.1-76a84246-linux-x64-lisp-to-c/fasl/ql/dists/quicklisp/software/cl-png-0.6/grovel" "/home/hijarian/systems/cl-test-grid/work-dir/agent/test-runs/20140915180851-ecl-13.5.1-76a84246-linux-x64-lisp-to-c/fasl/ql/dists/quicklisp/software/cl-png-0.6/grovel.c" Output was: <see above>
(LOAD png-test FAIL) ffi-grovel, CFFI-GROVEL:GROVEL-ERROR : External process exited with code 1. Command was: "cc" "-m64" " -D_GNU_SOURCE -D_FILE_OFFSET_BITS=64 -g -O2 -fPIC -D_THREAD_SAFE -Dlinux" "-I/opt/local/include" "-I/home/hijarian/systems/cl-test-grid/work-dir/agent/quicklisp/dists/quicklisp/software/cffi_0.13.0/" "-o" "/home/hijarian/systems/cl-test-grid/work-dir/agent/test-runs/20140908163429-ecl-13.5.1-76a84246-linux-x64-lisp-to-c/fasl/ql/dists/quicklisp/software/cl-png-0.6/grovel" "/home/hijarian/systems/cl-test-grid/work-dir/agent/test-runs/20140908163429-ecl-13.5.1-76a84246-linux-x64-lisp-to-c/fasl/ql/dists/quicklisp/software/cl-png-0.6/grovel.c" Output was: <see above>
(LOAD png FAIL) ffi-grovel, CFFI-GROVEL:GROVEL-ERROR : External process exited with code 1. Command was: "cc" "-m64" " -D_GNU_SOURCE -D_FILE_OFFSET_BITS=64 -g -O2 -fPIC -D_THREAD_SAFE -Dlinux" "-I/opt/local/include" "-I/home/hijarian/systems/cl-test-grid/work-dir/agent/quicklisp/dists/quicklisp/software/cffi_0.13.0/" "-o" "/home/hijarian/systems/cl-test-grid/work-dir/agent/test-runs/20140908163429-ecl-13.5.1-76a84246-linux-x64-lisp-to-c/fasl/ql/dists/quicklisp/software/cl-png-0.6/grovel" "/home/hijarian/systems/cl-test-grid/work-dir/agent/test-runs/20140908163429-ecl-13.5.1-76a84246-linux-x64-lisp-to-c/fasl/ql/dists/quicklisp/software/cl-png-0.6/grovel.c" Output was: <see above>
ecl-13.5.1-efec0ee0-linux-x64-bytecode
(LOAD png-test FAIL) ASDF/FIND-SYSTEM:LOAD-SYSTEM-DEFINITION-ERROR : Error while trying to load definition for system png from pathname /home/hijarian/projects/others/cl-test-grid/work-dir/agent/quicklisp/dists/quicklisp/software/cl-png-0.6/png.asd: The variable C::*CC-FLAGS* is unbound.
(LOAD png FAIL) ASDF/FIND-SYSTEM:LOAD-SYSTEM-DEFINITION-ERROR : Error while trying to load definition for system png from pathname /home/hijarian/projects/others/cl-test-grid/work-dir/agent/quicklisp/dists/quicklisp/software/cl-png-0.6/png.asd: The variable C::*CC-FLAGS* is unbound.
ecl-13.5.1-efec0ee0-linux-x64-lisp-to-c
ecl-13.5.1-unknown-linux-i686-bytecode
(LOAD png-test FAIL) ASDF/FIND-SYSTEM:LOAD-SYSTEM-DEFINITION-ERROR : Error while trying to load definition for system png from pathname /home/testgrid/cl-test-grid/work-dir/agent/quicklisp/dists/quicklisp/software/cl-png-0.6/png.asd: The variable C::*CC-FLAGS* is unbound.
(LOAD png FAIL) ASDF/FIND-SYSTEM:LOAD-SYSTEM-DEFINITION-ERROR : Error while trying to load definition for system png from pathname /home/testgrid/cl-test-grid/work-dir/agent/quicklisp/dists/quicklisp/software/cl-png-0.6/png.asd: The variable C::*CC-FLAGS* is unbound.
(LOAD png-test FAIL) ASDF/FIND-SYSTEM:LOAD-SYSTEM-DEFINITION-ERROR : Error while trying to load definition for system png from pathname /home/testgrid/cl-test-grid/work-dir/agent/quicklisp/dists/quicklisp/software/cl-png-0.6/png.asd: The variable C::*CC-FLAGS* is unbound.
(LOAD png FAIL) ASDF/FIND-SYSTEM:LOAD-SYSTEM-DEFINITION-ERROR : Error while trying to load definition for system png from pathname /home/testgrid/cl-test-grid/work-dir/agent/quicklisp/dists/quicklisp/software/cl-png-0.6/png.asd: The variable C::*CC-FLAGS* is unbound.
ecl-13.5.1-unknown-linux-i686-lisp-to-c
(LOAD png-test FAIL) ffi-grovel, CFFI-GROVEL:GROVEL-ERROR : External process exited with code 1. Command was: "cc" "-m32" " -D_GNU_SOURCE -D_FILE_OFFSET_BITS=64 -g -O2 -fPIC -D_GNU_SOURCE -D_FILE_OFFSET_BITS=64 -g -O2 -fPIC -D_THREAD_SAFE -Dlinux" "-I/opt/local/include" "-I/home/testgrid/cl-test-grid/work-dir/agent/quicklisp/dists/quicklisp/software/cffi_0.13.0/" "-o" "/home/testgrid/cl-test-grid/work-dir/agent/test-runs/20140830065935-ecl-13.5.1-unknown-linux-i686-lisp-to-c/fasl/ql/dists/quicklisp/software/cl-png-0.6/grovel" "/home/testgrid/cl-test-grid/work-dir/agent/test-runs/20140830065935-ecl-13.5.1-unknown-linux-i686-lisp-to-c/fasl/ql/dists/quicklisp/software/cl-png-0.6/grovel.c" Output was: <see above>
(LOAD png FAIL) ffi-grovel, CFFI-GROVEL:GROVEL-ERROR : External process exited with code 1. Command was: "cc" "-m32" " -D_GNU_SOURCE -D_FILE_OFFSET_BITS=64 -g -O2 -fPIC -D_GNU_SOURCE -D_FILE_OFFSET_BITS=64 -g -O2 -fPIC -D_THREAD_SAFE -Dlinux" "-I/opt/local/include" "-I/home/testgrid/cl-test-grid/work-dir/agent/quicklisp/dists/quicklisp/software/cffi_0.13.0/" "-o" "/home/testgrid/cl-test-grid/work-dir/agent/test-runs/20140830065935-ecl-13.5.1-unknown-linux-i686-lisp-to-c/fasl/ql/dists/quicklisp/software/cl-png-0.6/grovel" "/home/testgrid/cl-test-grid/work-dir/agent/test-runs/20140830065935-ecl-13.5.1-unknown-linux-i686-lisp-to-c/fasl/ql/dists/quicklisp/software/cl-png-0.6/grovel.c" Output was: <see above>
sbcl-1.1.11-linux-x86
(LOAD png-test FAIL) ffi-grovel, CFFI-GROVEL:GROVEL-ERROR : External process exited with code 1. Command was: "cc" "-m32" "-I/opt/local/include" "-I/home/testgrid/cl-test-grid/work-dir/agent/quicklisp/dists/quicklisp/software/cffi_0.13.0/" "-o" "/home/testgrid/cl-test-grid/work-dir/agent/test-runs/20140916033343-sbcl-1.1.11-linux-x86/fasl/ql/dists/quicklisp/software/cl-png-0.6/grovel" "/home/testgrid/cl-test-grid/work-dir/agent/test-runs/20140916033343-sbcl-1.1.11-linux-x86/fasl/ql/dists/quicklisp/software/cl-png-0.6/grovel.c" Output was: /home/testgrid/cl-test-grid/work-dir/agent/test-runs/20140916033343-sbcl-1.1.11-linux-x86/fasl/ql/dists/quicklisp/software/cl-png-0.6/grovel.c:6:17: fatal error: png.h: No such file or directory compilation terminated.
(LOAD png FAIL) ffi-grovel, CFFI-GROVEL:GROVEL-ERROR : External process exited with code 1. Command was: "cc" "-m32" "-I/opt/local/include" "-I/home/testgrid/cl-test-grid/work-dir/agent/quicklisp/dists/quicklisp/software/cffi_0.13.0/" "-o" "/home/testgrid/cl-test-grid/work-dir/agent/test-runs/20140916033343-sbcl-1.1.11-linux-x86/fasl/ql/dists/quicklisp/software/cl-png-0.6/grovel" "/home/testgrid/cl-test-grid/work-dir/agent/test-runs/20140916033343-sbcl-1.1.11-linux-x86/fasl/ql/dists/quicklisp/software/cl-png-0.6/grovel.c" Output was: /home/testgrid/cl-test-grid/work-dir/agent/test-runs/20140916033343-sbcl-1.1.11-linux-x86/fasl/ql/dists/quicklisp/software/cl-png-0.6/grovel.c:6:17: fatal error: png.h: No such file or directory compilation terminated.
(LOAD png-test FAIL) ffi-grovel, CFFI-GROVEL:GROVEL-ERROR : External process exited with code 1. Command was: "cc" "-m32" "-I/opt/local/include" "-I/home/testgrid/cl-test-grid/work-dir/agent/quicklisp/dists/quicklisp/software/cffi_0.13.0/" "-o" "/home/testgrid/cl-test-grid/work-dir/agent/test-runs/20140828045115-sbcl-1.1.11-linux-x86/fasl/ql/dists/quicklisp/software/cl-png-0.6/grovel" "/home/testgrid/cl-test-grid/work-dir/agent/test-runs/20140828045115-sbcl-1.1.11-linux-x86/fasl/ql/dists/quicklisp/software/cl-png-0.6/grovel.c" Output was: /home/testgrid/cl-test-grid/work-dir/agent/test-runs/20140828045115-sbcl-1.1.11-linux-x86/fasl/ql/dists/quicklisp/software/cl-png-0.6/grovel.c:6:17: fatal error: png.h: No such file or directory compilation terminated.
(LOAD png FAIL) ffi-grovel, CFFI-GROVEL:GROVEL-ERROR : External process exited with code 1. Command was: "cc" "-m32" "-I/opt/local/include" "-I/home/testgrid/cl-test-grid/work-dir/agent/quicklisp/dists/quicklisp/software/cffi_0.13.0/" "-o" "/home/testgrid/cl-test-grid/work-dir/agent/test-runs/20140828045115-sbcl-1.1.11-linux-x86/fasl/ql/dists/quicklisp/software/cl-png-0.6/grovel" "/home/testgrid/cl-test-grid/work-dir/agent/test-runs/20140828045115-sbcl-1.1.11-linux-x86/fasl/ql/dists/quicklisp/software/cl-png-0.6/grovel.c" Output was: /home/testgrid/cl-test-grid/work-dir/agent/test-runs/20140828045115-sbcl-1.1.11-linux-x86/fasl/ql/dists/quicklisp/software/cl-png-0.6/grovel.c:6:17: fatal error: png.h: No such file or directory compilation terminated.
sbcl-1.1.16-linux-x86
(LOAD png-test FAIL) ffi-grovel, CFFI-GROVEL:GROVEL-ERROR : External process exited with code 1. Command was: "cc" "-m32" "-I/opt/local/include" "-I/home/testgrid/cl-test-grid/work-dir/agent/quicklisp/dists/quicklisp/software/cffi_0.13.0/" "-o" "/home/testgrid/cl-test-grid/work-dir/agent/test-runs/20140915202623-sbcl-1.1.16-linux-x86/fasl/ql/dists/quicklisp/software/cl-png-0.6/grovel" "/home/testgrid/cl-test-grid/work-dir/agent/test-runs/20140915202623-sbcl-1.1.16-linux-x86/fasl/ql/dists/quicklisp/software/cl-png-0.6/grovel.c" Output was: /home/testgrid/cl-test-grid/work-dir/agent/test-runs/20140915202623-sbcl-1.1.16-linux-x86/fasl/ql/dists/quicklisp/software/cl-png-0.6/grovel.c:6:17: fatal error: png.h: No such file or directory compilation terminated.
(LOAD png FAIL) ffi-grovel, CFFI-GROVEL:GROVEL-ERROR : External process exited with code 1. Command was: "cc" "-m32" "-I/opt/local/include" "-I/home/testgrid/cl-test-grid/work-dir/agent/quicklisp/dists/quicklisp/software/cffi_0.13.0/" "-o" "/home/testgrid/cl-test-grid/work-dir/agent/test-runs/20140915202623-sbcl-1.1.16-linux-x86/fasl/ql/dists/quicklisp/software/cl-png-0.6/grovel" "/home/testgrid/cl-test-grid/work-dir/agent/test-runs/20140915202623-sbcl-1.1.16-linux-x86/fasl/ql/dists/quicklisp/software/cl-png-0.6/grovel.c" Output was: /home/testgrid/cl-test-grid/work-dir/agent/test-runs/20140915202623-sbcl-1.1.16-linux-x86/fasl/ql/dists/quicklisp/software/cl-png-0.6/grovel.c:6:17: fatal error: png.h: No such file or directory compilation terminated.
(LOAD png-test FAIL) ffi-grovel, CFFI-GROVEL:GROVEL-ERROR : External process exited with code 1. Command was: "cc" "-m32" "-I/opt/local/include" "-I/home/testgrid/cl-test-grid/work-dir/agent/quicklisp/dists/quicklisp/software/cffi_0.13.0/" "-o" "/home/testgrid/cl-test-grid/work-dir/agent/test-runs/20140827205823-sbcl-1.1.16-linux-x86/fasl/ql/dists/quicklisp/software/cl-png-0.6/grovel" "/home/testgrid/cl-test-grid/work-dir/agent/test-runs/20140827205823-sbcl-1.1.16-linux-x86/fasl/ql/dists/quicklisp/software/cl-png-0.6/grovel.c" Output was: /home/testgrid/cl-test-grid/work-dir/agent/test-runs/20140827205823-sbcl-1.1.16-linux-x86/fasl/ql/dists/quicklisp/software/cl-png-0.6/grovel.c:6:17: fatal error: png.h: No such file or directory compilation terminated.
(LOAD png FAIL) ffi-grovel, CFFI-GROVEL:GROVEL-ERROR : External process exited with code 1. Command was: "cc" "-m32" "-I/opt/local/include" "-I/home/testgrid/cl-test-grid/work-dir/agent/quicklisp/dists/quicklisp/software/cffi_0.13.0/" "-o" "/home/testgrid/cl-test-grid/work-dir/agent/test-runs/20140827205823-sbcl-1.1.16-linux-x86/fasl/ql/dists/quicklisp/software/cl-png-0.6/grovel" "/home/testgrid/cl-test-grid/work-dir/agent/test-runs/20140827205823-sbcl-1.1.16-linux-x86/fasl/ql/dists/quicklisp/software/cl-png-0.6/grovel.c" Output was: /home/testgrid/cl-test-grid/work-dir/agent/test-runs/20140827205823-sbcl-1.1.16-linux-x86/fasl/ql/dists/quicklisp/software/cl-png-0.6/grovel.c:6:17: fatal error: png.h: No such file or directory compilation terminated.
sbcl-1.2.0.debian-linux-x64
sbcl-1.2.3-linux-x64
(LOAD png-test FAIL) ffi-grovel, CFFI-GROVEL:GROVEL-ERROR : External process exited with code 1. Command was: "cc" "-m64" "-I/opt/local/include" "-I/home/hijarian/systems/cl-test-grid/work-dir/agent/quicklisp/dists/quicklisp/software/cffi_0.13.0/" "-o" "/home/hijarian/systems/cl-test-grid/work-dir/agent/test-runs/20140915163602-sbcl-1.2.3-linux-x64/fasl/ql/dists/quicklisp/software/cl-png-0.6/grovel" "/home/hijarian/systems/cl-test-grid/work-dir/agent/test-runs/20140915163602-sbcl-1.2.3-linux-x64/fasl/ql/dists/quicklisp/software/cl-png-0.6/grovel.c" Output was: /home/hijarian/systems/cl-test-grid/work-dir/agent/test-runs/20140915163602-sbcl-1.2.3-linux-x64/fasl/ql/dists/quicklisp/software/cl-png-0.6/grovel.c:6:17: fatal error: png.h: Нет такого файла или каталога compilation terminated.
(LOAD png FAIL) ffi-grovel, CFFI-GROVEL:GROVEL-ERROR : External process exited with code 1. Command was: "cc" "-m64" "-I/opt/local/include" "-I/home/hijarian/systems/cl-test-grid/work-dir/agent/quicklisp/dists/quicklisp/software/cffi_0.13.0/" "-o" "/home/hijarian/systems/cl-test-grid/work-dir/agent/test-runs/20140915163602-sbcl-1.2.3-linux-x64/fasl/ql/dists/quicklisp/software/cl-png-0.6/grovel" "/home/hijarian/systems/cl-test-grid/work-dir/agent/test-runs/20140915163602-sbcl-1.2.3-linux-x64/fasl/ql/dists/quicklisp/software/cl-png-0.6/grovel.c" Output was: /home/hijarian/systems/cl-test-grid/work-dir/agent/test-runs/20140915163602-sbcl-1.2.3-linux-x64/fasl/ql/dists/quicklisp/software/cl-png-0.6/grovel.c:6:17: fatal error: png.h: Нет такого файла или каталога compilation terminated.
(LOAD png-test FAIL) ffi-grovel, CFFI-GROVEL:GROVEL-ERROR : External process exited with code 1. Command was: "cc" "-m64" "-I/opt/local/include" "-I/home/hijarian/systems/cl-test-grid/work-dir/agent/quicklisp/dists/quicklisp/software/cffi_0.13.0/" "-o" "/home/hijarian/systems/cl-test-grid/work-dir/agent/test-runs/20140908100955-sbcl-1.2.3-linux-x64/fasl/ql/dists/quicklisp/software/cl-png-0.6/grovel" "/home/hijarian/systems/cl-test-grid/work-dir/agent/test-runs/20140908100955-sbcl-1.2.3-linux-x64/fasl/ql/dists/quicklisp/software/cl-png-0.6/grovel.c" Output was: /home/hijarian/systems/cl-test-grid/work-dir/agent/test-runs/20140908100955-sbcl-1.2.3-linux-x64/fasl/ql/dists/quicklisp/software/cl-png-0.6/grovel.c:6:17: fatal error: png.h: Нет такого файла или каталога compilation terminated.
(LOAD png FAIL) ffi-grovel, CFFI-GROVEL:GROVEL-ERROR : External process exited with code 1. Command was: "cc" "-m64" "-I/opt/local/include" "-I/home/hijarian/systems/cl-test-grid/work-dir/agent/quicklisp/dists/quicklisp/software/cffi_0.13.0/" "-o" "/home/hijarian/systems/cl-test-grid/work-dir/agent/test-runs/20140908100955-sbcl-1.2.3-linux-x64/fasl/ql/dists/quicklisp/software/cl-png-0.6/grovel" "/home/hijarian/systems/cl-test-grid/work-dir/agent/test-runs/20140908100955-sbcl-1.2.3-linux-x64/fasl/ql/dists/quicklisp/software/cl-png-0.6/grovel.c" Output was: /home/hijarian/systems/cl-test-grid/work-dir/agent/test-runs/20140908100955-sbcl-1.2.3-linux-x64/fasl/ql/dists/quicklisp/software/cl-png-0.6/grovel.c:6:17: fatal error: png.h: Нет такого файла или каталога compilation terminated.

Breakdown by testcases: for every failed testcase the lisp implmentations it fails on

The library does not have a testsuite adapter for CL Test Grid.

To reports overview

Generated at: 2014-09-27 20:10:47 GMT.