cl-libusb results collected by cl-test-grid

Results on the last two Quicklisp distributions

 quicklisp 2014-10-06quicklisp 2014-09-14
abcl-1.2.0-fasl42-linux-x86
(LOAD libusb-ffi FAIL) COMMON-LISP:SIMPLE-ERROR : Parameter G15199:G15198 not defined.
(LOAD cl-libusb FAIL) COMMON-LISP:SIMPLE-ERROR : Parameter G15199:G15198 not defined.
abcl-1.2.1-fasl42-linux-x86
(LOAD libusb-ffi FAIL) COMMON-LISP:SIMPLE-ERROR : Parameter G16234:G16233 not defined.
(LOAD cl-libusb FAIL) COMMON-LISP:SIMPLE-ERROR : Parameter G16234:G16233 not defined.
(LOAD libusb-ffi FAIL) COMMON-LISP:SIMPLE-ERROR : Parameter G15199:G15198 not defined.
(LOAD cl-libusb FAIL) COMMON-LISP:SIMPLE-ERROR : Parameter G15199:G15198 not defined.
abcl-1.2.1-fasl42-macosx-x64
(LOAD libusb-ffi FAIL) ffi, ASDF/FIND-SYSTEM:LOAD-SYSTEM-DEFINITION-ERROR : Error while trying to load definition for system libusb-ffi from pathname /Users/pnathan/cl-test-grid/work-dir/agent/quicklisp/dists/quicklisp/software/cl-libusb-20130312-git/libusb-ffi.asd: Don't know how to COMMON-LISP:REQUIRE JNA.
(LOAD cl-libusb FAIL) ffi, ASDF/FIND-SYSTEM:LOAD-SYSTEM-DEFINITION-ERROR : Error while trying to load definition for system libusb-ffi from pathname /Users/pnathan/cl-test-grid/work-dir/agent/quicklisp/dists/quicklisp/software/cl-libusb-20130312-git/libusb-ffi.asd: Don't know how to COMMON-LISP:REQUIRE JNA.
abcl-1.3.0-fasl42-linux-x86
(LOAD libusb-ffi FAIL) ASDF/FIND-SYSTEM:LOAD-SYSTEM-DEFINITION-ERROR : Error while trying to load definition for system chipz from pathname /home/testgrid/cl-test-grid/work-dir/agent/quicklisp/dists/quicklisp/software/chipz-20130128-git/chipz.asd: don't recognize component type :TXT-FILE
(LOAD cl-libusb FAIL) ASDF/FIND-SYSTEM:LOAD-SYSTEM-DEFINITION-ERROR : Error while trying to load definition for system chipz from pathname /home/testgrid/cl-test-grid/work-dir/agent/quicklisp/dists/quicklisp/software/chipz-20130128-git/chipz.asd: don't recognize component type :TXT-FILE
(LOAD libusb-ffi FAIL) COMMON-LISP:SIMPLE-ERROR : Parameter G15232:G15231 not defined.
(LOAD cl-libusb FAIL) COMMON-LISP:SIMPLE-ERROR : Parameter G15232:G15231 not defined.
abcl-1.3.1-fasl42-linux-x86
(LOAD libusb-ffi FAIL) COMMON-LISP:SIMPLE-ERROR : Parameter G15232:G15231 not defined.
(LOAD cl-libusb FAIL) COMMON-LISP:SIMPLE-ERROR : Parameter G15232:G15231 not defined.
ccl-1.8-r15286m-f95-linux-x86
(LOAD libusb-ffi FAIL) ASDF:LOAD-SYSTEM-DEFINITION-ERROR : Error while trying to load definition for system antik from pathname /home/testgrid/cl-test-grid/work-dir/agent/quicklisp/dists/quicklisp/software/antik-20140211-git/antik.asd: Error while trying to load definition for system static-vectors from pathname /home/testgrid/cl-test-grid/work-dir/agent/quicklisp/dists/quicklisp/software/static-vectors-1.6/static-vectors.asd: You need ASDF >= 2.32 to load this system correctly.
(LOAD cl-libusb FAIL) ASDF:LOAD-SYSTEM-DEFINITION-ERROR : Error while trying to load definition for system antik from pathname /home/testgrid/cl-test-grid/work-dir/agent/quicklisp/dists/quicklisp/software/antik-20140211-git/antik.asd: Error while trying to load definition for system static-vectors from pathname /home/testgrid/cl-test-grid/work-dir/agent/quicklisp/dists/quicklisp/software/static-vectors-1.6/static-vectors.asd: You need ASDF >= 2.32 to load this system correctly.
(LOAD libusb-ffi FAIL) ASDF:LOAD-SYSTEM-DEFINITION-ERROR : Error while trying to load definition for system antik from pathname /home/testgrid/cl-test-grid/work-dir/agent/quicklisp/dists/quicklisp/software/antik-20140211-git/antik.asd: Error while trying to load definition for system static-vectors from pathname /home/testgrid/cl-test-grid/work-dir/agent/quicklisp/dists/quicklisp/software/static-vectors-1.6/static-vectors.asd: You need ASDF >= 2.32 to load this system correctly.
(LOAD cl-libusb FAIL) ASDF:LOAD-SYSTEM-DEFINITION-ERROR : Error while trying to load definition for system antik from pathname /home/testgrid/cl-test-grid/work-dir/agent/quicklisp/dists/quicklisp/software/antik-20140211-git/antik.asd: Error while trying to load definition for system static-vectors from pathname /home/testgrid/cl-test-grid/work-dir/agent/quicklisp/dists/quicklisp/software/static-vectors-1.6/static-vectors.asd: You need ASDF >= 2.32 to load this system correctly.
ccl-1.9-f96-linux-x64
(LOAD libusb-ffi FAIL) ffi-grovel, CFFI-GROVEL:GROVEL-ERROR : External process exited with code 1. Command was: "cc" "-m64" "-I/home/hijarian/systems/cl-test-grid/work-dir/agent/quicklisp/dists/quicklisp/software/cffi_0.14.0/" "-o" "/home/hijarian/systems/cl-test-grid/work-dir/agent/test-runs/20141007093127-ccl-1.9-f96-linux-x64/fasl/ql/dists/quicklisp/software/cl-libusb-20130312-git/libusb-grovel" "/home/hijarian/systems/cl-test-grid/work-dir/agent/test-runs/20141007093127-ccl-1.9-f96-linux-x64/fasl/ql/dists/quicklisp/software/cl-libusb-20130312-git/libusb-grovel.c" Output was: /home/hijarian/systems/cl-test-grid/work-dir/agent/test-runs/20141007093127-ccl-1.9-f96-linux-x64/fasl/ql/dists/quicklisp/software/cl-libusb-20130312-git/libusb-grovel.c:6:17: fatal error: usb.h: Нет такого файла или каталога compilation terminated.
(LOAD cl-libusb FAIL) ffi-grovel, CFFI-GROVEL:GROVEL-ERROR : External process exited with code 1. Command was: "cc" "-m64" "-I/home/hijarian/systems/cl-test-grid/work-dir/agent/quicklisp/dists/quicklisp/software/cffi_0.14.0/" "-o" "/home/hijarian/systems/cl-test-grid/work-dir/agent/test-runs/20141007093127-ccl-1.9-f96-linux-x64/fasl/ql/dists/quicklisp/software/cl-libusb-20130312-git/libusb-grovel" "/home/hijarian/systems/cl-test-grid/work-dir/agent/test-runs/20141007093127-ccl-1.9-f96-linux-x64/fasl/ql/dists/quicklisp/software/cl-libusb-20130312-git/libusb-grovel.c" Output was: /home/hijarian/systems/cl-test-grid/work-dir/agent/test-runs/20141007093127-ccl-1.9-f96-linux-x64/fasl/ql/dists/quicklisp/software/cl-libusb-20130312-git/libusb-grovel.c:6:17: fatal error: usb.h: Нет такого файла или каталога compilation terminated.
(LOAD libusb-ffi FAIL) ffi-grovel, CFFI-GROVEL:GROVEL-ERROR : External process exited with code 1. Command was: "cc" "-m64" "-I/home/hijarian/systems/cl-test-grid/work-dir/agent/quicklisp/dists/quicklisp/software/cffi_0.13.0/" "-o" "/home/hijarian/systems/cl-test-grid/work-dir/agent/test-runs/20140915142853-ccl-1.9-f96-linux-x64/fasl/ql/dists/quicklisp/software/cl-libusb-20130312-git/libusb-grovel" "/home/hijarian/systems/cl-test-grid/work-dir/agent/test-runs/20140915142853-ccl-1.9-f96-linux-x64/fasl/ql/dists/quicklisp/software/cl-libusb-20130312-git/libusb-grovel.c" Output was: /home/hijarian/systems/cl-test-grid/work-dir/agent/test-runs/20140915142853-ccl-1.9-f96-linux-x64/fasl/ql/dists/quicklisp/software/cl-libusb-20130312-git/libusb-grovel.c:6:17: fatal error: usb.h: Нет такого файла или каталога compilation terminated.
(LOAD cl-libusb FAIL) ffi-grovel, CFFI-GROVEL:GROVEL-ERROR : External process exited with code 1. Command was: "cc" "-m64" "-I/home/hijarian/systems/cl-test-grid/work-dir/agent/quicklisp/dists/quicklisp/software/cffi_0.13.0/" "-o" "/home/hijarian/systems/cl-test-grid/work-dir/agent/test-runs/20140915142853-ccl-1.9-f96-linux-x64/fasl/ql/dists/quicklisp/software/cl-libusb-20130312-git/libusb-grovel" "/home/hijarian/systems/cl-test-grid/work-dir/agent/test-runs/20140915142853-ccl-1.9-f96-linux-x64/fasl/ql/dists/quicklisp/software/cl-libusb-20130312-git/libusb-grovel.c" Output was: /home/hijarian/systems/cl-test-grid/work-dir/agent/test-runs/20140915142853-ccl-1.9-f96-linux-x64/fasl/ql/dists/quicklisp/software/cl-libusb-20130312-git/libusb-grovel.c:6:17: fatal error: usb.h: Нет такого файла или каталога compilation terminated.
ccl-1.9-r15756-f96-linux-x86
(LOAD libusb-ffi FAIL) ffi-grovel, CFFI-GROVEL:GROVEL-ERROR : External process exited with code 1. Command was: "cc" "-m32" "-I/home/testgrid/cl-test-grid/work-dir/agent/quicklisp/dists/quicklisp/software/cffi_0.14.0/" "-o" "/home/testgrid/cl-test-grid/work-dir/agent/test-runs/20141007045958-ccl-1.9-r15756-f96-linux-x86/fasl/ql/dists/quicklisp/software/cl-libusb-20130312-git/libusb-grovel" "/home/testgrid/cl-test-grid/work-dir/agent/test-runs/20141007045958-ccl-1.9-r15756-f96-linux-x86/fasl/ql/dists/quicklisp/software/cl-libusb-20130312-git/libusb-grovel.c" Output was: /home/testgrid/cl-test-grid/work-dir/agent/test-runs/20141007045958-ccl-1.9-r15756-f96-linux-x86/fasl/ql/dists/quicklisp/software/cl-libusb-20130312-git/libusb-grovel.c:6:17: fatal error: usb.h: No such file or directory compilation terminated.
(LOAD cl-libusb FAIL) ffi-grovel, CFFI-GROVEL:GROVEL-ERROR : External process exited with code 1. Command was: "cc" "-m32" "-I/home/testgrid/cl-test-grid/work-dir/agent/quicklisp/dists/quicklisp/software/cffi_0.14.0/" "-o" "/home/testgrid/cl-test-grid/work-dir/agent/test-runs/20141007045958-ccl-1.9-r15756-f96-linux-x86/fasl/ql/dists/quicklisp/software/cl-libusb-20130312-git/libusb-grovel" "/home/testgrid/cl-test-grid/work-dir/agent/test-runs/20141007045958-ccl-1.9-r15756-f96-linux-x86/fasl/ql/dists/quicklisp/software/cl-libusb-20130312-git/libusb-grovel.c" Output was: /home/testgrid/cl-test-grid/work-dir/agent/test-runs/20141007045958-ccl-1.9-r15756-f96-linux-x86/fasl/ql/dists/quicklisp/software/cl-libusb-20130312-git/libusb-grovel.c:6:17: fatal error: usb.h: No such file or directory compilation terminated.
(LOAD libusb-ffi FAIL) ffi-grovel, CFFI-GROVEL:GROVEL-ERROR : External process exited with code 1. Command was: "cc" "-m32" "-I/home/testgrid/cl-test-grid/work-dir/agent/quicklisp/dists/quicklisp/software/cffi_0.13.0/" "-o" "/home/testgrid/cl-test-grid/work-dir/agent/test-runs/20140915221737-ccl-1.9-r15756-f96-linux-x86/fasl/ql/dists/quicklisp/software/cl-libusb-20130312-git/libusb-grovel" "/home/testgrid/cl-test-grid/work-dir/agent/test-runs/20140915221737-ccl-1.9-r15756-f96-linux-x86/fasl/ql/dists/quicklisp/software/cl-libusb-20130312-git/libusb-grovel.c" Output was: /home/testgrid/cl-test-grid/work-dir/agent/test-runs/20140915221737-ccl-1.9-r15756-f96-linux-x86/fasl/ql/dists/quicklisp/software/cl-libusb-20130312-git/libusb-grovel.c:6:17: fatal error: usb.h: No such file or directory compilation terminated.
(LOAD cl-libusb FAIL) ffi-grovel, CFFI-GROVEL:GROVEL-ERROR : External process exited with code 1. Command was: "cc" "-m32" "-I/home/testgrid/cl-test-grid/work-dir/agent/quicklisp/dists/quicklisp/software/cffi_0.13.0/" "-o" "/home/testgrid/cl-test-grid/work-dir/agent/test-runs/20140915221737-ccl-1.9-r15756-f96-linux-x86/fasl/ql/dists/quicklisp/software/cl-libusb-20130312-git/libusb-grovel" "/home/testgrid/cl-test-grid/work-dir/agent/test-runs/20140915221737-ccl-1.9-r15756-f96-linux-x86/fasl/ql/dists/quicklisp/software/cl-libusb-20130312-git/libusb-grovel.c" Output was: /home/testgrid/cl-test-grid/work-dir/agent/test-runs/20140915221737-ccl-1.9-r15756-f96-linux-x86/fasl/ql/dists/quicklisp/software/cl-libusb-20130312-git/libusb-grovel.c:6:17: fatal error: usb.h: No such file or directory compilation terminated.
clisp-2.49-unix-i386
(LOAD libusb-ffi FAIL) ffi, ASDF:LOAD-SYSTEM-DEFINITION-ERROR : Error while trying to load definition for system libusb-ffi from pathname /Users/pnathan/cl-test-grid/work-dir/agent/quicklisp/dists/quicklisp/software/cl-libusb-20130312-git/libusb-ffi.asd: CFFI requires CLISP compiled with dynamic FFI support.
(LOAD cl-libusb FAIL) ffi, ASDF:LOAD-SYSTEM-DEFINITION-ERROR : Error while trying to load definition for system libusb-ffi from pathname /Users/pnathan/cl-test-grid/work-dir/agent/quicklisp/dists/quicklisp/software/cl-libusb-20130312-git/libusb-ffi.asd: CFFI requires CLISP compiled with dynamic FFI support.
clisp-2.49-unix-x64
(LOAD libusb-ffi FAIL) SYSTEM::SIMPLE-PACKAGE-ERROR : EXPORT(COMMON-LISP:TIME): #<PACKAGE COMMON-LISP> заблокирован
(LOAD cl-libusb FAIL) SYSTEM::SIMPLE-PACKAGE-ERROR : EXPORT(COMMON-LISP:TIME): #<PACKAGE COMMON-LISP> заблокирован
(LOAD libusb-ffi FAIL) SYSTEM::SIMPLE-PACKAGE-ERROR : EXPORT(COMMON-LISP:TIME): #<PACKAGE COMMON-LISP> заблокирован
(LOAD cl-libusb FAIL) SYSTEM::SIMPLE-PACKAGE-ERROR : EXPORT(COMMON-LISP:TIME): #<PACKAGE COMMON-LISP> заблокирован
clisp-2.49-unix-x86
(LOAD libusb-ffi FAIL) SYSTEM::SIMPLE-PACKAGE-ERROR : EXPORT(COMMON-LISP:TIME): #<PACKAGE COMMON-LISP> is locked
(LOAD cl-libusb FAIL) SYSTEM::SIMPLE-PACKAGE-ERROR : EXPORT(COMMON-LISP:TIME): #<PACKAGE COMMON-LISP> is locked
cmu-snapshot-2013-04__20d_unicode_-linux-x86
(LOAD libusb-ffi FAIL) C::COMPILER-ERROR : (during macroexpansion) Error in function FIND-PARAMETER: Parameter G2:G1 not defined.
(LOAD cl-libusb FAIL) C::COMPILER-ERROR : (during macroexpansion) Error in function FIND-PARAMETER: Parameter G2:G1 not defined.
(LOAD libusb-ffi FAIL) C::COMPILER-ERROR : (during macroexpansion) Error in function FIND-PARAMETER: Parameter G2:G1 not defined.
(LOAD cl-libusb FAIL) C::COMPILER-ERROR : (during macroexpansion) Error in function FIND-PARAMETER: Parameter G2:G1 not defined.
cmu-snapshot-2014-01__20e_unicode_-linux-x86
(LOAD libusb-ffi FAIL) COMMON-LISP:TYPE-ERROR : #
(LOAD cl-libusb FAIL) COMMON-LISP:TYPE-ERROR : #
(LOAD libusb-ffi FAIL) COMMON-LISP:TYPE-ERROR : #
(LOAD cl-libusb FAIL) COMMON-LISP:TYPE-ERROR : #
cmu-snapshot-2014-05-dirty__20e_unicode_-linux-x86
(LOAD libusb-ffi FAIL) COMMON-LISP:TYPE-ERROR : #
(LOAD cl-libusb FAIL) COMMON-LISP:TYPE-ERROR : #
(LOAD libusb-ffi FAIL) COMMON-LISP:TYPE-ERROR : #
(LOAD cl-libusb FAIL) COMMON-LISP:TYPE-ERROR : #
ecl-13.5.1-76a84246-linux-x64-bytecode
(LOAD libusb-ffi FAIL) ASDF/FIND-SYSTEM:LOAD-SYSTEM-DEFINITION-ERROR : Error while trying to load definition for system libusb-ffi from pathname /home/hijarian/systems/cl-test-grid/work-dir/agent/quicklisp/dists/quicklisp/software/cl-libusb-20130312-git/libusb-ffi.asd: The variable C::*CC-FLAGS* is unbound.
(LOAD cl-libusb FAIL) ASDF/FIND-SYSTEM:LOAD-SYSTEM-DEFINITION-ERROR : Error while trying to load definition for system libusb-ffi from pathname /home/hijarian/systems/cl-test-grid/work-dir/agent/quicklisp/dists/quicklisp/software/cl-libusb-20130312-git/libusb-ffi.asd: The variable C::*CC-FLAGS* is unbound.
(LOAD libusb-ffi FAIL) ASDF/FIND-SYSTEM:LOAD-SYSTEM-DEFINITION-ERROR : Error while trying to load definition for system libusb-ffi from pathname /home/hijarian/systems/cl-test-grid/work-dir/agent/quicklisp/dists/quicklisp/software/cl-libusb-20130312-git/libusb-ffi.asd: The variable C::*CC-FLAGS* is unbound.
(LOAD cl-libusb FAIL) ASDF/FIND-SYSTEM:LOAD-SYSTEM-DEFINITION-ERROR : Error while trying to load definition for system libusb-ffi from pathname /home/hijarian/systems/cl-test-grid/work-dir/agent/quicklisp/dists/quicklisp/software/cl-libusb-20130312-git/libusb-ffi.asd: The variable C::*CC-FLAGS* is unbound.
ecl-13.5.1-76a84246-linux-x64-lisp-to-c
(LOAD libusb-ffi FAIL) UIOP/LISP-BUILD:COMPILE-FILE-ERROR : COMPILE-FILE-ERROR while compiling #<cl-source-file "antik" "physical-quantities" "format-output">
(LOAD cl-libusb FAIL) UIOP/LISP-BUILD:COMPILE-FILE-ERROR : COMPILE-FILE-ERROR while compiling #<cl-source-file "antik" "physical-quantities" "format-output">
(LOAD libusb-ffi FAIL) UIOP/LISP-BUILD:COMPILE-FILE-ERROR : COMPILE-FILE-ERROR while compiling #<cl-source-file "antik" "physical-quantities" "format-output">
(LOAD cl-libusb FAIL) UIOP/LISP-BUILD:COMPILE-FILE-ERROR : COMPILE-FILE-ERROR while compiling #<cl-source-file "antik" "physical-quantities" "format-output">
ecl-13.5.1-unknown-linux-i686-bytecode
(LOAD libusb-ffi FAIL) ASDF/FIND-SYSTEM:LOAD-SYSTEM-DEFINITION-ERROR : Error while trying to load definition for system libusb-ffi from pathname /home/testgrid/cl-test-grid/work-dir/agent/quicklisp/dists/quicklisp/software/cl-libusb-20130312-git/libusb-ffi.asd: The variable C::*CC-FLAGS* is unbound.
(LOAD cl-libusb FAIL) ASDF/FIND-SYSTEM:LOAD-SYSTEM-DEFINITION-ERROR : Error while trying to load definition for system libusb-ffi from pathname /home/testgrid/cl-test-grid/work-dir/agent/quicklisp/dists/quicklisp/software/cl-libusb-20130312-git/libusb-ffi.asd: The variable C::*CC-FLAGS* is unbound.
(LOAD libusb-ffi FAIL) ASDF/FIND-SYSTEM:LOAD-SYSTEM-DEFINITION-ERROR : Error while trying to load definition for system libusb-ffi from pathname /home/testgrid/cl-test-grid/work-dir/agent/quicklisp/dists/quicklisp/software/cl-libusb-20130312-git/libusb-ffi.asd: The variable C::*CC-FLAGS* is unbound.
(LOAD cl-libusb FAIL) ASDF/FIND-SYSTEM:LOAD-SYSTEM-DEFINITION-ERROR : Error while trying to load definition for system libusb-ffi from pathname /home/testgrid/cl-test-grid/work-dir/agent/quicklisp/dists/quicklisp/software/cl-libusb-20130312-git/libusb-ffi.asd: The variable C::*CC-FLAGS* is unbound.
sbcl-1.0.58-linux-x86
(LOAD libusb-ffi FAIL) ASDF:LOAD-SYSTEM-DEFINITION-ERROR : Error while trying to load definition for system antik from pathname /home/testgrid/cl-test-grid/work-dir/agent/quicklisp/dists/quicklisp/software/antik-20140211-git/antik.asd: Error while trying to load definition for system static-vectors from pathname /home/testgrid/cl-test-grid/work-dir/agent/quicklisp/dists/quicklisp/software/static-vectors-1.6/static-vectors.asd: READ error during COMPILE-FILE: You need ASDF >= 2.32 to load this system correctly. (in form starting at line: 1, column: 0, file-position: 0)
(LOAD cl-libusb FAIL) ASDF:LOAD-SYSTEM-DEFINITION-ERROR : Error while trying to load definition for system antik from pathname /home/testgrid/cl-test-grid/work-dir/agent/quicklisp/dists/quicklisp/software/antik-20140211-git/antik.asd: Error while trying to load definition for system static-vectors from pathname /home/testgrid/cl-test-grid/work-dir/agent/quicklisp/dists/quicklisp/software/static-vectors-1.6/static-vectors.asd: READ error during COMPILE-FILE: You need ASDF >= 2.32 to load this system correctly. (in form starting at line: 1, column: 0, file-position: 0)
sbcl-1.1.11-linux-x86
(LOAD libusb-ffi FAIL) ffi-grovel, CFFI-GROVEL:GROVEL-ERROR : External process exited with code 1. Command was: "cc" "-m32" "-I/home/testgrid/cl-test-grid/work-dir/agent/quicklisp/dists/quicklisp/software/cffi_0.14.0/" "-o" "/home/testgrid/cl-test-grid/work-dir/agent/test-runs/20141007112213-sbcl-1.1.11-linux-x86/fasl/ql/dists/quicklisp/software/cl-libusb-20130312-git/libusb-grovel" "/home/testgrid/cl-test-grid/work-dir/agent/test-runs/20141007112213-sbcl-1.1.11-linux-x86/fasl/ql/dists/quicklisp/software/cl-libusb-20130312-git/libusb-grovel.c" Output was: /home/testgrid/cl-test-grid/work-dir/agent/test-runs/20141007112213-sbcl-1.1.11-linux-x86/fasl/ql/dists/quicklisp/software/cl-libusb-20130312-git/libusb-grovel.c:6:17: fatal error: usb.h: No such file or directory compilation terminated.
(LOAD cl-libusb FAIL) ffi-grovel, CFFI-GROVEL:GROVEL-ERROR : External process exited with code 1. Command was: "cc" "-m32" "-I/home/testgrid/cl-test-grid/work-dir/agent/quicklisp/dists/quicklisp/software/cffi_0.14.0/" "-o" "/home/testgrid/cl-test-grid/work-dir/agent/test-runs/20141007112213-sbcl-1.1.11-linux-x86/fasl/ql/dists/quicklisp/software/cl-libusb-20130312-git/libusb-grovel" "/home/testgrid/cl-test-grid/work-dir/agent/test-runs/20141007112213-sbcl-1.1.11-linux-x86/fasl/ql/dists/quicklisp/software/cl-libusb-20130312-git/libusb-grovel.c" Output was: /home/testgrid/cl-test-grid/work-dir/agent/test-runs/20141007112213-sbcl-1.1.11-linux-x86/fasl/ql/dists/quicklisp/software/cl-libusb-20130312-git/libusb-grovel.c:6:17: fatal error: usb.h: No such file or directory compilation terminated.
(LOAD libusb-ffi FAIL) ffi-grovel, CFFI-GROVEL:GROVEL-ERROR : External process exited with code 1. Command was: "cc" "-m32" "-I/home/testgrid/cl-test-grid/work-dir/agent/quicklisp/dists/quicklisp/software/cffi_0.13.0/" "-o" "/home/testgrid/cl-test-grid/work-dir/agent/test-runs/20140916033343-sbcl-1.1.11-linux-x86/fasl/ql/dists/quicklisp/software/cl-libusb-20130312-git/libusb-grovel" "/home/testgrid/cl-test-grid/work-dir/agent/test-runs/20140916033343-sbcl-1.1.11-linux-x86/fasl/ql/dists/quicklisp/software/cl-libusb-20130312-git/libusb-grovel.c" Output was: /home/testgrid/cl-test-grid/work-dir/agent/test-runs/20140916033343-sbcl-1.1.11-linux-x86/fasl/ql/dists/quicklisp/software/cl-libusb-20130312-git/libusb-grovel.c:6:17: fatal error: usb.h: No such file or directory compilation terminated.
(LOAD cl-libusb FAIL) ffi-grovel, CFFI-GROVEL:GROVEL-ERROR : External process exited with code 1. Command was: "cc" "-m32" "-I/home/testgrid/cl-test-grid/work-dir/agent/quicklisp/dists/quicklisp/software/cffi_0.13.0/" "-o" "/home/testgrid/cl-test-grid/work-dir/agent/test-runs/20140916033343-sbcl-1.1.11-linux-x86/fasl/ql/dists/quicklisp/software/cl-libusb-20130312-git/libusb-grovel" "/home/testgrid/cl-test-grid/work-dir/agent/test-runs/20140916033343-sbcl-1.1.11-linux-x86/fasl/ql/dists/quicklisp/software/cl-libusb-20130312-git/libusb-grovel.c" Output was: /home/testgrid/cl-test-grid/work-dir/agent/test-runs/20140916033343-sbcl-1.1.11-linux-x86/fasl/ql/dists/quicklisp/software/cl-libusb-20130312-git/libusb-grovel.c:6:17: fatal error: usb.h: No such file or directory compilation terminated.
sbcl-1.1.16-linux-x86
(LOAD libusb-ffi FAIL) ffi-grovel, CFFI-GROVEL:GROVEL-ERROR : External process exited with code 1. Command was: "cc" "-m32" "-I/home/testgrid/cl-test-grid/work-dir/agent/quicklisp/dists/quicklisp/software/cffi_0.14.0/" "-o" "/home/testgrid/cl-test-grid/work-dir/agent/test-runs/20141007030239-sbcl-1.1.16-linux-x86/fasl/ql/dists/quicklisp/software/cl-libusb-20130312-git/libusb-grovel" "/home/testgrid/cl-test-grid/work-dir/agent/test-runs/20141007030239-sbcl-1.1.16-linux-x86/fasl/ql/dists/quicklisp/software/cl-libusb-20130312-git/libusb-grovel.c" Output was: /home/testgrid/cl-test-grid/work-dir/agent/test-runs/20141007030239-sbcl-1.1.16-linux-x86/fasl/ql/dists/quicklisp/software/cl-libusb-20130312-git/libusb-grovel.c:6:17: fatal error: usb.h: No such file or directory compilation terminated.
(LOAD cl-libusb FAIL) ffi-grovel, CFFI-GROVEL:GROVEL-ERROR : External process exited with code 1. Command was: "cc" "-m32" "-I/home/testgrid/cl-test-grid/work-dir/agent/quicklisp/dists/quicklisp/software/cffi_0.14.0/" "-o" "/home/testgrid/cl-test-grid/work-dir/agent/test-runs/20141007030239-sbcl-1.1.16-linux-x86/fasl/ql/dists/quicklisp/software/cl-libusb-20130312-git/libusb-grovel" "/home/testgrid/cl-test-grid/work-dir/agent/test-runs/20141007030239-sbcl-1.1.16-linux-x86/fasl/ql/dists/quicklisp/software/cl-libusb-20130312-git/libusb-grovel.c" Output was: /home/testgrid/cl-test-grid/work-dir/agent/test-runs/20141007030239-sbcl-1.1.16-linux-x86/fasl/ql/dists/quicklisp/software/cl-libusb-20130312-git/libusb-grovel.c:6:17: fatal error: usb.h: No such file or directory compilation terminated.
(LOAD libusb-ffi FAIL) ffi-grovel, CFFI-GROVEL:GROVEL-ERROR : External process exited with code 1. Command was: "cc" "-m32" "-I/home/testgrid/cl-test-grid/work-dir/agent/quicklisp/dists/quicklisp/software/cffi_0.13.0/" "-o" "/home/testgrid/cl-test-grid/work-dir/agent/test-runs/20140915202623-sbcl-1.1.16-linux-x86/fasl/ql/dists/quicklisp/software/cl-libusb-20130312-git/libusb-grovel" "/home/testgrid/cl-test-grid/work-dir/agent/test-runs/20140915202623-sbcl-1.1.16-linux-x86/fasl/ql/dists/quicklisp/software/cl-libusb-20130312-git/libusb-grovel.c" Output was: /home/testgrid/cl-test-grid/work-dir/agent/test-runs/20140915202623-sbcl-1.1.16-linux-x86/fasl/ql/dists/quicklisp/software/cl-libusb-20130312-git/libusb-grovel.c:6:17: fatal error: usb.h: No such file or directory compilation terminated.
(LOAD cl-libusb FAIL) ffi-grovel, CFFI-GROVEL:GROVEL-ERROR : External process exited with code 1. Command was: "cc" "-m32" "-I/home/testgrid/cl-test-grid/work-dir/agent/quicklisp/dists/quicklisp/software/cffi_0.13.0/" "-o" "/home/testgrid/cl-test-grid/work-dir/agent/test-runs/20140915202623-sbcl-1.1.16-linux-x86/fasl/ql/dists/quicklisp/software/cl-libusb-20130312-git/libusb-grovel" "/home/testgrid/cl-test-grid/work-dir/agent/test-runs/20140915202623-sbcl-1.1.16-linux-x86/fasl/ql/dists/quicklisp/software/cl-libusb-20130312-git/libusb-grovel.c" Output was: /home/testgrid/cl-test-grid/work-dir/agent/test-runs/20140915202623-sbcl-1.1.16-linux-x86/fasl/ql/dists/quicklisp/software/cl-libusb-20130312-git/libusb-grovel.c:6:17: fatal error: usb.h: No such file or directory compilation terminated.
sbcl-1.2.3-linux-x64
(LOAD libusb-ffi FAIL) ffi-grovel, CFFI-GROVEL:GROVEL-ERROR : External process exited with code 1. Command was: "cc" "-m64" "-I/home/hijarian/systems/cl-test-grid/work-dir/agent/quicklisp/dists/quicklisp/software/cffi_0.14.0/" "-o" "/home/hijarian/systems/cl-test-grid/work-dir/agent/test-runs/20141007115353-sbcl-1.2.3-linux-x64/fasl/ql/dists/quicklisp/software/cl-libusb-20130312-git/libusb-grovel" "/home/hijarian/systems/cl-test-grid/work-dir/agent/test-runs/20141007115353-sbcl-1.2.3-linux-x64/fasl/ql/dists/quicklisp/software/cl-libusb-20130312-git/libusb-grovel.c" Output was: /home/hijarian/systems/cl-test-grid/work-dir/agent/test-runs/20141007115353-sbcl-1.2.3-linux-x64/fasl/ql/dists/quicklisp/software/cl-libusb-20130312-git/libusb-grovel.c:6:17: fatal error: usb.h: Нет такого файла или каталога compilation terminated.
(LOAD cl-libusb FAIL) ffi-grovel, CFFI-GROVEL:GROVEL-ERROR : External process exited with code 1. Command was: "cc" "-m64" "-I/home/hijarian/systems/cl-test-grid/work-dir/agent/quicklisp/dists/quicklisp/software/cffi_0.14.0/" "-o" "/home/hijarian/systems/cl-test-grid/work-dir/agent/test-runs/20141007115353-sbcl-1.2.3-linux-x64/fasl/ql/dists/quicklisp/software/cl-libusb-20130312-git/libusb-grovel" "/home/hijarian/systems/cl-test-grid/work-dir/agent/test-runs/20141007115353-sbcl-1.2.3-linux-x64/fasl/ql/dists/quicklisp/software/cl-libusb-20130312-git/libusb-grovel.c" Output was: /home/hijarian/systems/cl-test-grid/work-dir/agent/test-runs/20141007115353-sbcl-1.2.3-linux-x64/fasl/ql/dists/quicklisp/software/cl-libusb-20130312-git/libusb-grovel.c:6:17: fatal error: usb.h: Нет такого файла или каталога compilation terminated.
(LOAD libusb-ffi FAIL) ffi-grovel, CFFI-GROVEL:GROVEL-ERROR : External process exited with code 1. Command was: "cc" "-m64" "-I/home/hijarian/systems/cl-test-grid/work-dir/agent/quicklisp/dists/quicklisp/software/cffi_0.13.0/" "-o" "/home/hijarian/systems/cl-test-grid/work-dir/agent/test-runs/20140915163602-sbcl-1.2.3-linux-x64/fasl/ql/dists/quicklisp/software/cl-libusb-20130312-git/libusb-grovel" "/home/hijarian/systems/cl-test-grid/work-dir/agent/test-runs/20140915163602-sbcl-1.2.3-linux-x64/fasl/ql/dists/quicklisp/software/cl-libusb-20130312-git/libusb-grovel.c" Output was: /home/hijarian/systems/cl-test-grid/work-dir/agent/test-runs/20140915163602-sbcl-1.2.3-linux-x64/fasl/ql/dists/quicklisp/software/cl-libusb-20130312-git/libusb-grovel.c:6:17: fatal error: usb.h: Нет такого файла или каталога compilation terminated.
(LOAD cl-libusb FAIL) ffi-grovel, CFFI-GROVEL:GROVEL-ERROR : External process exited with code 1. Command was: "cc" "-m64" "-I/home/hijarian/systems/cl-test-grid/work-dir/agent/quicklisp/dists/quicklisp/software/cffi_0.13.0/" "-o" "/home/hijarian/systems/cl-test-grid/work-dir/agent/test-runs/20140915163602-sbcl-1.2.3-linux-x64/fasl/ql/dists/quicklisp/software/cl-libusb-20130312-git/libusb-grovel" "/home/hijarian/systems/cl-test-grid/work-dir/agent/test-runs/20140915163602-sbcl-1.2.3-linux-x64/fasl/ql/dists/quicklisp/software/cl-libusb-20130312-git/libusb-grovel.c" Output was: /home/hijarian/systems/cl-test-grid/work-dir/agent/test-runs/20140915163602-sbcl-1.2.3-linux-x64/fasl/ql/dists/quicklisp/software/cl-libusb-20130312-git/libusb-grovel.c:6:17: fatal error: usb.h: Нет такого файла или каталога compilation terminated.

Breakdown by testcases: for every failed testcase the lisp implmentations it fails on

The library does not have a testsuite adapter for CL Test Grid.

To reports overview

Generated at: 2014-10-13 09:08:46 GMT.